Customer Name,Policy Number,Agent,Effective Date,Termination Date,Deductible,Coverage Limit,Optional Coverage,Plan Title,Express Mail Amount,Gross,
Mitter Pavnish,691802208818,Visitors Insurance,03/09/2024,07/14/2024,$ 2500,$ 500000,No,Overseas Visitors Insurance Plan C,$ 0,$ 775.68,
Rani Meeta,691802208819,Visitors Insurance,03/09/2024,07/14/2024,$ 2500,$ 500000,No,Overseas Visitors Insurance Plan C,$ 0,$ 677.12,
Khandare Seema,691802210108,Visitors Insurance,03/13/2024,06/14/2024,$ 1000,$ 500000,No,Overseas Visitors Insurance Plan C,$ 0,$ 466.24,
Khandare Jayant,691802210107,Visitors Insurance,03/13/2024,06/14/2024,$ 1000,$ 500000,No,Overseas Visitors Insurance Plan C,$ 0,$ 566.82,
Total,,,,,,,,,,$ 2485.86,
Tadi Ramatulasi,691802203303,Visitors Insurance,03/17/2024,05/07/2024,$ 500,$ 100000,No,Overseas Visitors Insurance Plan B,$ 0,$ 270.4,
Robichaud Emilie,691802210307,Visitors Insurance,03/14/2024,04/14/2024,$ 250,$ 250000,No,Overseas Visitors Insurance Plan B,$ 0,$ 109.12,
Total,,,,,,,,,,$ 379.52,
Bokka Satya Sudha,691802210012,Visitors Insurance,03/12/2024,06/04/2024,$ 1000,$ 100000,No,Overseas Visitors Insurance Plan A,$ 0,$ 315.35,
Bokka Andhra Prakasarao,691802210011,Visitors Insurance,03/12/2024,06/04/2024,$ 1000,$ 100000,No,Overseas Visitors Insurance Plan A,$ 0,$ 721.65,
Gupta Ankit,691802210210,Visitors Insurance,03/12/2024,04/30/2024,$ 1000,$ 50000,No,Overseas Visitors Insurance Plan A,$ 0,$ 106,
Gupta Roopa,691802210211,Visitors Insurance,03/12/2024,04/30/2024,$ 1000,$ 50000,No,Overseas Visitors Insurance Plan A,$ 0,$ 68.5,
Gupta Aarit,691802210212,Visitors Insurance,03/12/2024,04/30/2024,$ 1000,$ 50000,No,Overseas Visitors Insurance Plan A,$ 0,$ 35,
Gupta Aarvi,691802210213,Visitors Insurance,03/12/2024,04/30/2024,$ 1000,$ 50000,No,Overseas Visitors Insurance Plan A,$ 0,$ 35,
Singh Balbir,691802210273,Visitors Insurance,03/15/2024,04/23/2024,$ 100,$ 25000,No,Overseas Visitors Insurance Plan A,$ 0,$ 305.6,
Total,,,,,,,,,,$ 1587.1,
Pegler Anne,691802208691,Visitors Insurance,03/01/2024,08/27/2024,$ 500,$ 110000,No,OverseasCare Visitors Insurance Plan,$ 0,$ 448.2,
Purandare Manjusha,691802197919,Visitors Insurance,03/10/2024,06/15/2024,$ 500,$ 110000,No,OverseasCare Visitors Insurance Plan,$ 0,$ 244.02,
Koivisto VeliAntti,691802210114,Visitors Insurance,03/11/2024,03/07/2025,$ 500,$ 60000,No,OverseasCare Visitors Insurance Plan,$ 0,$ 593.68,
Muthukrishnan Rajeswari,691802199497,Visitors Insurance,03/19/2024,05/18/2024,$ 250,$ 60000,No,OverseasCare Visitors Insurance Plan,$ 0,$ 145.79,
Narasimhan Muthukrishnan,691802199496,Visitors Insurance,03/19/2024,05/18/2024,$ 250,$ 60000,No,OverseasCare Visitors Insurance Plan,$ 0,$ 145.79,
Phatale Sulabha,691802210806,Visitors Insurance,03/21/2024,09/20/2024,$ 250,$ 110000,No,OverseasCare Visitors Insurance Plan,$ 0,$ 507.84,
Desai Ramkrishna,691802205550,Visitors Insurance,03/24/2024,06/23/2024,$ 500,$ 55000,No,OverseasCare Visitors Insurance Plan,$ 0,$ 746.12,
SAREDDY PADMA,691802210868,Visitors Insurance,03/22/2024,09/13/2024,$ 500,$ 60000,No,OverseasCare Visitors Insurance Plan,$ 0,$ 237.6,
Basavapattana Subbaraya Nagamani,691802211062,Visitors Insurance,03/24/2024,06/23/2024,$ 500,$ 60000,No,OverseasCare Visitors Insurance Plan,$ 0,$ 198.72,
Pokrant Curtis,691802211189,Visitors Insurance,03/25/2024,03/29/2024,$ 500,$ 110000,No,OverseasCare Visitors Insurance Plan,$ 0,$ 8.7,
Kasliwal Santosh,691802211524,Visitors Insurance,03/27/2024,05/31/2024,$ 500,$ 55000,No,OverseasCare Visitors Insurance Plan,$ 0,$ 446.16,
Total,,,,,,,,,,$ 3722.62,
Grand Total,,,,,,,,,,$ 8175.1