Customer Name,Policy Number,Agent,Effective Date,Termination Date,Deductible,Coverage Limit,Optional Coverage,Plan Title,Express Mail Amount,Gross,
Mathur Gopal,691802208535,Visitors Insurance,02/14/2024,04/29/2024,$ 250,$ 50000,No,Overseas Visitors Insurance Plan B,$ 0,$ 710.6,
Mathur Aruna,691802208536,Visitors Insurance,02/14/2024,04/29/2024,$ 250,$ 50000,No,Overseas Visitors Insurance Plan B,$ 0,$ 524.4,
SHAH BINA DUSHYANT,691802208022,Visitors Insurance,02/03/2024,07/13/2024,$ 2500,$ 100000,No,Overseas Visitors Insurance Plan B,$ 0,$ 1506.6,
Total,,,,,,,,,,$ 2741.6,
BISWAS NANDITA,691802207988,Visitors Insurance,02/05/2024,05/04/2024,$ 1000,$ 100000,No,Overseas Visitors Insurance Plan A,$ 0,$ 764.1,
Mundeir Charanjit ,691802208339,Visitors Insurance,02/08/2024,07/26/2024,$ 1000,$ 50000,No,Overseas Visitors Insurance Plan A,$ 0,$ 1038.7,
Kaur Balroop ,691802208340,Visitors Insurance,02/08/2024,07/26/2024,$ 1000,$ 50000,No,Overseas Visitors Insurance Plan A,$ 0,$ 649.4,
Chabane Fatma Zohra,691802208348,Visitors Insurance,02/09/2024,03/08/2024,$ 1000,$ 250000,No,Overseas Visitors Insurance Plan A,$ 0,$ 142.1,
Mhatre Chitralekha,691802208439,Visitors Insurance,02/15/2024,08/13/2024,$ 2500,$ 250000,No,Overseas Visitors Insurance Plan A,$ 0,$ 1203.65,
THAMSHETTY ROHIT,691802208800,Visitors Insurance,02/20/2024,04/03/2024,$ 250,$ 100000,No,Overseas Visitors Insurance Plan A,$ 0,$ 91.52,
PABBATHI HARIKA,691802208801,Visitors Insurance,02/20/2024,04/03/2024,$ 250,$ 100000,No,Overseas Visitors Insurance Plan A,$ 0,$ 68.64,
Total,,,,,,,,,,$ 3958.11,
Kakadiya Shobhanaben,691802207923,Visitors Insurance,02/01/2024,04/30/2024,$ 500,$ 110000,No,OverseasCare Visitors Insurance Plan,$ 0,$ 156.6,
McLean Richard,691802206388,Visitors Insurance,02/02/2024,04/09/2024,$ 500,$ 110000,No,OverseasCare Visitors Insurance Plan,$ 0,$ 169.32,
Karvelson Johanne,691802206389,Visitors Insurance,02/02/2024,04/09/2024,$ 500,$ 110000,No,OverseasCare Visitors Insurance Plan,$ 0,$ 169.32,
Ramachandran Nair Rajamma,691802199798,Visitors Insurance,02/01/2024,04/30/2024,$ 250,$ 110000,No,OverseasCare Visitors Insurance Plan,$ 0,$ 248.4,
Kakadiya Sureshbhai,691802207922,Visitors Insurance,02/01/2024,04/30/2024,$ 500,$ 110000,No,OverseasCare Visitors Insurance Plan,$ 0,$ 156.6,
Smith Rhody,691802207902,Ron Byrd,02/01/2024,03/31/2024,$ 500,$ 110000,No,OverseasCare Visitors Insurance Plan,$ 0,$ 149.4,
Smith Susan,691802207903,Ron Byrd,02/01/2024,03/31/2024,$ 500,$ 110000,No,OverseasCare Visitors Insurance Plan,$ 0,$ 149.4,
Michaud Valerie,691802207919,Visitors Insurance,02/01/2024,03/31/2024,$ 500,$ 60000,No,OverseasCare Visitors Insurance Plan,$ 0,$ 49.8,
Mennon Balamani,691802208003,Visitors Insurance,02/03/2024,07/04/2024,$ 250,$ 60000,No,OverseasCare Visitors Insurance Plan,$ 0,$ 365.67,
Joshi Bansikumar,691802208321,Visitors Insurance,02/09/2024,05/01/2024,$ 500,$ 110000,No,OverseasCare Visitors Insurance Plan,$ 0,$ 175.13,
Joshi Daxa,691802208322,Visitors Insurance,02/09/2024,05/01/2024,$ 500,$ 110000,No,OverseasCare Visitors Insurance Plan,$ 0,$ 144.42,
Bociort Alex Florian,691802208324,Visitors Insurance,02/19/2024,05/31/2024,$ 100,$ 60000,No,OverseasCare Visitors Insurance Plan,$ 0,$ 94.76,
Steeves Cora,691802205000,Visitors Insurance,02/14/2024,03/24/2024,$ 500,$ 110000,No,OverseasCare Visitors Insurance Plan,$ 0,$ 99.6,
Padmanabhan Raghuram,691802209071,Visitors Insurance,02/23/2024,07/23/2024,$ 100,$ 55000,No,OverseasCare Visitors Insurance Plan,$ 0,$ 1197.76,
Total,,,,,,,,,,$ 3326.18,
Grand Total,,,,,,,,,,$ 10025.89