Customer Name,Policy Number,Agent,Effective Date,Termination Date,Deductible,Coverage Limit,Optional Coverage,Plan Title,Express Mail Amount,Gross,
Puri Neeru,691802182045,Ramesh or Bharati Patel,02/22/2023,03/22/2023,$ 1000,$ 100000,No,Overseas Visitors Insurance Plan B,$ 0,$ 308.56,
Camps Egea Rafaela,691802178951,Ramesh or Bharati Patel,02/18/2023,03/17/2023,$ 2500,$ 100000,No,Overseas Visitors Insurance Plan B,$ 0,$ 260.4,
Kapadia Hamir,691802182008,Ramesh or Bharati Patel,02/23/2023,05/23/2023,$ 1000,$ 100000,No,Overseas Visitors Insurance Plan B,$ 0,$ 957.6,
Kapadia Rajeshwari,691802182009,Ramesh or Bharati Patel,02/23/2023,05/23/2023,$ 1000,$ 100000,No,Overseas Visitors Insurance Plan B,$ 0,$ 957.6,
Puri Vijay,691802182044,Ramesh or Bharati Patel,02/22/2023,03/22/2023,$ 1000,$ 100000,No,Overseas Visitors Insurance Plan B,$ 0,$ 308.56,
Total,,,,,,,,,,$ 2792.72,
Bardasu Elena Daniela,691802180421,Ramesh or Bharati Patel,02/23/2023,04/04/2023,$ 1000,$ 100000,No,Overseas Visitors Insurance Plan A,$ 0,$ 152.11,
Arora Veena,691802181230,Ramesh or Bharati Patel,02/01/2023,07/29/2023,$ 500,$ 50000,No,Overseas Visitors Insurance Plan A,$ 0,$ 1220.78,
Arora Yashpal,691802181229,Ramesh or Bharati Patel,02/01/2023,07/29/2023,$ 500,$ 50000,No,Overseas Visitors Insurance Plan A,$ 0,$ 1220.78,
Ahir Kuldip Raj,691802179057,Ramesh or Bharati Patel,02/01/2023,02/04/2023,$ 500,$ 50000,No,Overseas Visitors Insurance Plan A,$ 0,$ 24.5,
Ahir Nishi,691802179058,Ramesh or Bharati Patel,02/01/2023,02/04/2023,$ 500,$ 50000,No,Overseas Visitors Insurance Plan A,$ 0,$ 34.1,
Rao Nagarathna,691802181372,Ramesh or Bharati Patel,02/16/2023,05/24/2023,$ 2500,$ 100000,No,Overseas Visitors Insurance Plan A,$ 0,$ 734.02,
Gaddam Sridhar Reddy,691802181904,Ramesh or Bharati Patel,02/15/2023,04/21/2023,$ 1000,$ 50000,No,Overseas Visitors Insurance Plan A,$ 0,$ 403.26,
Arbabian Homayoun,691802182306,Ramesh or Bharati Patel,02/23/2023,03/15/2023,$ 2500,$ 100000,No,Overseas Visitors Insurance Plan A,$ 0,$ 85.68,
McLean Richard,691802180197,Ramesh or Bharati Patel,02/15/2023,04/05/2023,$ 1000,$ 50000,No,Overseas Visitors Insurance Plan A,$ 0,$ 219,
Karvelson Johanne,691802180198,Ramesh or Bharati Patel,02/20/2023,04/01/2023,$ 1000,$ 50000,No,Overseas Visitors Insurance Plan A,$ 0,$ 250.51,
Total,,,,,,,,,,$ 4344.74,
Gartley Jane ,691802181476,Visitors Insurance,02/08/2023,02/27/2023,$ 500,$ 60000,No,OverseasCare Visitors Insurance Plan,$ 0,$ 43.2,
Macaulay Daniel,691802181564,Visitors Insurance,02/09/2023,02/27/2023,$ 100,$ 110000,No,OverseasCare Visitors Insurance Plan,$ 0,$ 29.64,
Macaulay Danielle,691802181565,Visitors Insurance,02/09/2023,02/27/2023,$ 100,$ 110000,No,OverseasCare Visitors Insurance Plan,$ 0,$ 29.64,
Irani Dolly,691802181839,Visitors Insurance,02/15/2023,02/28/2023,$ 250,$ 55000,No,OverseasCare Visitors Insurance Plan,$ 0,$ 100.24,
fernandez albor batallan xiana,691802182091,Visitors Insurance,02/19/2023,03/02/2023,$ 100,$ 60000,No,OverseasCare Visitors Insurance Plan,$ 0,$ 14.04,
Total,,,,,,,,,,$ 216.76,
Grand Total,,,,,,,,,,$ 7354.22