Customer Name,Policy Number,Agent,Effective Date,Termination Date,Deductible,Coverage Limit,Optional Coverage,Plan Title,Express Mail Amount,Gross,
Kakani Sujani,691802180997,Ramesh or Bharati Patel,01/26/2023,07/22/2023,$ 500,$ 100000,No,Overseas Visitors Insurance Plan C,$ 0,$ 808.12,
BONDALAKUNTA SARADA,691802180174,Ramesh or Bharati Patel,01/12/2023,07/01/2023,$ 1000,$ 50000,No,Overseas Visitors Insurance Plan C,$ 0,$ 774.63,
Kakani  Venu,691802180996,Ramesh or Bharati Patel,01/26/2023,07/22/2023,$ 500,$ 100000,No,Overseas Visitors Insurance Plan C,$ 0,$ 1016.38,
Total,,,,,,,,,,$ 2599.13,
Mladenovic Sonja,691802180534,Ramesh or Bharati Patel,01/17/2023,04/15/2023,$ 250,$ 25000,No,Overseas Visitors Insurance Plan B,$ 0,$ 489.5,
Camps Egea Rafaela,691802178951,Ramesh or Bharati Patel,01/15/2023,02/17/2023,$ 2500,$ 100000,No,Overseas Visitors Insurance Plan B,$ 0,$ 316.2,
Total,,,,,,,,,,$ 805.7,
Ylanan Linda,691802179795,Ramesh or Bharati Patel,01/01/2023,01/31/2023,$ 2500,$ 100000,No,Overseas Visitors Insurance Plan A,$ 0,$ 232.19,
Huq Lubna,691802180147,Ramesh or Bharati Patel,01/09/2023,06/10/2023,$ 2500,$ 100000,No,Overseas Visitors Insurance Plan A,$ 0,$ 624.24,
Keniya Pushpa Laxmichand,691802176126,Ramesh or Bharati Patel,01/16/2023,03/15/2023,$ 1000,$ 100000,No,Overseas Visitors Insurance Plan A,$ 0,$ 500.91,
Keniya Laxmichand,691802176125,Ramesh or Bharati Patel,01/16/2023,03/15/2023,$ 1000,$ 100000,No,Overseas Visitors Insurance Plan A,$ 0,$ 500.91,
HANDA MEERA,691802180264,Ramesh or Bharati Patel,01/10/2023,01/31/2023,$ 500,$ 100000,No,Overseas Visitors Insurance Plan A,$ 0,$ 101.6,
Malathesh Geetha,691802180199,Ramesh or Bharati Patel,01/09/2023,03/30/2023,$ 1000,$ 25000,No,Overseas Visitors Insurance Plan A,$ 0,$ 451.17,
Guttula Chandrasekhara Rao,691802180034,Ramesh or Bharati Patel,01/05/2023,02/28/2023,$ 500,$ 50000,No,Overseas Visitors Insurance Plan A,$ 0,$ 375.1,
Guttula Chilakamma,691802180035,Ramesh or Bharati Patel,01/05/2023,02/28/2023,$ 500,$ 50000,No,Overseas Visitors Insurance Plan A,$ 0,$ 269.5,
Masic Nada,691802180404,Ramesh or Bharati Patel,01/14/2023,04/13/2023,$ 2500,$ 100000,No,Overseas Visitors Insurance Plan A,$ 0,$ 674.1,
Vangala Veera Reddy,691802180992,Ramesh or Bharati Patel,01/26/2023,06/30/2023,$ 1000,$ 100000,No,Overseas Visitors Insurance Plan A,$ 0,$ 1324.44,
Padilla  Rebeca ,691802181066,Ramesh or Bharati Patel,01/27/2023,02/02/2023,$ 100,$ 100000,No,Overseas Visitors Insurance Plan A,$ 0,$ 22.82,
Bedi Paramjit,691802179143,Ramesh or Bharati Patel,01/19/2023,03/01/2023,$ 2500,$ 50000,No,Overseas Visitors Insurance Plan A,$ 0,$ 222.6,
Total,,,,,,,,,,$ 5299.58,
Ahmadian Hamed,691802180473,Visitors Insurance,01/20/2023,02/03/2023,$ 250,$ 110000,No,OverseasCare Visitors Insurance Plan,$ 0,$ 17.85,
Kang Himmat,691802180369,Visitors Insurance,01/16/2023,02/16/2023,$ 500,$ 55000,No,OverseasCare Visitors Insurance Plan,$ 0,$ 206.4,
Karan Ram,691802180391,Visitors Insurance,01/12/2023,01/31/2023,$ 500,$ 55000,No,OverseasCare Visitors Insurance Plan,$ 0,$ 129,
Jagani Jayant,691802180946,Visitors Insurance,01/27/2023,07/06/2023,$ 500,$ 110000,No,OverseasCare Visitors Insurance Plan,$ 0,$ 400.89,
GAJARAO NEERAJA,691802180349,Visitors Insurance,01/19/2023,05/09/2023,$ 500,$ 110000,No,OverseasCare Visitors Insurance Plan,$ 0,$ 276.39,
KOUL ASHOK KUMAR,691802180962,Visitors Insurance,01/26/2023,02/10/2023,$ 250,$ 110000,No,OverseasCare Visitors Insurance Plan,$ 0,$ 44.16,
KOUL PHOOLA KUMARI,691802180963,Visitors Insurance,01/26/2023,02/10/2023,$ 250,$ 110000,No,OverseasCare Visitors Insurance Plan,$ 0,$ 44.16,
Dsouza Ashley,691802179890,Visitors Insurance,01/04/2023,06/30/2023,$ 500,$ 60000,No,OverseasCare Visitors Insurance Plan,$ 0,$ 133.5,
Jaja Gordon,691802179949,Visitors Insurance,01/09/2023,04/08/2023,$ 250,$ 110000,No,OverseasCare Visitors Insurance Plan,$ 0,$ 126.9,
Padiyar Nirmala,691802179784,Visitors Insurance,01/01/2023,03/31/2023,$ 500,$ 55000,No,OverseasCare Visitors Insurance Plan,$ 0,$ 580.5,
Kojima Moe,691802179232,Visitors Insurance,01/01/2023,06/01/2023,$ 500,$ 60000,No,OverseasCare Visitors Insurance Plan,$ 0,$ 114,
GAJARAO SITARAMASWAMY,691802180348,Visitors Insurance,01/19/2023,05/09/2023,$ 500,$ 110000,No,OverseasCare Visitors Insurance Plan,$ 0,$ 276.39,
Jagani Bhavini,691802180947,Visitors Insurance,01/27/2023,07/06/2023,$ 500,$ 110000,No,OverseasCare Visitors Insurance Plan,$ 0,$ 400.89,
Total,,,,,,,,,,$ 2751.03,
Grand Total,,,,,,,,,,$ 11455.44