Customer Name,Policy Number,Agent,Effective Date,Termination Date,Deductible,Coverage Limit,Optional Coverage,Plan Title,Express Mail Amount,Gross,
Arora Yashpal,691802181229,Ramesh or Bharati Patel,02/01/2023,07/29/2023,$ 500,$ 50000,No,Overseas Visitors Insurance Plan A,$ 0,$ 1220.78,
Ahir Kuldip Raj,691802179057,Ramesh or Bharati Patel,02/01/2023,02/04/2023,$ 500,$ 50000,No,Overseas Visitors Insurance Plan A,$ 0,$ 24.5,
Ahir Nishi,691802179058,Ramesh or Bharati Patel,02/01/2023,02/04/2023,$ 500,$ 50000,No,Overseas Visitors Insurance Plan A,$ 0,$ 34.1,
Rao Nagarathna,691802181372,Ramesh or Bharati Patel,02/16/2023,05/24/2023,$ 2500,$ 100000,No,Overseas Visitors Insurance Plan A,$ 0,$ 734.02,
McLean Richard,691802180197,Ramesh or Bharati Patel,02/15/2023,04/05/2023,$ 1000,$ 50000,No,Overseas Visitors Insurance Plan A,$ 0,$ 219,
Karvelson Johanne,691802180198,Ramesh or Bharati Patel,02/20/2023,04/01/2023,$ 1000,$ 50000,No,Overseas Visitors Insurance Plan A,$ 0,$ 250.51,
Bardasu Elena Daniela,691802180421,Ramesh or Bharati Patel,02/23/2023,04/04/2023,$ 1000,$ 100000,No,Overseas Visitors Insurance Plan A,$ 0,$ 152.11,
Arora Veena,691802181230,Ramesh or Bharati Patel,02/01/2023,07/29/2023,$ 500,$ 50000,No,Overseas Visitors Insurance Plan A,$ 0,$ 1220.78,
Total,,,,,,,,,,$ 3855.8,
Gartley Jane ,691802181476,Visitors Insurance,02/08/2023,02/27/2023,$ 500,$ 60000,No,OverseasCare Visitors Insurance Plan,$ 0,$ 43.2,
Total,,,,,,,,,,$ 43.2,
Grand Total,,,,,,,,,,$ 3899