Customer Name,Policy Number,Agent,Effective Date,Termination Date,Deductible,Coverage Limit,Optional Coverage,Plan Title,Express Mail Amount,Gross,
Mahajan Pundlik,691802121531,Ramesh or Bharati Patel,10/03/2022,12/28/2022,$ 250,50000,No,Overseas Visitors Insurance Plan B,$ 0,$ 767.34,
Singh Vilas Chandra,691802175775,ARS Default,10/12/2022,02/12/2023,$ 100,250000,No,Overseas Visitors Insurance Plan B,$ 0,$ 1566.12,
Thakur Geeta Singh,691802175776,ARS Default,10/12/2022,02/12/2023,$ 100,250000,No,Overseas Visitors Insurance Plan B,$ 0,$ 1008.12,
Adiga Balakrishna Thammaiah,691802175802,Ramesh or Bharati Patel,10/08/2022,01/14/2023,$ 1000,100000,No,Overseas Visitors Insurance Plan B,$ 0,$ 1053.36,
Das Manorama,691802176309,Ramesh or Bharati Patel,10/18/2022,12/02/2022,$ 100,50000,No,Overseas Visitors Insurance Plan B,$ 0,$ 472.88,
Total,,,,,,,,,,$ 4867.82,
Mathers Robert,691802009033,Ramesh or Bharati Patel,10/01/2022,10/16/2022,$ 250,250000,No,Overseas Visitors Insurance Plan A,$ 0,$ 143.04,
Keniya    Laxmichand ,691802111345,Ramesh or Bharati Patel,10/01/2022,10/15/2022,$ 1000,100000,No,Overseas Visitors Insurance Plan A,$ 0,$ 120.15,
Keniya   Pushpa ,691802111346,Ramesh or Bharati Patel,10/01/2022,10/15/2022,$ 1000,100000,No,Overseas Visitors Insurance Plan A,$ 0,$ 120.15,
Ylanan Linda,691802121646,Ramesh or Bharati Patel,10/01/2022,10/31/2022,$ 2500,100000,No,Overseas Visitors Insurance Plan A,$ 0,$ 219.17,
Velappan Varadaraajulu,691802175580,Ramesh or Bharati Patel,10/04/2022,01/28/2023,$ 1000,100000,No,Overseas Visitors Insurance Plan A,$ 0,$ 937.17,
Varadarajulu Padmini,691802175581,Ramesh or Bharati Patel,10/04/2022,01/28/2023,$ 1000,100000,No,Overseas Visitors Insurance Plan A,$ 0,$ 515.97,
Kebede Tulu Almaz,691802175888,Ramesh or Bharati Patel,10/10/2022,12/31/2022,$ 500,100000,No,Overseas Visitors Insurance Plan A,$ 0,$ 154.38,
Cainglet Stella Mae,691802176029,Ramesh or Bharati Patel,10/15/2022,01/15/2023,$ 2500,25000,No,Overseas Visitors Insurance Plan A,$ 0,$ 158.1,
Keniya Laxmichand,691802176125,Ramesh or Bharati Patel,10/15/2022,01/15/2023,$ 1000,100000,No,Overseas Visitors Insurance Plan A,$ 0,$ 789.57,
Kanya Pushpa Laxmichand,691802176126,Ramesh or Bharati Patel,10/15/2022,01/15/2023,$ 1000,100000,No,Overseas Visitors Insurance Plan A,$ 0,$ 789.57,
PANCHINENI KESHAVA RAO,691802176798,Ramesh or Bharati Patel,10/29/2022,03/14/2023,$ 1000,100000,No,Overseas Visitors Insurance Plan A,$ 0,$ 639.79,
PANCHINENI SUJATHA,691802176799,Ramesh or Bharati Patel,10/29/2022,03/14/2023,$ 1000,100000,No,Overseas Visitors Insurance Plan A,$ 0,$ 508.27,
Total,,,,,,,,,,$ 5095.33,
Tyagi Virendra Kumar,691802175405,Visitors Insurance,10/05/2022,01/14/2023,$ 250,60000,No,OverseasCare Visitors Insurance Plan,$ 0,$ 174.42,
TYAGI SUSHILA,691802175406,Visitors Insurance,10/05/2022,01/14/2023,$ 250,60000,No,OverseasCare Visitors Insurance Plan,$ 0,$ 174.42,
Shah Kokila,691802111397,Visitors Insurance,10/05/2022,04/02/2023,$ 500,55000,No,OverseasCare Visitors Insurance Plan,$ 0,$ 1094.4,
Jayagopal Mallika,691802175890,Visitors Insurance,10/10/2022,12/30/2022,$ 100,60000,No,OverseasCare Visitors Insurance Plan,$ 0,$ 135.3,
Dave Yogeshkumar,691802175903,Visitors Insurance,10/11/2022,03/17/2023,$ 250,60000,No,OverseasCare Visitors Insurance Plan,$ 0,$ 377.62,
Dave Daxa ,691802175904,Visitors Insurance,10/11/2022,03/17/2023,$ 250,60000,No,OverseasCare Visitors Insurance Plan,$ 0,$ 287.56,
Rattan Rameshwar,691802176516,Visitors Insurance,10/23/2022,11/30/2022,$ 500,55000,No,OverseasCare Visitors Insurance Plan,$ 0,$ 263.64,
Tatavarty Viswanadha Rao,691802176597,Visitors Insurance,10/24/2022,11/23/2022,$ 500,110000,No,OverseasCare Visitors Insurance Plan,$ 0,$ 65.41,
Tatavarty Subba Lakshmi,691802176598,Visitors Insurance,10/24/2022,11/23/2022,$ 500,110000,No,OverseasCare Visitors Insurance Plan,$ 0,$ 65.41,
Total,,,,,,,,,,$ 2638.18,
Grand Total,,,,,,,,,,$ 12601.33