Customer Name,Policy Number,Agent,Effective Date,Termination Date,Deductible,Coverage Limit,Optional Coverage,Plan Title,Express Mail Amount,Gross,
VELICHETY HANUMANTHARAO,691802000095,Ramesh or Bharati Patel,08/17/2022,11/02/2022,$ 1000,500000,No,Overseas Visitors Insurance Plan C,$ 0,$ 509.34,
VELICHETY SUBHADRADEVI,691802000096,Ramesh or Bharati Patel,08/17/2022,11/02/2022,$ 1000,500000,No,Overseas Visitors Insurance Plan C,$ 0,$ 509.34,
Satyanarayana  Parvathy,691802008926,Ramesh or Bharati Patel,08/28/2022,09/16/2022,$ 250,100000,No,Overseas Visitors Insurance Plan C,$ 0,$ 62,
Total,,,,,,,,,,$ 1080.68,
Das Manorama,691802003504,Ramesh or Bharati Patel,08/02/2022,09/01/2022,$ 100,50000,No,Overseas Visitors Insurance Plan B,$ 0,$ 300.7,
Gautam Satish,691802009186,Ramesh or Bharati Patel,08/31/2022,10/27/2022,$ 500,250000,No,Overseas Visitors Insurance Plan B,$ 0,$ 489.52,
gautam Manju,691802009187,Ramesh or Bharati Patel,08/31/2022,10/27/2022,$ 500,250000,No,Overseas Visitors Insurance Plan B,$ 0,$ 489.52,
Camps Egea Rafaela,691802003262,Ramesh or Bharati Patel,08/24/2022,09/16/2022,$ 1000,100000,No,Overseas Visitors Insurance Plan B,$ 0,$ 240.96,
Total,,,,,,,,,,$ 1520.7,
Kaluvala Balraj,691802003517,Ramesh or Bharati Patel,08/04/2022,12/10/2022,$ 2500,100000,No,Overseas Visitors Insurance Plan A,$ 0,$ 912.03,
Akuthota Rajya laxmi,691802003518,Ramesh or Bharati Patel,08/04/2022,12/10/2022,$ 2500,100000,No,Overseas Visitors Insurance Plan A,$ 0,$ 605.01,
Kang Sangkyoo,691802008524,Ramesh or Bharati Patel,08/13/2022,08/20/2022,$ 100,25000,No,Overseas Visitors Insurance Plan A,$ 0,$ 20.72,
Shim Jeongeun,691802008525,Ramesh or Bharati Patel,08/13/2022,08/20/2022,$ 100,25000,No,Overseas Visitors Insurance Plan A,$ 0,$ 20.72,
Kang Chei,691802008526,Ramesh or Bharati Patel,08/13/2022,08/20/2022,$ 100,25000,No,Overseas Visitors Insurance Plan A,$ 0,$ 6.48,
BARDIA MANJU,691802008632,Ramesh or Bharati Patel,08/15/2022,09/15/2022,$ 500,250000,No,Overseas Visitors Insurance Plan A,$ 0,$ 212.8,
Mohan Indu,691802008702,Ramesh or Bharati Patel,08/25/2022,10/18/2022,$ 2500,100000,No,Overseas Visitors Insurance Plan A,$ 0,$ 388.85,
Leauber Thomas ,691802008748,Ramesh or Bharati Patel,08/27/2022,09/02/2022,$ 100,250000,No,Overseas Visitors Insurance Plan A,$ 0,$ 19.39,
Mugavero Ragen,691802008749,Ramesh or Bharati Patel,08/27/2022,09/02/2022,$ 100,250000,No,Overseas Visitors Insurance Plan A,$ 0,$ 28.56,
Satyanarayana Rajeshwari,691802122009,Ramesh or Bharati Patel,08/24/2022,09/29/2022,$ 1000,50000,No,Overseas Visitors Insurance Plan A,$ 0,$ 213.12,
Total,,,,,,,,,,$ 2427.68,
Joda Kahim,691802003407,Visitors Insurance,08/25/2022,09/25/2022,$ 500,60000,No,OverseasCare Visitors Insurance Plan,$ 0,$ 49.28,
Alshabar Ameera,691802003409,Visitors Insurance,08/25/2022,09/25/2022,$ 500,60000,No,OverseasCare Visitors Insurance Plan,$ 0,$ 49.28,
CHAKRABORTY JAYANTA,691802003469,Visitors Insurance,08/03/2022,12/05/2022,$ 250,110000,No,OverseasCare Visitors Insurance Plan,$ 0,$ 325,
CHAKRABORTY SHANTA,691802003470,Visitors Insurance,08/03/2022,12/05/2022,$ 250,110000,No,OverseasCare Visitors Insurance Plan,$ 0,$ 325,
PEARL ESTHER BERTHA,691802004751,Visitors Insurance,08/07/2022,10/26/2022,$ 500,60000,No,OverseasCare Visitors Insurance Plan,$ 0,$ 164.43,
Gajulapalli Thirupal Reddy,691802004777,Visitors Insurance,08/09/2022,12/08/2022,$ 500,110000,No,OverseasCare Visitors Insurance Plan,$ 0,$ 285.48,
Gajulapalli Kasamma,691802004778,Visitors Insurance,08/09/2022,12/08/2022,$ 500,110000,No,OverseasCare Visitors Insurance Plan,$ 0,$ 241.56,
Yennam Vinodha,691802008486,Visitors Insurance,08/09/2022,12/17/2022,$ 500,110000,No,OverseasCare Visitors Insurance Plan,$ 0,$ 259.38,
Khamluecha Wanphen,691802008502,Visitors Insurance,08/11/2022,08/18/2022,$ 100,60000,No,OverseasCare Visitors Insurance Plan,$ 0,$ 8.8,
Zhou He,691802008509,Visitors Insurance,08/10/2022,11/01/2022,$ 500,60000,No,OverseasCare Visitors Insurance Plan,$ 0,$ 58.8,
Kolchev Dragomir,691802008621,Visitors Insurance,08/22/2022,11/27/2022,$ 500,110000,No,OverseasCare Visitors Insurance Plan,$ 0,$ 229.32,
Parvanova Kolcheva Temenuzhka,691802008622,Visitors Insurance,08/22/2022,11/27/2022,$ 500,110000,No,OverseasCare Visitors Insurance Plan,$ 0,$ 229.32,
Spasova Tatyana,691802008626,Visitors Insurance,08/22/2022,03/26/2023,$ 500,110000,No,OverseasCare Visitors Insurance Plan,$ 0,$ 507.78,
Hennig Caroline,691802008785,Visitors Insurance,08/22/2022,12/30/2022,$ 500,110000,No,OverseasCare Visitors Insurance Plan,$ 0,$ 214.84,
Wan Chau Ming Chu,691802008987,Visitors Insurance,08/28/2022,09/05/2022,$ 500,55000,No,OverseasCare Visitors Insurance Plan,$ 0,$ 54.72,
Wan Tong Yiu,691802008986,Visitors Insurance,08/28/2022,09/05/2022,$ 100,60000,No,OverseasCare Visitors Insurance Plan,$ 0,$ 22.32,
Total,,,,,,,,,,$ 3025.31,
Grand Total,,,,,,,,,,$ 8054.37