Customer Name,Policy Number,Agent,Effective Date,Termination Date,Deductible,Coverage Limit,Optional Coverage,Plan Title,Express Mail Amount,Gross,
Patel Tarulata ,691802172671,Ramesh or Bharati Patel,07/06/2022,10/02/2022,$ 500,100000,No,Overseas Visitors Insurance Plan C,$ 0,$ 479.71,
Patel Ashoke,691802172670,Ramesh or Bharati Patel,07/06/2022,10/02/2022,$ 500,100000,No,Overseas Visitors Insurance Plan C,$ 0,$ 574.94,
Chakraborty Mitra,691802122308,Ramesh or Bharati Patel,07/04/2022,08/23/2022,$ 1000,100000,No,Overseas Visitors Insurance Plan C,$ 25,$ 440.13,
Total,,,,,,,,,,$ 1494.78,
Gopalan Chandra,691802003189,Ramesh or Bharati Patel,07/23/2022,11/19/2022,$ 1000,100000,No,Overseas Visitors Insurance Plan B,$ 0,$ 1204.8,
Camps Egea Rafaela,691802003262,Ramesh or Bharati Patel,07/23/2022,08/23/2022,$ 1000,100000,No,Overseas Visitors Insurance Plan B,$ 0,$ 321.28,
GUPTA RASHMI,691802122336,Ramesh or Bharati Patel,07/03/2022,08/08/2022,$ 1000,50000,No,Overseas Visitors Insurance Plan B,$ 0,$ 261.22,
Total,,,,,,,,,,$ 1787.3,
Guttula Chandrasekhara Rao,691802003278,Ramesh or Bharati Patel,07/22/2022,11/30/2022,$ 500,50000,No,Overseas Visitors Insurance Plan A,$ 0,$ 848.76,
Guttula Chilakamma,691802003279,Ramesh or Bharati Patel,07/22/2022,11/30/2022,$ 500,50000,No,Overseas Visitors Insurance Plan A,$ 0,$ 609.84,
Ravi Sivaji,691802000101,Ramesh or Bharati Patel,07/08/2022,11/30/2022,$ 1000,100000,No,Overseas Visitors Insurance Plan A,$ 0,$ 1169.46,
SANDHU RANJIT,691802122391,Ramesh or Bharati Patel,07/04/2022,09/19/2022,$ 1000,50000,No,Overseas Visitors Insurance Plan A,$ 0,$ 449.28,
Valliappan  Chellappan Ramanathan,691802000002,Ramesh or Bharati Patel,07/11/2022,01/06/2023,$ 1000,100000,No,Overseas Visitors Insurance Plan A,$ 25,$ 957.6,
Kizhakke Thazathuveettil Ramakrishnan,691802003029,Ramesh or Bharati Patel,07/15/2022,10/30/2022,$ 1000,50000,No,Overseas Visitors Insurance Plan A,$ 0,$ 622.08,
Rogers Rebecca ,691802003087,Ramesh or Bharati Patel,07/16/2022,09/01/2022,$ 2500,50000,No,Overseas Visitors Insurance Plan A,$ 0,$ 41.76,
Ylanan Linda,691802121646,Ramesh or Bharati Patel,07/18/2022,08/31/2022,$ 2500,100000,No,Overseas Visitors Insurance Plan A,$ 0,$ 318.15,
Ramanathan Umayal,691802000003,Ramesh or Bharati Patel,07/11/2022,01/06/2023,$ 1000,100000,No,Overseas Visitors Insurance Plan A,$ 0,$ 793.8,
Total,,,,,,,,,,$ 5810.73,
kosuri kanaka durga,691802003023,Visitors Insurance,07/17/2022,10/15/2022,$ 500,60000,No,OverseasCare Visitors Insurance Plan,$ 0,$ 140.14,
Bellana Venkata Rao,691802003176,Visitors Insurance,07/18/2022,09/12/2022,$ 500,60000,No,OverseasCare Visitors Insurance Plan,$ 0,$ 72.39,
Alugubilli Navaneetha Lakshmi,691802003177,Visitors Insurance,07/18/2022,09/12/2022,$ 500,60000,No,OverseasCare Visitors Insurance Plan,$ 0,$ 72.39,
Kandasamy Paulraj,691802110185,Visitors Insurance,07/02/2022,09/11/2022,$ 250,60000,No,OverseasCare Visitors Insurance Plan,$ 0,$ 162,
Hazari Anil,691802003356,Visitors Insurance,07/27/2022,12/26/2022,$ 100,60000,No,OverseasCare Visitors Insurance Plan,$ 0,$ 379.44,
Paulraj Pireethi,691802110186,Visitors Insurance,07/02/2022,09/11/2022,$ 250,60000,No,OverseasCare Visitors Insurance Plan,$ 0,$ 123.12,
Hazari Sarla,691802003357,Visitors Insurance,07/27/2022,12/26/2022,$ 100,60000,No,OverseasCare Visitors Insurance Plan,$ 0,$ 379.44,
PATEL JAYANTILAL,691802121556,Visitors Insurance,07/05/2022,11/18/2022,$ 500,110000,No,OverseasCare Visitors Insurance Plan,$ 0,$ 271.26,
PATEL NARMADABAHEN,691802121557,Visitors Insurance,07/05/2022,11/18/2022,$ 500,110000,No,OverseasCare Visitors Insurance Plan,$ 0,$ 271.26,
Gulzar Perveen,691802003435,Visitors Insurance,07/30/2022,09/01/2022,$ 100,60000,No,OverseasCare Visitors Insurance Plan,$ 0,$ 84.32,
BYRRAJU VENKATA SUBBA RAO,691802122283,Visitors Insurance,07/01/2022,11/13/2022,$ 500,110000,No,OverseasCare Visitors Insurance Plan,$ 0,$ 318.24,
BYRRAJU RUKMINI,691802122284,Visitors Insurance,07/01/2022,11/13/2022,$ 500,110000,No,OverseasCare Visitors Insurance Plan,$ 0,$ 269.28,
Ghanchi Dawoodbhai,691802122298,Visitors Insurance,07/01/2022,07/15/2022,$ 250,55000,No,OverseasCare Visitors Insurance Plan,$ 0,$ 127.5,
scher keile,691802122297,Visitors Insurance,07/03/2022,01/01/2023,$ 250,110000,No,OverseasCare Visitors Insurance Plan,$ 0,$ 183,
Parohinog Filomena,691802122327,Visitors Insurance,07/04/2022,08/02/2022,$ 500,60000,No,OverseasCare Visitors Insurance Plan,$ 0,$ 60.9,
Subramanya Doraiswamy,691802000028,Visitors Insurance,07/11/2022,01/11/2023,$ 250,55000,No,OverseasCare Visitors Insurance Plan,$ 0,$ 1572.5,
PRASAD RAO THIMANACHERLA JAGANATH,691802000033,Visitors Insurance,07/06/2022,12/08/2022,$ 500,60000,No,OverseasCare Visitors Insurance Plan,$ 0,$ 316.68,
Bettadapur Venkatasubbaiah Kumarswamy,691802000034,Visitors Insurance,07/06/2022,09/21/2022,$ 250,110000,No,OverseasCare Visitors Insurance Plan,$ 0,$ 202.8,
Rawal Anju,691802003007,Visitors Insurance,07/16/2022,09/17/2022,$ 500,110000,No,OverseasCare Visitors Insurance Plan,$ 0,$ 126.72,
pallaprolu sivasankara rao,691802003022,Visitors Insurance,07/17/2022,10/15/2022,$ 500,60000,No,OverseasCare Visitors Insurance Plan,$ 0,$ 140.14,
Total,,,,,,,,,,$ 5273.52,
Grand Total,,,,,,,,,,$ 14366.33