Customer Name,Policy Number,Agent,Effective Date,Termination Date,Deductible,Coverage Limit,Optional Coverage,Plan Title,Express Mail Amount,Gross,
Hagerty Ian,691802110378,Ramesh or Bharati Patel,03/20/2022,05/20/2022,$ 250,100000,No,Overseas Visitors Insurance Plan C,$ 0,$ 444.54,
Naidu Neeta,691802110302,Ramesh or Bharati Patel,03/08/2022,06/30/2022,$ 1000,50000,No,Overseas Visitors Insurance Plan C,$ 0,$ 698.05,
Total,,,,,,,,,,$ 1142.59,
KAUR MANJIT,691802110703,Ramesh or Bharati Patel,03/14/2022,05/31/2022,$ 1000,100000,No,Overseas Visitors Insurance Plan B,$ 0,$ 793.16,
Shah Hansa,691802110401,Ramesh or Bharati Patel,03/13/2022,09/13/2022,$ 500,50000,No,Overseas Visitors Insurance Plan B,$ 0,$ 1468.9,
Bhatia Manjula Gangaram ,691802110221,Ramesh or Bharati Patel,03/10/2022,03/29/2022,$ 1000,100000,No,Overseas Visitors Insurance Plan B,$ 0,$ 200.8,
Ara Hussan,691802107624,Ramesh or Bharati Patel,03/12/2022,03/31/2022,$ 500,100000,No,Overseas Visitors Insurance Plan B,$ 0,$ 150,
Bhatia Manjula Gangaram ,691802110221,Ramesh or Bharati Patel,03/30/2022,04/07/2022,$ 1000,100000,No,Overseas Visitors Insurance Plan B,$ 0,$ 90.36,
Total,,,,,,,,,,$ 2703.22,
Gulati Suresh,691802110487,Ramesh or Bharati Patel,03/04/2022,05/09/2022,$ 1000,100000,No,Overseas Visitors Insurance Plan A,$ 0,$ 536.67,
Gulati Renu,691802110488,Ramesh or Bharati Patel,03/04/2022,05/09/2022,$ 1000,100000,No,Overseas Visitors Insurance Plan A,$ 0,$ 356.44,
LNU Durgawati,691802110421,Ramesh or Bharati Patel,03/02/2022,05/31/2022,$ 1000,25000,No,Overseas Visitors Insurance Plan A,$ 0,$ 298.48,
Arora Prem Parkash,691802110377,Ramesh or Bharati Patel,03/01/2022,04/30/2022,$ 2500,50000,No,Overseas Visitors Insurance Plan A,$ 0,$ 190.32,
Somarouthu Sreemannarayana,691802110319,Ramesh or Bharati Patel,03/05/2022,08/29/2022,$ 1000,100000,No,Overseas Visitors Insurance Plan A,$ 0,$ 1425.78,
CHAPALA VENKATA TULASIDEVI,691802110320,Ramesh or Bharati Patel,03/05/2022,08/29/2022,$ 1000,100000,No,Overseas Visitors Insurance Plan A,$ 0,$ 784.98,
Kakani Venu,691802110139,Ramesh or Bharati Patel,03/01/2022,07/02/2022,$ 500,100000,No,Overseas Visitors Insurance Plan A,$ 0,$ 621.24,
Kakani Sujani,691802110140,Ramesh or Bharati Patel,03/01/2022,07/02/2022,$ 500,100000,No,Overseas Visitors Insurance Plan A,$ 0,$ 486.08,
Sobhan Nasrin,691802110555,Ramesh or Bharati Patel,03/07/2022,06/07/2022,$ 2500,100000,No,Overseas Visitors Insurance Plan A,$ 25,$ 657.51,
SKARIA RAJAN,691802110579,Ramesh or Bharati Patel,03/23/2022,09/14/2022,$ 1000,100000,No,Overseas Visitors Insurance Plan A,$ 0,$ 1409.76,
KANNAN SANTHA,691802110580,Ramesh or Bharati Patel,03/23/2022,09/14/2022,$ 1000,100000,No,Overseas Visitors Insurance Plan A,$ 0,$ 1409.76,
Shtauber Tzvi,691802110781,Ramesh or Bharati Patel,03/16/2022,03/21/2022,$ 100,100000,No,Overseas Visitors Insurance Plan A,$ 0,$ 12.9,
Kaur Amarjit,691802110816,Ramesh or Bharati Patel,03/16/2022,04/25/2022,$ 1000,100000,No,Overseas Visitors Insurance Plan A,$ 0,$ 328.41,
Chirikova Elena,691802110044,Ramesh or Bharati Patel,03/22/2022,04/21/2022,$ 250,100000,No,Overseas Visitors Insurance Plan A,$ 0,$ 206.15,
Upalanchiwar Anushri,691802110929,Ramesh or Bharati Patel,03/25/2022,09/17/2022,$ 1000,250000,No,Overseas Visitors Insurance Plan A,$ 0,$ 1265.55,
Total,,,,,,,,,,$ 9990.03,
Lad Gopalbhai,691802110610,Visitors Insurance,03/14/2022,05/13/2022,$ 500,60000,No,OverseasCare Visitors Insurance Plan,$ 0,$ 123.83,
Lad Urmilaben,691802110611,Visitors Insurance,03/14/2022,05/13/2022,$ 500,60000,No,OverseasCare Visitors Insurance Plan,$ 0,$ 93.94,
 Muthusamyraja  Dharmalingam,691802110777,Visitors Insurance,03/15/2022,09/30/2022,$ 250,55000,No,OverseasCare Visitors Insurance Plan,$ 0,$ 1350,
Sadhale Prabhakar ,691802111185,Visitors Insurance,03/29/2022,09/14/2022,$ 250,60000,No,OverseasCare Visitors Insurance Plan,$ 0,$ 382.5,
Sadhale Anuradha,691802111186,Visitors Insurance,03/29/2022,09/14/2022,$ 250,60000,No,OverseasCare Visitors Insurance Plan,$ 0,$ 290.7,
Desai Sushama,691802110882,Visitors Insurance,03/19/2022,09/14/2022,$ 500,55000,No,OverseasCare Visitors Insurance Plan,$ 0,$ 1094.4,
katta satyanaraya Murthy,691802111028,Visitors Insurance,03/24/2022,09/16/2022,$ 100,60000,No,OverseasCare Visitors Insurance Plan,$ 0,$ 332.76,
katta savitri,691802111029,Visitors Insurance,03/24/2022,09/16/2022,$ 100,60000,No,OverseasCare Visitors Insurance Plan,$ 0,$ 332.76,
Rattan Rameshwar,691802108110,Visitors Insurance,03/28/2022,04/20/2022,$ 500,55000,No,OverseasCare Visitors Insurance Plan,$ 0,$ 153.12,
Total,,,,,,,,,,$ 4154.01,
Grand Total,,,,,,,,,,$ 17989.85