Customer Name,Policy Number,Agent,Effective Date,Termination Date,Deductible,Coverage Limit,Optional Coverage,Plan Title,Express Mail Amount,Gross,
Naidu Neeta,691802110302,Ramesh or Bharati Patel,03/08/2022,06/30/2022,$ 1000,50000,No,Overseas Visitors Insurance Plan C,$ 0,$ 698.05,
Total,,,,,,,,,,$ 698.05,
Shah Hansa,691802110401,Ramesh or Bharati Patel,03/13/2022,09/13/2022,$ 500,50000,No,Overseas Visitors Insurance Plan B,$ 0,$ 1468.9,
Bhatia Manjula Gangaram ,691802110221,Ramesh or Bharati Patel,03/10/2022,03/29/2022,$ 1000,100000,No,Overseas Visitors Insurance Plan B,$ 0,$ 200.8,
Ara Hussan,691802107624,Ramesh or Bharati Patel,03/12/2022,03/31/2022,$ 500,100000,No,Overseas Visitors Insurance Plan B,$ 0,$ 150,
KAUR MANJIT,691802110703,Ramesh or Bharati Patel,03/14/2022,05/31/2022,$ 1000,100000,No,Overseas Visitors Insurance Plan B,$ 0,$ 793.16,
Total,,,,,,,,,,$ 2612.86,
Somarouthu Sreemannarayana,691802110319,Ramesh or Bharati Patel,03/05/2022,08/29/2022,$ 1000,100000,No,Overseas Visitors Insurance Plan A,$ 0,$ 1425.78,
CHAPALA VENKATA TULASIDEVI,691802110320,Ramesh or Bharati Patel,03/05/2022,08/29/2022,$ 1000,100000,No,Overseas Visitors Insurance Plan A,$ 0,$ 784.98,
Kakani Venu,691802110139,Ramesh or Bharati Patel,03/01/2022,07/02/2022,$ 500,100000,No,Overseas Visitors Insurance Plan A,$ 0,$ 621.24,
Kakani Sujani,691802110140,Ramesh or Bharati Patel,03/01/2022,07/02/2022,$ 500,100000,No,Overseas Visitors Insurance Plan A,$ 0,$ 486.08,
Sobhan Nasrin,691802110555,Ramesh or Bharati Patel,03/07/2022,06/07/2022,$ 2500,100000,No,Overseas Visitors Insurance Plan A,$ 25,$ 657.51,
Gulati Suresh,691802110487,Ramesh or Bharati Patel,03/04/2022,05/09/2022,$ 1000,100000,No,Overseas Visitors Insurance Plan A,$ 0,$ 536.67,
Gulati Renu,691802110488,Ramesh or Bharati Patel,03/04/2022,05/09/2022,$ 1000,100000,No,Overseas Visitors Insurance Plan A,$ 0,$ 356.44,
LNU Durgawati,691802110421,Ramesh or Bharati Patel,03/02/2022,05/31/2022,$ 1000,25000,No,Overseas Visitors Insurance Plan A,$ 0,$ 298.48,
Arora Prem Parkash,691802110377,Ramesh or Bharati Patel,03/01/2022,04/30/2022,$ 2500,50000,No,Overseas Visitors Insurance Plan A,$ 0,$ 190.32,
Total,,,,,,,,,,$ 5357.5,
Lad Gopalbhai,691802110610,Visitors Insurance,03/14/2022,05/13/2022,$ 500,60000,No,OverseasCare Visitors Insurance Plan,$ 0,$ 123.83,
Lad Urmilaben,691802110611,Visitors Insurance,03/14/2022,05/13/2022,$ 500,60000,No,OverseasCare Visitors Insurance Plan,$ 0,$ 93.94,
Total,,,,,,,,,,$ 217.77,
Grand Total,,,,,,,,,,$ 8886.18