Client Name,Identification #,Eff. Date,Term Date,Plan,Payment,Payment Mode,Express Mail Amount,Premium,Agent #1,Comm %,Agent #1 Pmt.,Agent #2,Comm %,Agent #2 Pmt.,Agent #3,Comm %,Agent #3 Pmt.,Agent #4,Comm %,Agent #4 Pmt.,Claims Acc Fund,BMS Comm,ARS Comm,Comm Date,Merchant Fees,Surplus,
Beacon Series,
Marincich Chrystel Massiel Elizabeth,691802207882,01/31/2024,02/09/2024,Beacon International,Visa,Single,$ 0,$ 18,Insubuy  Inc,37,$ 6.66,,,,,,,,,,$ 4.28,$ 0.45,$ 2.34,,,,
Inata Yoshio,691802207607,01/31/2024,02/04/2024,Beacon International,Visa,Single,$ 0,$ 4.9,Insubuy  Inc,37,$ 1.81,,,,,,,,,,$ 1.16,$ 0.12,$ 0.64,,,,
Cui Wenwei,691802203705,01/31/2024,02/09/2024,Beacon International,Visa,Single,$ 0,$ 10,Insubuy  Inc,37,$ 3.7,,,,,,,,,,$ 2.38,$ 0.25,$ 1.3,,,,
Sam Bonal,691802207878,01/31/2024,02/07/2024,Beacon International,Visa,Single,$ 0,$ 7.39,Insubuy  Inc,37,$ 2.73,,,,,,,,,,$ 1.76,$ 0.18,$ 0.96,,,,
Cheung Kwok Tung,691802206449,01/31/2024,02/11/2024,Beacon International,MasterCard,Single,$ 0,$ 89.7,Sisi Huang,20,$ 17.94,Insubuy  Inc,-2,$ -1.79,,,,,,,$ 21.3,$ 2.24,$ 28.7,,,,
SOMU LALITH KIRAN,691802207478,01/31/2024,02/29/2024,Beacon International,AMEX,Single,$ 0,$ 35.63,Insubuy  Inc,37,$ 13.18,,,,,,,,,,$ 8.46,$ 0.89,$ 4.63,,,,
Rabideau Tanya,691802207652,01/31/2024,03/12/2024,Beacon International,Visa,Single,$ 0,$ 72.58,ARS Default,50,$ 36.29,,,,,,,,,,$ 17.24,$ 1.81,$ 0,,,,
Li Linxuan,691802207832,01/31/2024,02/08/2024,Beacon International,Visa,Single,$ 0,$ 8.1,Insubuy  Inc,37,$ 3,,,,,,,,,,$ 1.92,$ 0.2,$ 1.05,,,,
Sainte Rose Georges Robert James,691802207201,01/31/2024,07/31/2024,Beacon International,Visa,Single,$ 0,$ 122.98,Insubuy  Inc,37,$ 45.5,,,,,,,,,,$ 29.21,$ 3.07,$ 15.99,,,,
Muriel Roxanna,691802207926,01/31/2024,02/05/2024,Beacon International,MasterCard,Single,$ 0,$ 5.4,Insubuy  Inc,37,$ 2,,,,,,,,,,$ 1.28,$ 0.14,$ 0.7,,,,
Kim Kibeom,691802202570,01/31/2024,04/26/2024,Beacon International,Cheque,Single,$ 0,$ 125.28,Insubuy  Inc,37,$ 46.35,,,,,,,,,,$ 29.75,$ 3.13,$ 16.29,,,,
Talati Shuchi Shailesh,691802205964,01/31/2024,02/04/2024,Beacon International,Visa,Single,$ 0,$ 5.94,Insubuy  Inc,37,$ 2.2,,,,,,,,,,$ 1.41,$ 0.15,$ 0.77,,,,
Usona Medel Manza,691802205950,01/31/2024,02/29/2024,Beacon International,MasterCard,Single,$ 0,$ 31.5,Insubuy  Inc,37,$ 11.66,,,,,,,,,,$ 7.48,$ 0.79,$ 4.1,,,,
Han Yuzhu,691802206487,01/31/2024,02/28/2024,Beacon International,Visa,Single,$ 0,$ 29,Insubuy  Inc,37,$ 10.73,,,,,,,,,,$ 6.89,$ 0.73,$ 3.77,,,,
Jones Leonard McGregor,691802207897,01/31/2024,03/05/2024,Beacon International,Visa,Single,$ 0,$ 180.25,Insubuy  Inc,37,$ 66.69,,,,,,,,,,$ 42.81,$ 4.51,$ 23.43,,,,
Arguelles Arias Manuel Antonio,691802207850,01/31/2024,02/04/2024,Beacon International,MasterCard,Single,$ 0,$ 7,Insubuy  Inc,37,$ 2.59,,,,,,,,,,$ 1.66,$ 0.18,$ 0.91,,,,
Louis Jean Rio,691802207423,01/31/2024,03/04/2024,Beacon International,Amex,Single,$ 0,$ 37.4,Ann Martine Paul,15,$ 5.61,Pierre Armand Gation,-30,$ -11.22,,,,,,,$ 8.88,$ 0.94,$ 24.31,,,,
Nuche Aguilera Ana Constanza,691802207609,01/31/2024,02/03/2024,Beacon International,Visa,Single,$ 0,$ 6.25,ARS Default,50,$ 3.13,,,,,,,,,,$ 1.48,$ 0.16,$ 0,,,,
Aaron Leslie,691802207665,01/31/2024,02/22/2024,Beacon International,Visa,Single,$ 0,$ 27.37,ARS Default,50,$ 13.69,,,,,,,,,,$ 6.5,$ 0.68,$ 0,,,,
Parrotta Emile Amadee,691802207834,01/31/2024,03/01/2024,Beacon International,Visa,Single,$ 0,$ 43.4,Insubuy  Inc,37,$ 16.06,,,,,,,,,,$ 10.31,$ 1.09,$ 5.64,,,,
Jahaj Kei,691802206263,01/30/2024,02/05/2024,Beacon International,AMEX,Single,$ 0,$ 7,Insubuy  Inc,37,$ 2.59,,,,,,,,,,$ 1.66,$ 0.18,$ 0.91,,,,
Umeki Koichi,691802207602,01/30/2024,02/03/2024,Beacon International,Visa,Single,$ 0,$ 7,Insubuy  Inc,37,$ 2.59,,,,,,,,,,$ 1.66,$ 0.18,$ 0.91,,,,
Umeki Manami,691802207603,01/30/2024,02/03/2024,Beacon International,Visa,Single,$ 0,$ 4.2,Insubuy  Inc,37,$ 1.55,,,,,,,,,,$ 1,$ 0.11,$ 0.55,,,,
Sone Aye Pyae,691802207398,01/30/2024,04/29/2024,Beacon International,Visa,Single,$ 0,$ 91,Wut Yee,20,$ 18.2,Insubuy  Inc,-2,$ -1.82,,,,,,,$ 21.61,$ 2.28,$ 29.12,,,,
Okeke Chukwuma Pascal,691802207029,01/30/2024,02/04/2024,Beacon International,MasterCard,Single,$ 0,$ 7.13,Insubuy  Inc,37,$ 2.64,,,,,,,,,,$ 1.69,$ 0.18,$ 0.93,,,,
Thwe Su Su,691802207401,01/30/2024,02/13/2024,Beacon International,Visa,Single,$ 0,$ 15,Wut Yee,20,$ 3,Insubuy  Inc,-2,$ -0.3,,,,,,,$ 3.56,$ 0.38,$ 4.8,,,,
Findlay Michelle Mary,691802205756,01/30/2024,02/09/2024,Beacon International,Visa,Single,$ 0,$ 29.04,Insubuy  Inc,37,$ 10.74,,,,,,,,,,$ 6.9,$ 0.73,$ 3.78,,,,
Mueller Rudy,691802205003,01/30/2024,06/29/2024,Beacon International,MasterCard,Single,$ 0,$ 674.58,ARS Default,50,$ 337.29,,,,,,,,,,$ 160.21,$ 16.86,$ 0,,,,
AMIN RASHMI MAHENDRABHAI,691802207789,01/30/2024,02/20/2024,Beacon International,Visa,Single,$ 0,$ 141.63,Insubuy  Inc,37,$ 52.4,,,,,,,,,,$ 33.64,$ 3.54,$ 18.41,,,,
PALAKKA VALAPIL KASIM MOHAMED SHIHAB,691802207773,01/30/2024,02/04/2024,Beacon International,MasterCard,Single,$ 0,$ 13.65,Insubuy  Inc,37,$ 5.05,,,,,,,,,,$ 3.24,$ 0.34,$ 1.77,,,,
Baboun Ralph Joseph Altagrace,691802207367,01/29/2024,02/04/2024,Beacon International,Amex,Single,$ 0,$ 22.02,Ann Martine Paul,15,$ 3.3,Pierre Armand Gation,-30,$ -6.61,,,,,,,$ 5.23,$ 0.55,$ 14.31,,,,
Rojas Olguin Claudia,691802207630,01/29/2024,02/02/2024,Beacon International,Visa,Single,$ 0,$ 17.88,ARS Default,50,$ 8.94,,,,,,,,,,$ 4.25,$ 0.45,$ 0,,,,
Smith Aharon P,691802207612,01/29/2024,02/04/2024,Beacon International,MasterCard,Single,$ 0,$ 28.79,Prime Insurance Agency,15,$ 4.32,,,,,,,,,,$ 6.84,$ 0.72,$ 10.08,,,,
Bjella Anders Timan,691802207740,01/29/2024,04/30/2024,Beacon International,Visa,Single,$ 0,$ 169.26,Insubuy  Inc,37,$ 62.63,,,,,,,,,,$ 40.2,$ 4.23,$ 22,,,,
Durvasula Karthik,691802206506,01/29/2024,02/03/2024,Beacon International,MasterCard,Single,$ 0,$ 15.3,Insubuy  Inc,37,$ 5.66,,,,,,,,,,$ 3.63,$ 0.38,$ 1.99,,,,
Flores Kimberly Mae Santos,691802207727,01/29/2024,02/02/2024,Beacon International,MasterCard,Single,$ 0,$ 5.25,Insubuy  Inc,37,$ 1.94,,,,,,,,,,$ 1.25,$ 0.13,$ 0.68,,,,
Aguilar Osorio Cristian,691802207720,01/29/2024,02/05/2024,Beacon International,Visa,Single,$ 0,$ 4.61,Insubuy  Inc,37,$ 1.71,,,,,,,,,,$ 1.09,$ 0.12,$ 0.6,,,,
De Grate IV Oliver,691802207683,01/29/2024,02/12/2024,Beacon International,MasterCard,Single,$ 0,$ 16.8,Insubuy  Inc,37,$ 6.22,,,,,,,,,,$ 3.99,$ 0.42,$ 2.18,,,,
Ruiz Argueta Alfredo,691802207435,01/29/2024,02/02/2024,Beacon International,Visa,Single,$ 0,$ 10.31,ARS Default,50,$ 5.16,,,,,,,,,,$ 2.45,$ 0.26,$ 0,,,,
Annicchiarico Anna,691802207681,01/29/2024,02/12/2024,Beacon International,MasterCard,Single,$ 0,$ 16.8,Insubuy  Inc,37,$ 6.22,,,,,,,,,,$ 3.99,$ 0.42,$ 2.18,,,,
CHEN YANQING,691802204281,01/29/2024,02/11/2024,Beacon International,MasterCard,Single,$ 0,$ 47.25,Insubuy  Inc,37,$ 17.48,,,,,,,,,,$ 11.22,$ 1.18,$ 6.14,,,,
PEREZ CASTILLO FATIMA YURITZI,691802206592,01/29/2024,02/23/2024,Beacon International,Visa,Single,$ 0,$ 20.8,Insubuy  Inc,37,$ 7.7,,,,,,,,,,$ 4.94,$ 0.52,$ 2.7,,,,
Enshassi Mohammed A A,691802205410,01/28/2024,02/01/2024,Beacon International,Visa,Single,$ 0,$ 3.6,Insubuy  Inc,37,$ 1.33,,,,,,,,,,$ 0.86,$ 0.09,$ 0.47,,,,
Alansari Lubna Jasem,691802205423,01/28/2024,02/10/2024,Beacon International,Visa,Single,$ 0,$ 16.63,Insubuy  Inc,37,$ 6.15,,,,,,,,,,$ 3.95,$ 0.42,$ 2.16,,,,
KUO BENLI,691802206486,01/28/2024,02/02/2024,Beacon International,Visa,Single,$ 0,$ 4.32,Insubuy  Inc,37,$ 1.6,,,,,,,,,,$ 1.03,$ 0.11,$ 0.56,,,,
Venegas Quilinan Mayra Rebeca,691802207744,01/28/2024,02/01/2024,Beacon International,MasterCard,Single,$ 0,$ 7,Insubuy  Inc,37,$ 2.59,,,,,,,,,,$ 1.66,$ 0.18,$ 0.91,,,,
Gustave Frederic Manuel,691802207737,01/28/2024,02/07/2024,Beacon International,Visa,Single,$ 0,$ 28.05,Insubuy  Inc,37,$ 10.38,,,,,,,,,,$ 6.66,$ 0.7,$ 3.65,,,,
Yeung Ian Marvin Lee,691802207726,01/28/2024,02/01/2024,Beacon International,MasterCard,Single,$ 0,$ 5.25,Insubuy  Inc,37,$ 1.94,,,,,,,,,,$ 1.25,$ 0.13,$ 0.68,,,,
Tickner Martyn Neville,691802207707,01/28/2024,02/14/2024,Beacon International,Visa,Single,$ 0,$ 92.7,Insubuy  Inc,37,$ 34.3,,,,,,,,,,$ 22.02,$ 2.32,$ 12.05,,,,
Pimple Pratik Manohar,691802206418,01/28/2024,02/08/2024,Beacon International,MasterCard,Single,$ 0,$ 16.8,Insubuy  Inc,37,$ 6.22,,,,,,,,,,$ 3.99,$ 0.42,$ 2.18,,,,
Pradeep Ronak,691802200436,01/28/2024,04/26/2024,Beacon International,Visa,Single,$ 0,$ 90,Insubuy  Inc,37,$ 33.3,,,,,,,,,,$ 21.38,$ 2.25,$ 11.7,,,,
Polakoski Robert,691802205276,01/28/2024,02/01/2024,Beacon International,Cheque,Single,$ 0,$ 26.6,Insubuy  Inc,37,$ 9.84,,,,,,,,,,$ 6.32,$ 0.67,$ 3.46,,,,
Paez Diaz Luis Alejandro,691802207657,01/28/2024,02/17/2024,Beacon International,Visa,Single,$ 0,$ 21,Insubuy  Inc,37,$ 7.77,,,,,,,,,,$ 4.99,$ 0.53,$ 2.73,,,,
TANAKA AKACHI CINDY,691802207631,01/28/2024,02/03/2024,Beacon International,Visa,Single,$ 0,$ 25.03,ARS Default,50,$ 12.52,,,,,,,,,,$ 5.94,$ 0.63,$ 0,,,,
Cunningham Eileen Marie,691802206542,01/28/2024,02/11/2024,Beacon International,Visa,Single,$ 0,$ 79.5,Insubuy  Inc,37,$ 29.42,,,,,,,,,,$ 18.88,$ 1.99,$ 10.34,,,,
Underwood Jon Michael,691802207522,01/28/2024,02/04/2024,Beacon International,MasterCard,Single,$ 0,$ 42.4,Insubuy  Inc,37,$ 15.69,,,,,,,,,,$ 10.07,$ 1.06,$ 5.51,,,,
Moreno Cabrera Andrea Alejandra,691802207434,01/28/2024,02/02/2024,Beacon International,Visa,Single,$ 0,$ 7.5,ARS Default,50,$ 3.75,,,,,,,,,,$ 1.78,$ 0.19,$ 0,,,,
Arjona Garduno Claudia Cynthia,691802207433,01/28/2024,02/02/2024,Beacon International,Visa,Single,$ 0,$ 7.5,ARS Default,50,$ 3.75,,,,,,,,,,$ 1.78,$ 0.19,$ 0,,,,
Mackowski Jonas,691802207198,01/28/2024,03/05/2024,Beacon International,Visa,Single,$ 0,$ 43.32,Insubuy  Inc,37,$ 16.03,,,,,,,,,,$ 10.29,$ 1.08,$ 5.63,,,,
shraim turkey,691802205880,01/28/2024,02/04/2024,Beacon International,Visa,Single,$ 0,$ 11.2,Insubuy  Inc,37,$ 4.14,,,,,,,,,,$ 2.66,$ 0.28,$ 1.46,,,,
KUO YEN TING,691802207275,01/28/2024,02/07/2024,Beacon International,Visa,Single,$ 0,$ 7.92,Insubuy  Inc,37,$ 2.93,,,,,,,,,,$ 1.88,$ 0.2,$ 1.03,,,,
Culverhouse Martin Henry,691802206947,01/27/2024,02/03/2024,Beacon International,Visa,Single,$ 0,$ 53,Insubuy  Inc,37,$ 19.61,,,,,,,,,,$ 12.59,$ 1.33,$ 6.89,,,,
Kaskar Zahraa,691802207620,01/27/2024,02/27/2024,Beacon International,Visa,Single,$ 0,$ 23.04,Insubuy  Inc,37,$ 8.52,,,,,,,,,,$ 5.47,$ 0.58,$ 3,,,,
Steele Jeffrey Allen,691802206948,01/27/2024,02/03/2024,Beacon International,Visa,Single,$ 0,$ 53,Insubuy  Inc,37,$ 19.61,,,,,,,,,,$ 12.59,$ 1.33,$ 6.89,,,,
Anstine Sandra Kay,691802205645,01/27/2024,02/01/2024,Beacon International,MasterCard,Single,$ 0,$ 17.1,Insubuy  Inc,37,$ 6.33,,,,,,,,,,$ 4.06,$ 0.43,$ 2.22,,,,
Manik Puneet,691802207517,01/27/2024,01/31/2024,Beacon International,Visa,Single,$ 0,$ 5.25,Insubuy  Inc,37,$ 1.94,,,,,,,,,,$ 1.25,$ 0.13,$ 0.68,,,,
Akai Toshifumi,691802207655,01/27/2024,02/26/2024,Beacon International,Visa,Single,$ 0,$ 43.4,Insubuy  Inc,37,$ 16.06,,,,,,,,,,$ 10.31,$ 1.09,$ 5.64,,,,
McAtee Christine Theresa,691802207487,01/27/2024,02/06/2024,Beacon International,Visa,Single,$ 0,$ 19.5,Insubuy  Inc,37,$ 7.22,,,,,,,,,,$ 4.63,$ 0.49,$ 2.54,,,,
Degun Balvir Kaur,691802207025,01/27/2024,02/27/2024,Beacon International,MasterCard,Single,$ 0,$ 135.2,Insubuy  Inc,37,$ 50.02,,,,,,,,,,$ 32.11,$ 3.38,$ 17.58,,,,
MANG LANG DO,691802207461,01/27/2024,02/09/2024,Beacon International,AMEX,Single,$ 0,$ 8.23,Insubuy  Inc,37,$ 3.05,,,,,,,,,,$ 1.95,$ 0.21,$ 1.07,,,,
Robbins Meelah Angelina,691802207682,01/27/2024,02/17/2024,Beacon International,Visa,Single,$ 0,$ 22.88,Insubuy  Inc,37,$ 8.47,,,,,,,,,,$ 5.43,$ 0.57,$ 2.97,,,,
Guzman Aileen,691802207291,01/27/2024,02/04/2024,Beacon International,Visa,Single,$ 0,$ 22.28,Insurance Services of America,30,$ 6.68,,,,,,,,,,$ 5.29,$ 0.56,$ 4.46,,,,
MARTINEZ LUIS M,691802207690,01/27/2024,02/13/2024,Beacon International,Visa,Single,$ 0,$ 60.12,Insubuy  Inc,37,$ 22.24,,,,,,,,,,$ 14.28,$ 1.5,$ 7.82,,,,
GONZALEZ JOSE A,691802207691,01/27/2024,02/13/2024,Beacon International,Visa,Single,$ 0,$ 60.12,Insubuy  Inc,37,$ 22.24,,,,,,,,,,$ 14.28,$ 1.5,$ 7.82,,,,
Anderson Natalie Anne,691802207724,01/27/2024,02/08/2024,Beacon International,Visa,Single,$ 0,$ 14.82,Insubuy  Inc,37,$ 5.48,,,,,,,,,,$ 3.52,$ 0.37,$ 1.93,,,,
Jara Jara Nayadet Karina,691802207246,01/27/2024,02/03/2024,Beacon International,MasterCard,Single,$ 0,$ 14.4,Insubuy  Inc,37,$ 5.33,,,,,,,,,,$ 3.42,$ 0.36,$ 1.87,,,,
SAYED FAZAL IMAM,691802203734,01/27/2024,02/07/2024,Beacon International,MasterCard,Single,$ 0,$ 12,Insubuy  Inc,37,$ 4.44,,,,,,,,,,$ 2.85,$ 0.3,$ 1.56,,,,
Guillen corrales Alexa Mariany,691802207307,01/26/2024,02/05/2024,Beacon International,MasterCard,Single,$ 0,$ 7.92,Insubuy  Inc,37,$ 2.93,,,,,,,,,,$ 1.88,$ 0.2,$ 1.03,,,,
VELASCO GELVES JESUS MANUEL,691802206407,01/26/2024,02/06/2024,Beacon International,MasterCard,Single,$ 0,$ 20.24,Central Tours  C.A. Wilson Rojas,15,$ 3.04,Elite International E Gelves,-30,$ -6.07,,,,,,,$ 4.81,$ 0.51,$ 13.16,,,,
Sosa Negron Pablo Andre,691802207667,01/26/2024,03/31/2024,Beacon International,Visa,Single,$ 0,$ 94.05,Insubuy  Inc,37,$ 34.8,,,,,,,,,,$ 22.34,$ 2.35,$ 12.23,,,,
Ward Mariah Telise,691802207490,01/26/2024,02/10/2024,Beacon International,Visa,Single,$ 0,$ 32.03,Insubuy  Inc,37,$ 11.85,,,,,,,,,,$ 7.61,$ 0.8,$ 4.16,,,,
Stroud Kayleigh,691802207670,01/26/2024,01/29/2024,Beacon International,Visa,Single,$ 0,$ 7.4,ARS Default,50,$ 3.7,,,,,,,,,,$ 1.76,$ 0.19,$ 0,,,,
north zoey,691802206939,01/26/2024,01/01/2025,Beacon International,MasterCard,Single,$ 0,$ 949.39,Bob Jankovics,25,$ 237.35,,,,,,,,,,$ 225.48,$ 23.73,$ 237.35,,,,
chehrit lounis,691802204898,01/26/2024,01/30/2024,Beacon International,MasterCard,Single,$ 0,$ 4.5,Insubuy  Inc,37,$ 1.67,,,,,,,,,,$ 1.07,$ 0.11,$ 0.59,,,,
Deane Bradley Micheal,691802207464,01/26/2024,01/30/2024,Beacon International,MasterCard,Single,$ 0,$ 9.4,Insubuy  Inc,37,$ 3.48,,,,,,,,,,$ 2.23,$ 0.24,$ 1.22,,,,
Mehta Sunita,691802207578,01/26/2024,03/22/2024,Beacon International,Visa,Single,$ 0,$ 201.55,Insubuy  Inc,37,$ 74.57,,,,,,,,,,$ 47.87,$ 5.04,$ 26.2,,,,
Spyropoulos Emmanouil,691802207641,01/26/2024,01/30/2024,Beacon International,MasterCard,Single,$ 0,$ 8.75,Insubuy  Inc,37,$ 3.24,,,,,,,,,,$ 2.08,$ 0.22,$ 1.14,,,,
Nambu Yumi,691802207048,01/25/2024,01/29/2024,Beacon International,MasterCard,Single,$ 0,$ 7,Insubuy  Inc,37,$ 2.59,,,,,,,,,,$ 1.66,$ 0.18,$ 0.91,,,,
SORATHIYA NADIR NIZAR ALI,691802207009,01/25/2024,02/06/2024,Beacon International,Visa,Single,$ 0,$ 15.44,Sohil Rayani,20,$ 3.09,Insubuy  Inc,-2,$ -0.31,,,,,,,$ 3.67,$ 0.39,$ 4.94,,,,
BEARD JACK DAVIS,691802207468,01/25/2024,02/08/2024,Beacon International,AMEX,Single,$ 0,$ 25.2,Insubuy  Inc,37,$ 9.32,,,,,,,,,,$ 5.99,$ 0.63,$ 3.28,,,,
Sanghvi Deep Mukeshbhai,691802206102,01/25/2024,01/31/2024,Beacon International,Visa,Single,$ 0,$ 0,Insubuy  Inc,37,$ 0,,,,,,,,,,$ 0,$ 0,$ 0,,,,
Nguyen Uyen Jennifer,691802207483,01/25/2024,02/24/2024,Beacon International,Visa,Single,$ 0,$ 56.92,Insubuy  Inc,37,$ 21.06,,,,,,,,,,$ 13.52,$ 1.42,$ 7.4,,,,
Chiarentin Lucas,691802207081,01/25/2024,02/14/2024,Beacon International,Visa,Single,$ 0,$ 19.4,Insubuy Inc.,35,$ 6.79,Insubuy  Inc,-2,$ -0.39,,,,,,,$ 4.61,$ 0.49,$ 3.3,,,,
ZOU LUQI,691802205531,01/25/2024,02/02/2024,Beacon International,AMEX,Single,$ 0,$ 0,Shaomeng Chang,20,$ 0,Insubuy  Inc,-2,$ 0,,,,,,,$ 0,$ 0,$ 0,,,,
Sanghvi Deep Mukeshbhai,691802205799,01/25/2024,01/31/2024,Beacon International,Visa,Single,$ 0,$ 8.31,Insubuy  Inc,37,$ 3.07,,,,,,,,,,$ 1.97,$ 0.21,$ 1.08,,,,
Barretta Filho Jose Nelson,691802203603,01/25/2024,02/10/2024,Beacon International,MasterCard,Single,$ 0,$ 0,Insubuy  Inc,37,$ 0,,,,,,,,,,$ 0,$ 0,$ 0,,,,
Shah Isha Rakeshkumar,691802206072,01/25/2024,01/31/2024,Beacon International,Visa,Single,$ 0,$ 8.31,Insubuy  Inc,37,$ 3.07,,,,,,,,,,$ 1.97,$ 0.21,$ 1.08,,,,
Yamashita Jumpei,691802207142,01/25/2024,01/29/2024,Beacon International,MasterCard,Single,$ 0,$ 4.2,Insubuy  Inc,37,$ 1.55,,,,,,,,,,$ 1,$ 0.11,$ 0.55,,,,
Hwang Steven,691802206589,01/25/2024,02/06/2024,Beacon International,Visa,Single,$ 0,$ 18.2,Insubuy  Inc,37,$ 6.73,,,,,,,,,,$ 4.32,$ 0.46,$ 2.37,,,,
Vines Kevin Glynne,691802207297,01/25/2024,02/24/2024,Beacon International,MasterCard,Single,$ 0,$ 70.68,Insubuy  Inc,37,$ 26.15,,,,,,,,,,$ 16.79,$ 1.77,$ 9.19,,,,
Pu David,691802207621,01/25/2024,01/29/2024,Beacon International,MasterCard,Single,$ 0,$ 6.67,Insubuy  Inc,37,$ 2.47,,,,,,,,,,$ 1.58,$ 0.17,$ 0.87,,,,
Jean Baptiste Garcia,691802206990,01/25/2024,02/03/2024,Beacon International,Visa,Single,$ 0,$ 11,ARS Default,50,$ 5.5,,,,,,,,,,$ 2.61,$ 0.28,$ 0,,,,
Campos Ronald,691802207509,01/25/2024,01/31/2024,Beacon International,MasterCard,Single,$ 0,$ 24.64,Insubuy  Inc,37,$ 9.12,,,,,,,,,,$ 5.85,$ 0.62,$ 3.2,,,,
Presser Meredith Dianne,691802206597,01/24/2024,01/31/2024,Beacon International,Cheque,Single,$ 0,$ 14,Insubuy  Inc,37,$ 5.18,,,,,,,,,,$ 3.33,$ 0.35,$ 1.82,,,,
Fasoli Jack Lance,691802180433,01/24/2024,03/23/2024,Beacon International,Cheque,Single,$ 0,$ 386.25,Insubuy  Inc,37,$ 142.91,,,,,,,,,,$ 91.73,$ 9.66,$ 50.21,,,,
Marte Rocky Sabanpan,691802206356,01/24/2024,03/09/2024,Beacon International,AMEX,Single,$ 0,$ 186.3,Insubuy  Inc,37,$ 68.93,,,,,,,,,,$ 44.25,$ 4.66,$ 24.22,,,,
wells david,691802207286,01/24/2024,04/24/2024,Beacon International,MasterCard,Single,$ 0,$ 218.32,ARS Default,50,$ 109.16,,,,,,,,,,$ 51.85,$ 5.46,$ 0,,,,
HORINEK PAIGE,691802207525,01/24/2024,02/01/2024,Beacon International,AMEX,Single,$ 0,$ 10.26,Insubuy  Inc,37,$ 3.8,,,,,,,,,,$ 2.44,$ 0.26,$ 1.33,,,,
Gonzalez Silva Luis Eduardo,691802206595,01/23/2024,02/12/2024,Beacon International,Visa,Single,$ 0,$ 24.94,Insubuy  Inc,37,$ 9.23,,,,,,,,,,$ 5.92,$ 0.62,$ 3.24,,,,
CHOCRON DAVID,691802205440,01/23/2024,01/31/2024,Beacon International,Cheque,Single,$ 0,$ 13.61,Cynthia Posner Smolin,30,$ 4.08,,,,,,,,,,$ 3.23,$ 0.34,$ 2.72,,,,
Werth Silke,691802196771,01/23/2024,02/10/2024,Beacon International,Cheque,Single,$ 0,$ 40.76,ARS Default,50,$ 20.38,,,,,,,,,,$ 9.68,$ 1.02,$ 0,,,,
Sethia Dipti,691802207323,01/23/2024,01/30/2024,Beacon International,Visa,Single,$ 0,$ 32.8,Insubuy  Inc,37,$ 12.14,,,,,,,,,,$ 7.79,$ 0.82,$ 4.26,,,,
Tolani Tushar,691802207480,01/23/2024,05/15/2024,Beacon International,Visa,Single,$ 0,$ 129.96,Insubuy  Inc,37,$ 48.09,,,,,,,,,,$ 30.87,$ 3.25,$ 16.89,,,,
Marukala Hemanth Rahul,691802207395,01/23/2024,01/27/2024,Beacon International,Visa,Single,$ 0,$ 6.44,Insubuy  Inc,37,$ 2.38,,,,,,,,,,$ 1.53,$ 0.16,$ 0.84,,,,
Moeller Madeline Elsa,691802207455,01/23/2024,02/01/2024,Beacon International,MasterCard,Single,$ 0,$ 10.5,Insubuy  Inc,37,$ 3.89,,,,,,,,,,$ 2.49,$ 0.26,$ 1.37,,,,
LO TUN YUN,691802207424,01/23/2024,01/31/2024,Beacon International,MasterCard,Single,$ 0,$ 8.42,Insubuy  Inc,37,$ 3.12,,,,,,,,,,$ 2,$ 0.21,$ 1.09,,,,
Dyas Loren Lourdes Sison,691802207285,01/23/2024,02/14/2024,Beacon International,AMEX,Single,$ 0,$ 82.92,Insubuy  Inc,37,$ 30.68,,,,,,,,,,$ 19.69,$ 2.07,$ 10.78,,,,
Narvaez Artunduaga Zuly Yojana,691802207425,01/23/2024,01/28/2024,Beacon International,Visa,Single,$ 0,$ 5.88,Insubuy  Inc,37,$ 2.18,,,,,,,,,,$ 1.4,$ 0.15,$ 0.76,,,,
Benavides Christopher Marcelo,691802207299,01/23/2024,01/27/2024,Beacon International,Visa,Single,$ 0,$ 7,Insubuy  Inc,37,$ 2.59,,,,,,,,,,$ 1.66,$ 0.18,$ 0.91,,,,
Horimai Shohei,691802206393,01/22/2024,01/26/2024,Beacon International,Visa,Single,$ 0,$ 4.2,Insubuy  Inc,37,$ 1.55,,,,,,,,,,$ 1,$ 0.11,$ 0.55,,,,
KRISTOPHER Behl HEATHERAN,691802205923,01/22/2024,12/17/2024,Beacon International,Visa,Single,$ 0,$ 0,Insubuy  Inc,37,$ 0,,,,,,,,,,$ 0,$ 0,$ 0,,,,
Fernandes Rodrigo,691802207410,01/22/2024,01/26/2024,Beacon International,Visa,Single,$ 0,$ 7.56,ARS Default,50,$ 3.78,,,,,,,,,,$ 1.8,$ 0.19,$ 0,,,,
Kroner Thomas Harald,691802207412,01/22/2024,01/31/2024,Beacon International,Visa,Single,$ 0,$ 20.4,Insubuy  Inc,37,$ 7.55,,,,,,,,,,$ 4.85,$ 0.51,$ 2.65,,,,
Akers Emily Faith,691802206598,01/22/2024,01/29/2024,Beacon International,Cheque,Single,$ 0,$ 10.3,Insubuy  Inc,37,$ 3.81,,,,,,,,,,$ 2.45,$ 0.26,$ 1.34,,,,
GIRADO MARTINEZ FABIANIZ,691802207374,01/22/2024,01/27/2024,Beacon International,Visa,Single,$ 0,$ 5.04,Insubuy  Inc,37,$ 1.86,,,,,,,,,,$ 1.2,$ 0.13,$ 0.66,,,,
Kommana Venkata Krishna Mohan,691802206891,01/22/2024,01/27/2024,Beacon International,MasterCard,Single,$ 0,$ 20.25,Shazreh Malik,20,$ 4.05,Insubuy  Inc,-2,$ -0.41,,,,,,,$ 4.81,$ 0.51,$ 6.48,,,,
Langstaff Alexander Bond,691802204025,01/22/2024,06/30/2024,Beacon International,Visa,Single,$ 0,$ 191.19,Insubuy  Inc,37,$ 70.74,,,,,,,,,,$ 45.41,$ 4.78,$ 24.85,,,,
GELVES MAGDA,691802207177,01/22/2024,01/26/2024,Beacon International,Amex,Single,$ 0,$ 8.13,Elite International E Gelves,30,$ 2.44,,,,,,,,,,$ 1.93,$ 0.2,$ 1.63,,,,
Cyprien Price,691802206761,01/22/2024,02/05/2024,Beacon International,Amex,Single,$ 0,$ 47.19,Ann Martine Paul,15,$ 7.08,Pierre Armand Gation,-30,$ -14.16,,,,,,,$ 11.21,$ 1.18,$ 30.67,,,,
MEAS Rithirathet,691802207131,01/21/2024,03/03/2024,Beacon International,Visa,Single,$ 0,$ 60.2,Insubuy  Inc,37,$ 22.27,,,,,,,,,,$ 14.3,$ 1.51,$ 7.83,,,,
Kenfack Djoucfack Arnauld Michel,691802206642,01/21/2024,01/31/2024,Beacon International,Visa,Single,$ 0,$ 12.01,Insubuy  Inc,37,$ 4.44,,,,,,,,,,$ 2.85,$ 0.3,$ 1.56,,,,
Chu Yuanming,691802203980,01/21/2024,01/26/2024,Beacon International,AMEX,Single,$ 0,$ 11.7,Insubuy  Inc,37,$ 4.33,,,,,,,,,,$ 2.78,$ 0.29,$ 1.52,,,,
Tanskanen Kim Marie,691802205269,01/21/2024,05/15/2024,Beacon International,AMEX,Single,$ 0,$ 464,Insubuy  Inc,37,$ 171.68,,,,,,,,,,$ 110.2,$ 11.6,$ 60.32,,,,
Garcia Perez Jose,691802207313,01/21/2024,01/28/2024,Beacon International,Visa,Single,$ 0,$ 14,Insubuy  Inc,37,$ 5.18,,,,,,,,,,$ 3.33,$ 0.35,$ 1.82,,,,
Johnson Scott Lucas,691802199364,01/21/2024,02/20/2024,Beacon International,Cheque,Single,$ 0,$ 127.72,Insubuy  Inc,37,$ 47.26,,,,,,,,,,$ 30.33,$ 3.19,$ 16.6,,,,
Fraley Robert Exon,691802207280,01/21/2024,01/27/2024,Beacon International,Discover,Single,$ 0,$ 33.88,Insubuy  Inc,37,$ 12.54,,,,,,,,,,$ 8.05,$ 0.85,$ 4.4,,,,
SAN Kosal,691802207132,01/21/2024,03/03/2024,Beacon International,Visa,Single,$ 0,$ 88.15,Insubuy  Inc,37,$ 32.62,,,,,,,,,,$ 20.94,$ 2.2,$ 11.46,,,,
Aguirre Syvlia,691802207077,01/21/2024,01/31/2024,Beacon International,Visa,Single,$ 0,$ 37.13,Insubuy  Inc,37,$ 13.74,,,,,,,,,,$ 8.82,$ 0.93,$ 4.83,,,,
VALIYAVEEDU MANIACHARI GOPIKRISHNA,691802206368,01/21/2024,02/10/2024,Beacon International,Visa,Single,$ 0,$ 81.38,Insubuy  Inc,37,$ 30.11,,,,,,,,,,$ 19.33,$ 2.03,$ 10.58,,,,
Rosas Cabrera Juan David,691802206870,01/21/2024,06/16/2024,Beacon International,Visa,Single,$ 0,$ 106.56,Insubuy  Inc,37,$ 39.43,,,,,,,,,,$ 25.31,$ 2.66,$ 13.85,,,,
Alzoabi Sultan M S J S,691802206814,01/20/2024,01/30/2024,Beacon International,MasterCard,Single,$ 0,$ 11,Insubuy  Inc,37,$ 4.07,,,,,,,,,,$ 2.61,$ 0.28,$ 1.43,,,,
Armstrong Michael,691802203758,01/20/2024,02/03/2024,Beacon International,Visa,Single,$ 0,$ 39.78,Insubuy  Inc,37,$ 14.72,,,,,,,,,,$ 9.45,$ 0.99,$ 5.17,,,,
JAIN SAURABH SUNIL,691802207208,01/20/2024,01/27/2024,Beacon International,Visa,Single,$ 0,$ 9.36,Insubuy  Inc,37,$ 3.46,,,,,,,,,,$ 2.22,$ 0.23,$ 1.22,,,,
Malovana Sofiya,691802207205,01/20/2024,05/18/2024,Beacon International,Visa,Single,$ 0,$ 136.8,Insubuy  Inc,37,$ 50.62,,,,,,,,,,$ 32.49,$ 3.42,$ 17.78,,,,
YIHENG LIU,691802207298,01/20/2024,02/19/2024,Beacon International,Visa,Single,$ 0,$ 27.9,Insubuy  Inc,37,$ 10.32,,,,,,,,,,$ 6.63,$ 0.7,$ 3.63,,,,
Xu Linfeng,691802205575,01/20/2024,01/28/2024,Beacon International,MasterCard,Single,$ 0,$ 12.83,Insubuy  Inc,37,$ 4.75,,,,,,,,,,$ 3.05,$ 0.32,$ 1.67,,,,
Bansal Sonia,691802206692,01/20/2024,01/30/2024,Beacon International,Visa,Single,$ 0,$ 13.09,Insubuy  Inc,37,$ 4.84,,,,,,,,,,$ 3.11,$ 0.33,$ 1.7,,,,
Alzuabi Rema M,691802206811,01/20/2024,01/30/2024,Beacon International,MasterCard,Single,$ 0,$ 11,Insubuy  Inc,37,$ 4.07,,,,,,,,,,$ 2.61,$ 0.28,$ 1.43,,,,