Client Name,Identification #,Eff. Date,Term Date,Plan,Payment,Payment Mode,Express Mail Amount,Premium,Agent #1,Comm %,Agent #1 Pmt.,Agent #2,Comm %,Agent #2 Pmt.,Agent #3,Comm %,Agent #3 Pmt.,Agent #4,Comm %,Agent #4 Pmt.,Claims Acc Fund,BMS Comm,ARS Comm,Comm Date,Merchant Fees,Surplus,
Meridian Series,
Vargas Michaela,691802108212,12/31/2021,12/29/2022,Enhanced America,MasterCard,Annual,$ 0,$ 3565,Doug Gulleson,25,$ 891.25,,,,,,,,,,$ 846.69,$ 89.13,$ 891.25,,,,
Lynch Caleb,691802109061,12/28/2021,12/26/2022,Essential America,Visa,Monthly,$ 25,$ 30.5,Insurance Services of America,35,$ 19.43,,,,,,,,,,$ 13.18,$ 1.39,$ 8.33,,,,
Ali Mudassir,691802108553,12/20/2021,12/18/2022,Essential America,MasterCard,Monthly,$ 0,$ 266.6,Ramesh or Bharati Patel,33,$ 87.98,,,,,,,,,,$ 63.32,$ 6.67,$ 45.32,,,,
Nicolla Rakan,691802108752,12/16/2021,12/14/2022,Enhanced America,Visa,Annual,$ 0,$ 1543,Pierre Armand Gation,30,$ 462.9,,,,,,,,,,$ 366.46,$ 38.58,$ 308.6,,,,
Harmer Jeff,691802108706,12/16/2021,12/14/2022,Essential America,Visa,Annual,$ 0,$ 4705,Cecille Brechin,27,$ 1270.35,,,,,,,,,,$ 1117.44,$ 117.63,$ 1082.15,,,,
Hibbard Lauren,691802108340,12/13/2021,12/11/2022,Essential International,MasterCard,Quarterly,$ 0,$ 739.76,Carisse L. Collins,15,$ 110.96,Craig Robinson,0,$ 0,,,,,,,$ 175.69,$ 18.49,$ 258.92,,,,
Patel Harshkumar,691802108353,12/08/2021,12/06/2022,Essential America,Visa,Annual,$ 0,$ 959,Scott Rose,30,$ 287.7,,,,,,,,,,$ 227.76,$ 23.98,$ 191.8,,,,
Griffith Ashley,691802108277,12/08/2021,12/06/2022,Essential International,Visa,Annual,$ 0,$ 1745,Bob Jankovics,25,$ 436.25,,,,,,,,,,$ 414.44,$ 43.63,$ 436.25,,,,
McDonald Ian,691802108351,12/06/2021,12/04/2022,Clear International,MasterCard,Semi,$ 0,$ 265.1,Roy Hutchison,15,$ 39.77,,,,,,,,,,$ 62.96,$ 6.63,$ 92.79,,,,
Greenawalt Jeremy,691802108175,12/02/2021,11/30/2022,Essential America,Visa,Annual,$ 0,$ 3379.53,Cecille Brechin,27,$ 912.47,,,,,,,,,,$ 802.64,$ 84.49,$ 777.29,,,,
Hynson Zara,691802108243,12/02/2021,11/30/2022,Essential America,Visa,Annual,$ 0,$ 0,Doug Gulleson,25,$ 0,,,,,,,,,,$ 0,$ 0,$ 0,,,,
Killpack Jonathan ,691802107735,12/01/2021,11/29/2022,Essential America,Visa,Annual,$ 0,$ 3513,Doug Gulleson,25,$ 878.25,,,,,,,,,,$ 834.34,$ 87.83,$ 878.25,,,,
Howson Megan,691802107482,11/20/2021,11/18/2022,Clear America,Visa,Monthly,$ 0,$ 596.8,Gallagher Charitable International Insurance Services,22,$ 131.3,,,,,,,,,,$ 141.74,$ 14.92,$ 167.1,,,,
Alton David,691802107242,11/15/2021,11/13/2022,Essential America,Visa,Annual,$ 0,$ 3049,Cecille Brechin,27,$ 823.23,,,,,,,,,,$ 724.14,$ 76.23,$ 701.27,,,,
Barnhill Anna,691802107642,11/15/2021,11/13/2022,Essential America,Amex,Annual,$ 0,$ 4694.6,Launa Dene Brockman,20,$ 938.92,,,,,,,,,,$ 1114.97,$ 117.37,$ 1408.38,,,,
Bradley Robert,691802107537,11/15/2021,11/13/2022,Essential America,Visa,Annual,$ 0,$ 3819,John McGee,30,$ 1145.7,,,,,,,,,,$ 907.01,$ 95.48,$ 763.8,,,,
Zupancic Mitja,691802107206,11/03/2021,11/01/2022,Essential International,MasterCard,Annual,$ 0,$ 3302,ARS Default,50,$ 1651,,,,,,,,,,$ 784.23,$ 82.55,$ 0,,,,
MORA SHARON,691802107256,10/25/2021,10/23/2022,Essential America,Amex,Annual,$ 0,$ 1216,Bob Jankovics,25,$ 304,,,,,,,,,,$ 288.8,$ 30.4,$ 304,,,,
Bhagavatula Venkata,691802107225,10/21/2021,10/19/2022,Essential America,Visa,Monthly,$ 0,$ 140.9,Ramesh or Bharati Patel,33,$ 46.5,,,,,,,,,,$ 33.46,$ 3.52,$ 23.95,,,,
Rasmussen Junia,691802107251,10/21/2021,10/19/2022,Essential America,Visa,Annual,$ 0,$ 0,Doug Gulleson,25,$ 0,,,,,,,,,,$ 0,$ 0,$ 0,,,,
Huupponen Krista,691802105669,10/18/2021,10/16/2022,Essential International,MasterCard,Annual,$ 0,$ 689,ARS Default,50,$ 344.5,,,,,,,,,,$ 163.64,$ 17.23,$ 0,,,,
Tiwari Swapnil,691802107144,10/18/2021,10/16/2022,Essential America,Visa,Monthly,$ 25,$ 199.2,Insurance Services of America,35,$ 78.47,,,,,,,,,,$ 53.25,$ 5.61,$ 33.63,,,,
Moorhead Laura,691802107038,10/13/2021,10/11/2022,Essential America,Visa,Annual,$ 0,$ 2437,Health Insurance Services International,20,$ 487.4,,,,,,,,,,$ 578.79,$ 60.93,$ 731.1,,,,
Bixler Jacqueline,691802106735,10/07/2021,10/05/2022,Essential America,Visa,Monthly,$ 0,$ 161.2,Customer Service,35,$ 56.42,,,,,,,,,,$ 38.29,$ 4.03,$ 24.18,,,,
Fontes Andrew,691802105811,10/04/2021,10/02/2022,Essential America,Visa,Annual,$ 0,$ 1044,Launa Dene Brockman,20,$ 208.8,,,,,,,,,,$ 247.95,$ 26.1,$ 313.2,,,,
Bajpai Amit,691802105771,10/04/2021,10/02/2022,Essential America,Visa,Monthly,$ 0,$ 420.1,Visitors Insurance,15,$ 63.02,,,,,,,,,,$ 99.77,$ 10.5,$ 147.04,,,,
Wilson Adam,691802105530,10/01/2021,09/29/2022,Enhanced America,Visa,Monthly,$ 0,$ 316.7,ARS Default,50,$ 158.35,,,,,,,,,,$ 75.22,$ 7.92,$ 0,,,,
Thayer Edmund,691802105567,10/01/2021,09/29/2022,Essential International,Visa,Annual,$ 0,$ 1077,Insubuy  Inc,30,$ 323.1,,,,,,,,,,$ 255.79,$ 26.93,$ 215.4,,,,
Iljazi Servi,691802105586,09/27/2021,09/25/2022,Essential America,Visa,Monthly,$ 0,$ 23.616,Insurance Services of America,35,$ 8.27,,,,,,,,,,$ 5.61,$ 0.59,$ 3.54,,,,
Ayala Ricardo,691802105356,09/17/2021,09/15/2022,Enhanced America,Visa,Monthly,$ 0,$ 284.855,ARS Default,50,$ 142.43,,,,,,,,,,$ 67.65,$ 7.12,$ 0,,,,
Evans Mallory,691802104988,09/15/2021,09/13/2022,Enhanced America,Amex,Quarterly,$ 0,$ 1844.654,Launa Dene Brockman,20,$ 368.93,,,,,,,,,,$ 438.11,$ 46.12,$ 553.4,,,,
Gordley Andy,691802104931,09/02/2021,08/31/2022,Essential America,Visa,Annual,$ 0,$ 6209,Doug Gulleson,25,$ 1552.25,,,,,,,,,,$ 1474.64,$ 155.23,$ 1552.25,,,,
Warkenton Christopher,691802104987,09/02/2021,08/31/2022,Enhanced America,MasterCard,Annual,$ 25,$ 7083.9,Aldis Barsketis,17,$ 1208.51,Expat Insurance LLC,0,$ 0,,,,,,,$ 1688.36,$ 177.72,$ 2345.94,,,,
Koess Stephen,691802104938,09/01/2021,08/30/2022,Essential International,Visa,Annual,$ 0,$ 904,John McGee,30,$ 271.2,,,,,,,,,,$ 214.7,$ 22.6,$ 180.8,,,,
Histand Carla,691802104556,09/01/2021,08/30/2022,Essential America,MasterCard,Annual,$ 0,$ 2982.2,Doug Gulleson,25,$ 745.55,,,,,,,,,,$ 708.27,$ 74.56,$ 745.55,,,,
Spalding Martha,691802104880,09/01/2021,08/30/2022,Essential America,Visa,Annual,$ 25,$ 4652.55,Warren Peterson,20,$ 935.51,,,,,,,,,,$ 1110.92,$ 116.94,$ 1403.27,,,,
Dawson Madeleine,691802105014,09/01/2021,08/30/2022,Essential America,Visa,Annual,$ 0,$ 0,Doug Gulleson,25,$ 0,,,,,,,,,,$ 0,$ 0,$ 0,,,,
Sackman Sharon,691802104406,08/31/2021,08/29/2022,Enhanced America,MasterCard,Semi,$ 0,$ 2085.6,Launa Dene Brockman,20,$ 417.12,,,,,,,,,,$ 495.33,$ 52.14,$ 625.68,,,,
kang Susan,691802104964,08/30/2021,08/28/2022,Essential America,Visa,Monthly,$ 0,$ 266.1,Launa Dene Brockman,20,$ 53.22,,,,,,,,,,$ 63.2,$ 6.65,$ 79.83,,,,
Saglimbeni Sebastiano,691802104944,08/27/2021,08/25/2022,Essential America,MasterCard,Annual,$ 0,$ 5055.75,Lourdes Calas,25,$ 1263.94,,,,,,,,,,$ 1200.74,$ 126.39,$ 1263.94,,,,
Abel David,691802104892,08/25/2021,08/23/2022,Enhanced America,Amex,Annual,$ 0,$ 2972.4,Expat Insurance LLC,25,$ 743.1,,,,,,,,,,$ 705.95,$ 74.31,$ 743.1,,,,
Myrte Gabriel,691802104894,08/24/2021,08/22/2022,Essential America,Visa,Annual,$ 0,$ 555,Doug Gulleson,25,$ 138.75,,,,,,,,,,$ 131.81,$ 13.88,$ 138.75,,,,
Adams Benjamin,691802104720,08/21/2021,08/19/2022,Essential America,Visa,Annual,$ 0,$ 4284,Craig Robinson,31,$ 1328.04,,,,,,,,,,$ 1017.45,$ 107.1,$ 813.96,,,,
Helmore Claude ,691802104771,08/21/2021,08/19/2022,Enhanced America,Visa,Quarterly,$ 0,$ 693.56,ARS Default,50,$ 346.78,,,,,,,,,,$ 164.72,$ 17.34,$ 0,,,,
Wells Daxell,691802098244,08/10/2021,08/08/2022,Essential America,Visa,Annual,$ 0,$ 2791,Joseph James Pridgen,20,$ 558.2,,,,,,,,,,$ 662.86,$ 69.78,$ 837.3,,,,
Badrakh Gantumur,691802104540,08/10/2021,08/08/2022,Essential America,Visa,Monthly,$ 25,$ 697.4,ARS Default,50,$ 361.2,,,,,,,,,,$ 171.57,$ 18.06,$ 0,,,,
COUZYN JAYDE,691802104430,08/05/2021,08/03/2022,Essential America,Visa,Monthly,$ 0,$ 213.6036,ARS Default,50,$ 106.8,,,,,,,,,,$ 50.73,$ 5.34,$ 0,,,,
WITTERSO MAGNUS,691802104429,08/05/2021,08/03/2022,Enhanced America,Visa,Monthly,$ 0,$ 224.2236,ARS Default,50,$ 112.11,,,,,,,,,,$ 53.25,$ 5.61,$ 0,,,,
Rayle Victoria,691802097705,08/03/2021,08/01/2022,Essential America,Visa,Annual,$ 0,$ 1737,ARS Default,50,$ 868.5,,,,,,,,,,$ 412.54,$ 43.43,$ 0,,,,
McElveen Scott,691802078183,08/03/2021,08/01/2022,Essential America,Amex,Annual,$ 0,$ 2426,Craig Robinson,31,$ 752.06,,,,,,,,,,$ 576.18,$ 60.65,$ 460.94,,,,
Collins Philip,691802098052,08/02/2021,07/31/2022,Essential America,Visa,Annual,$ 0,$ 5744,Craig Robinson,31,$ 1780.64,,,,,,,,,,$ 1364.2,$ 143.6,$ 1091.36,,,,
CHIRICHIELLO LINDSEY,691802098369,08/01/2021,07/30/2022,Essential America,Visa,Monthly,$ 0,$ 316.785,ARS Default,50,$ 158.39,,,,,,,,,,$ 75.24,$ 7.92,$ 0,,,,
Nusair Benyamin,691802098371,08/01/2021,07/30/2022,Essential International,MasterCard,Monthly,$ 0,$ 105.9,Carisse L. Collins,15,$ 15.89,Craig Robinson,0,$ 0,,,,,,,$ 25.15,$ 2.65,$ 37.07,,,,
Johnson Stephen,691802078514,07/29/2021,07/27/2022,Essential America,MasterCard,Annual,$ 0,$ 1784,John McGee,30,$ 535.2,,,,,,,,,,$ 423.7,$ 44.6,$ 356.8,,,,
Palamakula Adithya,691802098336,07/26/2021,07/24/2022,Essential America,Amex,Semi,$ 0,$ 1768.8,Visitors Insurance,15,$ 265.32,,,,,,,,,,$ 420.09,$ 44.22,$ 619.08,,,,
Christensen Dane,691802097974,07/26/2021,07/24/2022,Enhanced America,Visa,Annual,$ 0,$ 1544.45,Mark Devlin,15,$ 231.67,,,,,,,,,,$ 366.81,$ 38.61,$ 540.56,,,,
Delos Reyes Myrna,691802078273,07/22/2021,07/20/2022,Essential America,Visa,Quarterly,$ 0,$ 2632,Customer Service,35,$ 921.2,,,,,,,,,,$ 625.1,$ 65.8,$ 394.8,,,,
Zhang Linkang,691802097992,07/16/2021,07/14/2022,Essential America,Visa,Annual,$ 0,$ 836,ARS Default,50,$ 418,,,,,,,,,,$ 198.55,$ 20.9,$ 0,,,,
Thompson Jeffery,691802078498,07/08/2021,07/06/2022,Clear America,Visa,Monthly,$ 0,$ 14.99904,Robert Seay,15,$ 2.25,,,,,,,,,,$ 3.56,$ 0.37,$ 5.25,,,,
Jacobs Spencer,691802078507,07/07/2021,07/05/2022,Essential America,Visa,Annual,$ 0,$ 741,Steve Fillinger,15,$ 111.15,,,,,,,,,,$ 175.99,$ 18.53,$ 259.35,,,,
Van Der Meer Tasha ,691802078381,07/03/2021,07/01/2022,Essential America,Visa,Annual,$ 0,$ 3603,ARS Default,50,$ 1801.5,,,,,,,,,,$ 855.71,$ 90.08,$ 0,,,,
Entebi Abraham,691802078131,07/01/2021,06/29/2022,Essential America,MasterCard,Monthly,$ 0,$ 219.5,Carlos Noguera,25,$ 54.88,,,,,,,,,,$ 52.13,$ 5.49,$ 54.88,,,,
Gripman Jacqueline,691802078269,07/01/2021,06/29/2022,Essential International,Visa,Monthly,$ 0,$ 292.95,Carisse L. Collins,15,$ 43.94,Craig Robinson,0,$ 0,,,,,,,$ 69.58,$ 7.32,$ 102.53,,,,
Coahuila Alejandra,691802078103,06/30/2021,06/28/2022,Essential America,Amex,Annual,$ 0,$ 3191.58,Lourdes Calas,25,$ 797.9,,,,,,,,,,$ 758,$ 79.79,$ 797.9,,,,
Greene Benjamin ,691802078232,06/29/2021,06/27/2022,Essential International,Visa,Annual,$ 0,$ 2753,Launa Dene Brockman,20,$ 550.6,,,,,,,,,,$ 653.84,$ 68.83,$ 825.9,,,,
Wood Michael,691802077850,06/27/2021,06/25/2022,Essential America,Visa,Annual,$ 0,$ 1248,Insurance Services of America,35,$ 436.8,,,,,,,,,,$ 296.4,$ 31.2,$ 187.2,,,,
Wood Claire,691802077851,06/27/2021,06/25/2022,Essential International,Visa,Annual,$ 0,$ 650,Insurance Services of America,35,$ 227.5,,,,,,,,,,$ 154.38,$ 16.25,$ 97.5,,,,
Jensen Patrick,691802077473,06/15/2021,06/13/2022,Essential International,Visa,Annual,$ 0,$ 3367.6,Customer Service,35,$ 1178.66,,,,,,,,,,$ 799.81,$ 84.19,$ 505.14,,,,
Vacca Scott,691802077408,06/15/2021,06/13/2022,Essential America,Visa,Annual,$ 0,$ 5126,Launa Dene Brockman,20,$ 1025.2,,,,,,,,,,$ 1217.43,$ 128.15,$ 1537.8,,,,
KUHNHOFF KEVIN,691802077742,06/15/2021,06/13/2022,Essential America,Visa,Annual,$ 0,$ 1135,Bob Jankovics,25,$ 283.75,,,,,,,,,,$ 269.56,$ 28.38,$ 283.75,,,,
Hoover Jackson,691802077871,06/15/2021,06/13/2022,Essential America,Visa,Annual,$ 0,$ 524,Doug Gulleson,25,$ 131,,,,,,,,,,$ 124.45,$ 13.1,$ 131,,,,
Wild Jill,691802077123,06/14/2021,06/12/2022,Essential America,Visa,Annual,$ 0,$ 2196,Launa Dene Brockman,20,$ 439.2,,,,,,,,,,$ 521.55,$ 54.9,$ 658.8,,,,
Otte Grant,691802077296,06/01/2021,05/30/2022,Essential International,Visa,Annual,$ 0,$ 676,ARS Default,50,$ 338,,,,,,,,,,$ 160.55,$ 16.9,$ 0,,,,
Meyer Sheryl,691802077326,06/01/2021,05/30/2022,Essential America,MasterCard,Quarterly,$ 0,$ 767.48,Insurance Services of America,35,$ 268.62,,,,,,,,,,$ 182.28,$ 19.19,$ 115.12,,,,
Fuller Kenneth ,691802077233,05/31/2021,05/29/2022,Essential America,MasterCard,Annual,$ 0,$ 950.25,Customer Service,35,$ 332.59,,,,,,,,,,$ 225.68,$ 23.76,$ 142.54,,,,
Singer Nathan,691802076755,05/15/2021,05/13/2022,Essential America,Visa,Annual,$ 0,$ 1135,John McGee,30,$ 340.5,,,,,,,,,,$ 269.56,$ 28.38,$ 227,,,,
Hetzel Richard,691802076895,05/12/2021,05/10/2022,Essential America,Visa,Annual,$ 0,$ 3540.2325,Doug Gulleson,25,$ 885.06,,,,,,,,,,$ 840.81,$ 88.51,$ 885.06,,,,
Richardson Eric,691802051857,05/07/2021,05/05/2022,Essential America,Visa,Annual,$ 0,$ 2030,Customer Service,35,$ 710.5,,,,,,,,,,$ 482.13,$ 50.75,$ 304.5,,,,
Goyani Shailesh Kumar,691802076807,05/06/2021,05/04/2022,Enhanced America,Visa,Monthly,$ 0,$ 327.08,Visitors Insurance,15,$ 49.06,,,,,,,,,,$ 77.68,$ 8.18,$ 114.48,,,,
Perelstein Scott,691802053755,05/01/2021,04/29/2022,Essential International,Visa,Monthly,$ 0,$ 330.36,John McGee,30,$ 99.11,,,,,,,,,,$ 78.46,$ 8.26,$ 66.07,,,,
Waldorf Lynn,691802053886,04/30/2021,04/28/2022,Essential International,Visa,Annual,$ 0,$ 3030,Craig Robinson,31,$ 939.3,,,,,,,,,,$ 719.63,$ 75.75,$ 575.7,,,,
Quinn Katelyn,691802053961,04/28/2021,04/26/2022,Essential America,Visa,Annual,$ 0,$ 811,Craig Robinson,31,$ 251.41,,,,,,,,,,$ 192.61,$ 20.28,$ 154.09,,,,
Mendoza Cindi,691802053932,04/27/2021,04/25/2022,Essential America,Visa,Annual,$ 0,$ 2496,Insurance Services of America,35,$ 873.6,,,,,,,,,,$ 592.8,$ 62.4,$ 374.4,,,,
Feder Matthew,691802053630,04/23/2021,04/21/2022,Essential America,Visa,Annual,$ 0,$ 5857,Craig Robinson,31,$ 1815.67,,,,,,,,,,$ 1391.04,$ 146.43,$ 1112.83,,,,
Weil Bonny,691802053522,04/12/2021,04/10/2022,Essential International,MasterCard,Annual,$ 0,$ 2790,Launa Dene Brockman,20,$ 558,,,,,,,,,,$ 662.63,$ 69.75,$ 837,,,,
Witte Dylan,691802053391,04/08/2021,04/06/2022,Essential America,MasterCard,Annual,$ 0,$ 905,Craig Robinson,31,$ 280.55,,,,,,,,,,$ 214.94,$ 22.63,$ 171.95,,,,
Ediga Venkata Krishna Chaitanya,691802053465,04/05/2021,04/03/2022,Essential America,Visa,Monthly,$ 0,$ 148.8,Visitors Insurance,15,$ 22.32,,,,,,,,,,$ 35.34,$ 3.72,$ 52.08,,,,
VanDeusen Lesli,691802053415,04/01/2021,03/30/2022,Essential America,Amex,Annual,$ 0,$ 5686,Cecille Brechin,27,$ 1535.22,,,,,,,,,,$ 1350.43,$ 142.15,$ 1307.78,,,,
Edwardes Grace,691802053335,03/26/2021,03/24/2022,Essential America,MasterCard,Quarterly,$ 0,$ 705.32,Customer Service,35,$ 246.86,,,,,,,,,,$ 167.51,$ 17.63,$ 105.8,,,,
Bezerra Gustavo ,691802053234,03/19/2021,03/17/2022,Essential America,Visa,Monthly,$ 0,$ 337.05,Luiz M. Dasilva,25,$ 84.26,Insurance Services of America,0,$ 0,,,,,,,$ 80.05,$ 8.43,$ 84.26,,,,
lewis jordan,691802050835,03/10/2021,03/08/2022,Essential America,Visa,Annual,$ 0,$ 3525.9525,ARS Default,50,$ 1762.98,,,,,,,,,,$ 837.41,$ 88.15,$ 0,,,,
BARRIOS MARIA,691802052930,03/09/2021,03/07/2022,Clear International,Visa,Monthly,$ 0,$ 97.8,Elberto J. Vaughan,30,$ 29.34,,,,,,,,,,$ 23.23,$ 2.45,$ 19.56,,,,
Streever William,691802052632,03/07/2021,03/05/2022,Essential America,MasterCard,Annual,$ 0,$ 3751,Anita Warwick,25,$ 937.75,,,,,,,,,,$ 890.86,$ 93.78,$ 937.75,,,,
Martin Nickolas,691802052882,03/06/2021,03/04/2022,Essential America,Visa,Annual,$ 0,$ 3402.85,Craig Robinson,31,$ 1054.88,,,,,,,,,,$ 808.18,$ 85.07,$ 646.54,,,,
Squitieri Andres,691802052817,03/05/2021,03/03/2022,Essential America,Visa,Annual,$ 0,$ 853,Carlos Noguera,25,$ 213.25,,,,,,,,,,$ 202.59,$ 21.33,$ 213.25,,,,
Prouty Shannon ,691802052676,03/05/2021,03/03/2022,Enhanced America,Amex,Annual,$ 0,$ 5593.245,Health Insurance Services International,20,$ 1118.65,,,,,,,,,,$ 1328.4,$ 139.83,$ 1677.97,,,,
Fennessy Kellie,691802052713,03/01/2021,02/27/2022,Essential America,Visa,Annual,$ 0,$ 3313,Cecille Brechin,27,$ 894.51,,,,,,,,,,$ 786.84,$ 82.83,$ 761.99,,,,
Hynson Brittany,691802052705,03/01/2021,02/27/2022,Essential America,Visa,Annual,$ 0,$ 2656,Doug Gulleson,25,$ 664,,,,,,,,,,$ 630.8,$ 66.4,$ 664,,,,
MASCI BRUNO,691802052699,02/23/2021,02/21/2022,Enhanced America,Visa,Annual,$ 25,$ 7158.9,Robert Williams,30,$ 2155.17,,,,,,,,,,$ 1706.18,$ 179.6,$ 1436.78,,,,
Baldino Jimena,691802052544,02/17/2021,02/15/2022,Essential America,Visa,Quarterly,$ 0,$ 761.544,Customer Service,35,$ 266.54,,,,,,,,,,$ 180.87,$ 19.04,$ 114.23,,,,
Yong Brian,691802052598,02/17/2021,02/15/2022,Enhanced America,Visa,Quarterly,$ 35,$ 989.1343,ARS Default,50,$ 512.07,,,,,,,,,,$ 243.23,$ 25.6,$ 0,,,,
Ker Chloe,691802052231,02/16/2021,02/14/2022,Essential America,MasterCard,Quarterly,$ 0,$ 453.84192,Customer Service,35,$ 158.84,,,,,,,,,,$ 107.79,$ 11.35,$ 68.08,,,,
Germanovich Angela,691802051853,02/15/2021,02/13/2022,Essential America,MasterCard,Annual,$ 0,$ 1521,Craig Robinson,31,$ 471.51,,,,,,,,,,$ 361.24,$ 38.03,$ 288.99,,,,
Johnson Jesse,691802052206,02/02/2021,01/31/2022,Essential America,Visa,Annual,$ 0,$ 996,Doug Gulleson,25,$ 249,,,,,,,,,,$ 236.55,$ 24.9,$ 249,,,,
King Chris,691802052109,02/02/2021,01/31/2022,Essential America,MasterCard,Semi,$ 0,$ 3175.535,Customer Service,35,$ 1111.44,,,,,,,,,,$ 754.19,$ 79.39,$ 476.33,,,,
Walker Rachel,691802052207,02/01/2021,01/30/2022,Essential America,Visa,Annual,$ 0,$ 1319,ARS Default,50,$ 659.5,,,,,,,,,,$ 313.26,$ 32.98,$ 0,,,,
Summers Joshua,691802052053,02/01/2021,01/30/2022,Essential America,Visa,Annual,$ 0,$ 2173.2,Doug Gulleson,25,$ 543.3,,,,,,,,,,$ 516.14,$ 54.33,$ 543.3,,,,
Province Derek,691802052110,01/29/2021,01/27/2022,Essential International,Visa,Monthly,$ 0,$ 207.263448,Craig Robinson,31,$ 64.25,,,,,,,,,,$ 49.23,$ 5.18,$ 39.38,,,,
Wilkes Samantha,691802051463,01/25/2021,01/23/2022,Enhanced America,MasterCard,Monthly,$ 0,$ 795.648,ARS Default,50,$ 397.82,,,,,,,,,,$ 188.97,$ 19.89,$ 0,,,,
Summerlin Nicholas,691802052059,01/22/2021,01/20/2022,Essential International,MasterCard,Quarterly,$ 0,$ 779.24,Carisse L. Collins,15,$ 116.89,Craig Robinson,0,$ 0,,,,,,,$ 185.07,$ 19.48,$ 272.73,,,,
Selby Gabriela,691802052039,01/20/2021,01/18/2022,Essential America,Visa,Monthly,$ 0,$ 109.8,Customer Service,35,$ 38.43,,,,,,,,,,$ 26.08,$ 2.75,$ 16.47,,,,
Burke Robert,691802049165,01/16/2021,01/14/2022,Essential America,Visa,Annual,$ 0,$ 3589,ARS Default,50,$ 1794.5,,,,,,,,,,$ 852.39,$ 89.73,$ 0,,,,
Swain Emma,691802051843,01/13/2021,01/11/2022,Enhanced America,Visa,Annual,$ 0,$ 0,Cecille Brechin,27,$ 0,,,,,,,,,,$ 0,$ 0,$ 0,,,,
Phillips Jena,691802051784,01/12/2021,01/10/2022,Essential America,MasterCard,Quarterly,$ 0,$ 665.756,Doug Gulleson,25,$ 166.44,,,,,,,,,,$ 158.12,$ 16.64,$ 166.44,,,,
Irwin Hannah,691802051798,01/11/2021,01/09/2022,Essential America,Visa,Annual,$ 25,$ 1098,ARS Default,50,$ 561.5,,,,,,,,,,$ 266.71,$ 28.08,$ 0,,,,
Smith Ronald,691802051730,01/11/2021,01/09/2022,Essential America,Visa,Annual,$ 0,$ 3543,Doug Gulleson,25,$ 885.75,,,,,,,,,,$ 841.46,$ 88.58,$ 885.75,,,,
Barisich Brooke,691802051655,01/10/2021,01/08/2022,Essential America,Visa,Annual,$ 0,$ 1521,ARS Default,50,$ 760.5,,,,,,,,,,$ 361.24,$ 38.03,$ 0,,,,
Reed Matthew,691802051744,01/04/2021,01/02/2022,Essential International,Visa,Annual,$ 0,$ 1123.55,Craig Robinson,31,$ 348.3,,,,,,,,,,$ 266.84,$ 28.09,$ 213.47,,,,
Nelson William,691802051727,01/01/2021,12/30/2021,Essential America,Visa,Annual,$ 0,$ 1863,Doug Gulleson,25,$ 465.75,,,,,,,,,,$ 442.46,$ 46.58,$ 465.75,,,,
Neufeld Erik,691802051461,01/01/2021,12/30/2021,Essential America,Visa,Annual,$ 0,$ 3440.2,Doug Gulleson,25,$ 860.05,,,,,,,,,,$ 817.05,$ 86.01,$ 860.05,,,,
Chen Guojian,691802051283,01/01/2021,12/30/2021,Essential America,Visa,Annual,$ 0,$ 5366,ARS Default,50,$ 2683,,,,,,,,,,$ 1274.43,$ 134.15,$ 0,,,,
Haynes Matthew,691802051477,01/01/2021,12/30/2021,Essential America,Visa,Quarterly,$ 0,$ 829.92,Joseph James Pridgen,20,$ 165.98,,,,,,,,,,$ 197.11,$ 20.75,$ 248.98,,,,
Neville Michael ,691802051502,01/01/2021,12/30/2021,Enhanced America,Amex,Annual,$ 0,$ 2898,Craig Robinson,31,$ 898.38,,,,,,,,,,$ 688.28,$ 72.45,$ 550.62,,,,
Beacon Series,
Paul Celestin Anne Marie Martine,691802109112,12/31/2021,01/10/2022,Beacon America,Amex,Single,$ 0,$ 45.25,Ann Martine Paul,15,$ 6.79,Pierre Armand Gation,-30,$ -13.58,,,,,,,$ 10.75,$ 1.13,$ 29.41,,,,
Chen Ruodi,691802108895,12/31/2021,01/04/2022,Beacon International,Visa,Single,$ 0,$ 0,Insubuy  Inc,35,$ 0,,,,,,,,,,$ 0,$ 0,$ 0,,,,
dan masaki,691802109087,12/31/2021,01/20/2022,Beacon International,Visa,Single,$ 0,$ 51.03,ARS Default,50,$ 25.52,,,,,,,,,,$ 12.12,$ 1.28,$ 0,,,,
Chen Ruodi,691802108702,12/31/2021,01/04/2022,Beacon International,Visa,Single,$ 0,$ 0,Insubuy  Inc,35,$ 0,,,,,,,,,,$ 0,$ 0,$ 0,,,,
Leon Katiuska Maria,691802109116,12/31/2021,01/31/2022,Beacon America,Visa,Single,$ 0,$ 149.6,Nelson Sucre Rivas,15,$ 22.44,Elite International E. Gelves,-30,$ -44.88,,,,,,,$ 35.53,$ 3.74,$ 97.24,,,,
Kangas Andreas,691802108958,12/31/2021,01/05/2022,Beacon America,AMEX,Single,$ 0,$ 39.6,Insubuy  Inc,35,$ 13.86,,,,,,,,,,$ 9.41,$ 0.99,$ 5.94,,,,
Xu Yingzhen,691802109114,12/31/2021,01/30/2022,Beacon America,Visa,Single,$ 0,$ 146.48,Insubuy  Inc,35,$ 51.27,,,,,,,,,,$ 34.79,$ 3.66,$ 21.97,,,,
Mendez Jonathan Andair,691802108861,12/31/2021,01/15/2022,Beacon International,Visa,Single,$ 0,$ 10.88,Insubuy  Inc,35,$ 3.81,,,,,,,,,,$ 2.58,$ 0.27,$ 1.63,,,,
Goguri Sumaja Reddy,691802109118,12/31/2021,05/06/2022,Beacon America,Visa,Single,$ 0,$ 130.81,Insubuy  Inc,35,$ 45.78,,,,,,,,,,$ 31.07,$ 3.27,$ 19.62,,,,
Mendez Kenneth joel,691802108863,12/31/2021,01/15/2022,Beacon International,Visa,Single,$ 0,$ 12.14,Insubuy  Inc,35,$ 4.25,,,,,,,,,,$ 2.88,$ 0.3,$ 1.82,,,,
Sachs John,691802109092,12/31/2021,03/21/2022,Beacon International,Visa,Single,$ 0,$ 431.31,ARS Default,50,$ 215.66,,,,,,,,,,$ 102.44,$ 10.78,$ 0,,,,
Stride Judith Berenice,691802108955,12/31/2021,01/05/2022,Beacon America,AMEX,Single,$ 0,$ 31.2,Insubuy  Inc,35,$ 10.92,,,,,,,,,,$ 7.41,$ 0.78,$ 4.68,,,,
Nallakaluva Radhamma,691802109104,12/31/2021,03/31/2022,Beacon America,MasterCard,Single,$ 0,$ 343.98,Insubuy  Inc,35,$ 120.39,,,,,,,,,,$ 81.7,$ 8.6,$ 51.6,,,,
Su Bei,691802108133,12/31/2021,01/16/2022,Beacon International,Visa,Single,$ 0,$ 25.08,Insubuy Inc.,35,$ 8.78,Insubuy  Inc,0,$ 0,,,,,,,$ 5.96,$ 0.63,$ 3.76,,,,
Cheng Caroline,691802109110,12/31/2021,01/16/2022,Beacon America,Visa,Single,$ 0,$ 21.89,Insubuy  Inc,35,$ 7.66,,,,,,,,,,$ 5.2,$ 0.55,$ 3.28,,,,
Soumah Mmawa,691802108224,12/31/2021,01/23/2022,Beacon International,MasterCard,Single,$ 0,$ 18.24,Insubuy Inc.,35,$ 6.38,Insubuy  Inc,0,$ 0,,,,,,,$ 4.33,$ 0.46,$ 2.74,,,,
Kesanapalli Chinna Narayana,691802109119,12/31/2021,01/04/2022,Beacon America,MasterCard,Single,$ 0,$ 15.12,Insubuy  Inc,35,$ 5.29,,,,,,,,,,$ 3.59,$ 0.38,$ 2.27,,,,
nadiminti chinmayee,691802108889,12/30/2021,01/08/2022,Beacon International,Visa,Single,$ 0,$ 8,Insubuy  Inc,35,$ 2.8,,,,,,,,,,$ 1.9,$ 0.2,$ 1.2,,,,
Rios Batista Guadalupe,691802109101,12/30/2021,01/16/2022,Beacon America,MasterCard,Single,$ 0,$ 105.21,Insubuy  Inc,35,$ 36.82,,,,,,,,,,$ 24.99,$ 2.63,$ 15.78,,,,
Koster Jessica,691802108735,12/30/2021,12/28/2022,Beacon International,Visa,Single,$ 0,$ 524.16,Cecille Brechin,27,$ 141.52,,,,,,,,,,$ 124.49,$ 13.1,$ 120.56,,,,
Barrows Ian Macdill,691802109088,12/30/2021,01/03/2022,Beacon International,MasterCard,Single,$ 0,$ 3.4,Insubuy  Inc,35,$ 1.19,,,,,,,,,,$ 0.81,$ 0.09,$ 0.51,,,,
Tchoi P,691802107377,12/30/2021,12/28/2022,Beacon International,AMEX,Single,$ 0,$ 0,Insubuy Inc.,35,$ 0,Insubuy  Inc,0,$ 0,,,,,,,$ 0,$ 0,$ 0,,,,
Gomaa Osama Farouk Sayed,691802109075,12/30/2021,01/08/2022,Beacon International,MasterCard,Single,$ 0,$ 5.53,ARS Default,50,$ 2.77,,,,,,,,,,$ 1.31,$ 0.14,$ 0,,,,
Young Nina Carmela,691802107929,12/30/2021,08/31/2022,Beacon International,AMEX,Single,$ 0,$ 275.63,Insubuy Inc.,35,$ 96.47,Insubuy  Inc,0,$ 0,,,,,,,$ 65.46,$ 6.89,$ 41.34,,,,