Client Name,Identification #,Eff. Date,Term Date,Plan,Payment,Payment Mode,Express Mail Amount,Premium,Agent #1,Comm %,Agent #1 Pmt.,Agent #2,Comm %,Agent #2 Pmt.,Agent #3,Comm %,Agent #3 Pmt.,Agent #4,Comm %,Agent #4 Pmt.,Claims Acc Fund,BMS Comm,ARS Comm,Comm Date,Merchant Fees,Surplus,
Meridian Series,
Lewis  Wendy,691802110278,03/04/2022,03/02/2023,Essential America,Visa,Annual,$ 0,$ 7505,Cecille Brechin,27,$ 2026.35,,,,,,,,,,$ 1782.44,$ 187.63,$ 1726.15,,,,
McKarcher  Joshua,691802110287,03/04/2022,03/02/2023,Essential America,Amex,Annual,$ 0,$ 4201,Bob Jankovics,25,$ 1050.25,,,,,,,,,,$ 997.74,$ 105.03,$ 1050.25,,,,
Beacon Series,
Enoch  NFN,691802110258,03/14/2022,03/12/2023,Beacon International,Visa,Single,$ 0,$ 709.8,Visitors Insurance,15,$ 106.47,,,,,,,,,,$ 168.58,$ 17.75,$ 248.43,,,,
MEHTA  SUHAS KIRAN,691802110705,03/14/2022,05/01/2022,Beacon America,AMEX,Single,$ 0,$ 263.72,Insubuy  Inc,35,$ 92.3,,,,,,,,,,$ 62.63,$ 6.59,$ 39.56,,,,
Anous  Hamza Mohamed Hamza Mohamed,691802110399,03/14/2022,03/18/2022,Beacon International,MasterCard,Single,$ 0,$ 2.84,ARS Default,50,$ 1.42,,,,,,,,,,$ 0.67,$ 0.07,$ 0,,,,
Thongneam  Dolporn,691802110231,03/14/2022,03/19/2022,Beacon International,Visa,Single,$ 0,$ 6.75,Insubuy  Inc,35,$ 2.36,,,,,,,,,,$ 1.6,$ 0.17,$ 1.01,,,,
Santos  Dean Pambid,691802110664,03/14/2022,03/24/2022,Beacon International,Visa,Single,$ 0,$ 37.95,Insubuy  Inc,35,$ 13.28,,,,,,,,,,$ 9.01,$ 0.95,$ 5.69,,,,
Desai  Abhay Madhav,691802110634,03/14/2022,09/04/2022,Beacon America,Visa,Single,$ 0,$ 1151.5,Insubuy  Inc,35,$ 403.03,,,,,,,,,,$ 273.48,$ 28.79,$ 172.73,,,,
LING  FAI ENG,691802110665,03/14/2022,03/24/2022,Beacon International,MasterCard,Single,$ 0,$ 14.74,Insubuy  Inc,35,$ 5.16,,,,,,,,,,$ 3.5,$ 0.37,$ 2.21,,,,
Carter  Amber,691802110727,03/14/2022,03/18/2022,Beacon International,Visa,Single,$ 0,$ 4,Insubuy  Inc,35,$ 1.4,,,,,,,,,,$ 0.95,$ 0.1,$ 0.6,,,,
Lushtak  Aleksandra,691802109890,03/14/2022,03/26/2022,Beacon International,Visa,Single,$ 0,$ 44.36,Insubuy Inc.,35,$ 15.53,Insubuy  Inc,0,$ 0,,,,,,,$ 10.54,$ 1.11,$ 6.65,,,,
Guererro  Ma Katrina Velarde,691802110501,03/14/2022,04/05/2022,Beacon International,Visa,Single,$ 0,$ 23.23,Insubuy  Inc,35,$ 8.13,,,,,,,,,,$ 5.52,$ 0.58,$ 3.48,,,,
Mcgrew  Ernesto,691802110502,03/14/2022,04/05/2022,Beacon International,Visa,Single,$ 0,$ 23.23,Insubuy  Inc,35,$ 8.13,,,,,,,,,,$ 5.52,$ 0.58,$ 3.48,,,,
Lushtak  Theodore,691802109889,03/14/2022,03/26/2022,Beacon International,Visa,Single,$ 0,$ 12.68,Insubuy Inc.,35,$ 4.44,Insubuy  Inc,0,$ 0,,,,,,,$ 3.01,$ 0.32,$ 1.9,,,,
Devi  Laxmi,691802110707,03/14/2022,08/08/2022,Beacon America,Visa,Single,$ 25,$ 805.12,Insubuy  Inc,35,$ 290.54,,,,,,,,,,$ 197.15,$ 20.75,$ 124.52,,,,
becker  sharon,691802110049,03/14/2022,03/20/2022,Beacon America,MasterCard,Single,$ 0,$ 45.5,Miles Zimbaluk,20,$ 9.1,Insubuy  Inc,0,$ 0,,,,,,,$ 10.81,$ 1.14,$ 13.65,,,,
Dettada  Kanokporn,691802110381,03/14/2022,03/19/2022,Beacon International,Visa,Single,$ 0,$ 6.75,Insubuy  Inc,35,$ 2.36,,,,,,,,,,$ 1.6,$ 0.17,$ 1.01,,,,
Delos Reyes  Jiezell ,691802110734,03/14/2022,03/16/2022,Beacon International,MasterCard,Single,$ 0,$ 5.88,Alonso R. Cornejo,25,$ 1.47,,,,,,,,,,$ 1.4,$ 0.15,$ 1.47,,,,
SHAH  HINA,691802110701,03/14/2022,05/01/2022,Beacon America,AMEX,Single,$ 0,$ 164.93,Insubuy  Inc,35,$ 57.73,,,,,,,,,,$ 39.17,$ 4.12,$ 24.74,,,,
Fankell  Tricia,691802110732,03/14/2022,03/23/2022,Beacon International,Visa,Single,$ 0,$ 40.88,ARS Default,50,$ 20.44,,,,,,,,,,$ 9.71,$ 1.02,$ 0,,,,
Gilmore  Tess Marie,691802110718,03/14/2022,03/23/2022,Beacon International,MasterCard,Single,$ 0,$ 6.8,Insubuy  Inc,35,$ 2.38,,,,,,,,,,$ 1.62,$ 0.17,$ 1.02,,,,
Singh  Sudager,691802110721,03/14/2022,08/15/2022,Beacon America,Visa,Single,$ 0,$ 601.4,Insubuy  Inc,35,$ 210.49,,,,,,,,,,$ 142.83,$ 15.04,$ 90.21,,,,
Kasaraneni  Ravi Sankar,691802110533,03/14/2022,05/10/2022,Beacon America,Visa,Single,$ 0,$ 186.33,Insubuy  Inc,35,$ 65.22,,,,,,,,,,$ 44.25,$ 4.66,$ 27.95,,,,
RACHAMADUGU  SUVARNADEVI,691802107976,03/13/2022,05/14/2022,Beacon America,Cheque,Single,$ 0,$ 331.63,Insubuy  Inc,35,$ 116.07,,,,,,,,,,$ 78.76,$ 8.29,$ 49.74,,,,
Gopalakrishnan  Annapoorani,691802110595,03/13/2022,05/18/2022,Beacon America,Visa,Single,$ 0,$ 403.34,Insubuy  Inc,35,$ 141.17,,,,,,,,,,$ 95.79,$ 10.08,$ 60.5,,,,
Oumer  Mohammed Abdi,691802110712,03/13/2022,03/19/2022,Beacon International,MasterCard,Single,$ 0,$ 7.28,Insubuy  Inc,35,$ 2.55,,,,,,,,,,$ 1.73,$ 0.18,$ 1.09,,,,
Pio  Graciella Marie,691802110699,03/13/2022,03/20/2022,Beacon International,MasterCard,Single,$ 0,$ 4.48,Insubuy  Inc,35,$ 1.57,,,,,,,,,,$ 1.06,$ 0.11,$ 0.67,,,,
Payne   Michael,691802110697,03/13/2022,03/21/2022,Beacon International,Visa,Single,$ 0,$ 17.55,ARS Default,50,$ 8.78,,,,,,,,,,$ 4.17,$ 0.44,$ 0,,,,
Iftikhar  Rubina,691802110702,03/13/2022,04/30/2022,Beacon America,AMEX,Single,$ 0,$ 374.85,Insubuy  Inc,35,$ 131.2,,,,,,,,,,$ 89.03,$ 9.37,$ 56.23,,,,
Khalid  Mudassar,691802110696,03/13/2022,03/25/2022,Beacon International,Visa,Single,$ 0,$ 17.42,Insubuy  Inc,35,$ 6.1,,,,,,,,,,$ 4.14,$ 0.44,$ 2.61,,,,
Variathparambil Oommerkutty  Abdul Nazar,691802110694,03/13/2022,08/20/2022,Beacon America,MasterCard,Single,$ 0,$ 775.38,Insubuy  Inc,35,$ 271.38,,,,,,,,,,$ 184.15,$ 19.38,$ 116.31,,,,
Bhagavatula  Nageswara Sastry,691802110693,03/13/2022,09/11/2022,Beacon America,Visa,Single,$ 0,$ 1683.6,Insubuy  Inc,35,$ 589.26,,,,,,,,,,$ 399.86,$ 42.09,$ 252.54,,,,
Gupta  Anand Prakash,691802110711,03/13/2022,08/27/2022,Beacon America,Visa,Single,$ 0,$ 994.9,Insubuy  Inc,35,$ 348.22,,,,,,,,,,$ 236.29,$ 24.87,$ 149.24,,,,
Miller  Alexander michael,691802110674,03/13/2022,03/17/2022,Beacon International,Visa,Single,$ 0,$ 3.4,Insubuy  Inc,35,$ 1.19,,,,,,,,,,$ 0.81,$ 0.09,$ 0.51,,,,
Moriconi  Julie,691802110673,03/13/2022,03/17/2022,Beacon International,Visa,Single,$ 0,$ 11.55,Insubuy  Inc,35,$ 4.04,,,,,,,,,,$ 2.74,$ 0.29,$ 1.73,,,,
Fathima zuhra  Mohamed haneefa,691802110670,03/13/2022,03/17/2022,Beacon International,MasterCard,Single,$ 0,$ 5.5,Insubuy  Inc,35,$ 1.93,,,,,,,,,,$ 1.31,$ 0.14,$ 0.83,,,,
Balaji  Shivaprasad,691802110307,03/13/2022,03/19/2022,Beacon America,Cheque,Single,$ 0,$ 15.54,Insubuy  Inc,35,$ 5.44,,,,,,,,,,$ 3.69,$ 0.39,$ 2.33,,,,
LNU  Camsaripalli Radha,691802110659,03/13/2022,08/31/2022,Beacon America,Visa,Single,$ 0,$ 1315.8,Insubuy  Inc,35,$ 460.53,,,,,,,,,,$ 312.5,$ 32.9,$ 197.37,,,,
Kaunda  Francis Tisungane,691802110618,03/13/2022,08/11/2022,Beacon International,MasterCard,Single,$ 0,$ 113.7,Insubuy  Inc,35,$ 39.8,,,,,,,,,,$ 27,$ 2.84,$ 17.06,,,,
Martin  Ryan Donald,691802110654,03/13/2022,03/26/2022,Beacon International,Visa,Single,$ 0,$ 11.9,Insubuy  Inc,35,$ 4.17,,,,,,,,,,$ 2.83,$ 0.3,$ 1.79,,,,
Langton  Kelli Lynne,691802110523,03/12/2022,03/28/2022,Beacon International,AMEX,Single,$ 0,$ 33.32,Insubuy  Inc,35,$ 11.66,,,,,,,,,,$ 7.91,$ 0.83,$ 5,,,,
Innis  Kenneth David,691802110669,03/12/2022,04/11/2022,Beacon International,Discover,Single,$ 0,$ 32.55,Insubuy  Inc,35,$ 11.39,,,,,,,,,,$ 7.73,$ 0.81,$ 4.88,,,,
Okonkwo  Chinelo Ebele,691802110667,03/12/2022,03/19/2022,Beacon International,Visa,Single,$ 0,$ 11.79,Insubuy  Inc,35,$ 4.13,,,,,,,,,,$ 2.8,$ 0.29,$ 1.77,,,,
EME  UCHE ULU,691802108705,03/12/2022,03/30/2022,Beacon International,Visa,Single,$ 0,$ 61.75,Insubuy Inc.,35,$ 21.61,Insubuy  Inc,0,$ 0,,,,,,,$ 14.67,$ 1.54,$ 9.26,,,,
Hill  Harry,691802109663,03/12/2022,03/20/2022,Beacon International,MasterCard,Single,$ 0,$ 0,ARS Default,50,$ 0,,,,,,,,,,$ 0,$ 0,$ 0,,,,
Younes  Lina,691802110686,03/12/2022,04/05/2022,Beacon International,Visa,Single,$ 0,$ 20,Insubuy  Inc,35,$ 7,,,,,,,,,,$ 4.75,$ 0.5,$ 3,,,,
FANG  DELIANG,691802110662,03/12/2022,03/31/2022,Beacon America,Visa,Single,$ 0,$ 112.5,Insubuy  Inc,35,$ 39.38,,,,,,,,,,$ 26.72,$ 2.81,$ 16.88,,,,
GordonSomersArcher  Sebastian,691802110658,03/12/2022,03/16/2022,Beacon International,MasterCard,Single,$ 0,$ 3.4,Insubuy  Inc,35,$ 1.19,,,,,,,,,,$ 0.81,$ 0.09,$ 0.51,,,,
Garg  geetika,691802110619,03/12/2022,03/19/2022,Beacon International,MasterCard,Single,$ 0,$ 3.81,Insubuy  Inc,35,$ 1.33,,,,,,,,,,$ 0.9,$ 0.1,$ 0.57,,,,
garcia ochil  eduardo,691802110266,03/12/2022,03/27/2022,Beacon International,Visa,Single,$ 0,$ 25.87,Insubuy  Inc,35,$ 9.05,,,,,,,,,,$ 6.14,$ 0.65,$ 3.88,,,,
Miller  Loel,691802110656,03/12/2022,03/20/2022,Beacon International,Visa,Single,$ 0,$ 12.38,Amir Mushkat,23,$ 2.85,Insubuy  Inc,0,$ 0,,,,,,,$ 2.94,$ 0.31,$ 3.34,,,,
ZIMUNYA  KUZIVA,691802109744,03/12/2022,03/19/2022,Beacon International,Visa,Single,$ 0,$ 8,Insubuy  Inc,35,$ 2.8,,,,,,,,,,$ 1.9,$ 0.2,$ 1.2,,,,
Portales Hernandez  Griselda,691802110644,03/12/2022,03/19/2022,Beacon International,Visa,Single,$ 0,$ 6.8,Insubuy  Inc,35,$ 2.38,,,,,,,,,,$ 1.62,$ 0.17,$ 1.02,,,,
Singanallur Venkataramani  Subramanian,691802110529,03/12/2022,09/07/2022,Beacon America,AMEX,Single,$ 0,$ 0,Insubuy  Inc,35,$ 0,,,,,,,,,,$ 0,$ 0,$ 0,,,,
Marghoob  Omair Talib,691802110080,03/12/2022,03/20/2022,Beacon International,AMEX,Single,$ 0,$ 9.9,Insubuy  Inc,35,$ 3.47,,,,,,,,,,$ 2.35,$ 0.25,$ 1.49,,,,
Strydom  Christiaan Rudolph,691802109630,03/12/2022,03/20/2022,Beacon International,MasterCard,Single,$ 0,$ 9,Insubuy Inc.,35,$ 3.15,Insubuy  Inc,0,$ 0,,,,,,,$ 2.14,$ 0.23,$ 1.35,,,,
Martin  Heath Andrew,691802110685,03/12/2022,03/20/2022,Beacon International,Visa,Single,$ 0,$ 10.85,Insubuy  Inc,35,$ 3.8,,,,,,,,,,$ 2.58,$ 0.27,$ 1.63,,,,
Garcia  Serena Miriam,691802110608,03/11/2022,03/16/2022,Beacon International,Visa,Single,$ 0,$ 4.08,Insubuy  Inc,35,$ 1.43,,,,,,,,,,$ 0.97,$ 0.1,$ 0.61,,,,
Hu  Danielle Danyu,691802109579,03/11/2022,12/11/2022,Beacon International,Visa,Single,$ 0,$ 0,Insubuy Inc.,35,$ 0,Insubuy  Inc,0,$ 0,,,,,,,$ 0,$ 0,$ 0,,,,
Sun  Lijuan,691802110652,03/11/2022,03/20/2022,Beacon America,Visa,Single,$ 0,$ 56.25,Insubuy  Inc,35,$ 19.69,,,,,,,,,,$ 13.36,$ 1.41,$ 8.44,,,,
Martynska  Lucy Lloyd,691802110649,03/11/2022,03/15/2022,Beacon America,MasterCard,Single,$ 0,$ 6.5,Insubuy  Inc,35,$ 2.28,,,,,,,,,,$ 1.54,$ 0.16,$ 0.98,,,,
Kniveton  Isaac Bean,691802110648,03/11/2022,03/15/2022,Beacon America,MasterCard,Single,$ 0,$ 6.2,Insubuy  Inc,35,$ 2.17,,,,,,,,,,$ 1.47,$ 0.16,$ 0.93,,,,
Savillo  Benedicto ,691802110276,03/11/2022,07/15/2022,Beacon International,MasterCard,Single,$ 0,$ 0,ARS Default,50,$ 0,,,,,,,,,,$ 0,$ 0,$ 0,,,,
Foley  Seamus Parker,691802110647,03/11/2022,03/15/2022,Beacon International,Visa,Single,$ 0,$ 3.4,Insubuy  Inc,35,$ 1.19,,,,,,,,,,$ 0.81,$ 0.09,$ 0.51,,,,
Fafinski  Joseph Francis,691802110646,03/11/2022,03/15/2022,Beacon International,Visa,Single,$ 0,$ 3.4,Insubuy  Inc,35,$ 1.19,,,,,,,,,,$ 0.81,$ 0.09,$ 0.51,,,,
Ali  Rania Osman Hamedelniel Mohamed,691802110623,03/11/2022,03/15/2022,Beacon International,MasterCard,Single,$ 0,$ 2.84,ARS Default,50,$ 1.42,,,,,,,,,,$ 0.67,$ 0.07,$ 0,,,,
Tzeng  Yue Yun,691802110640,03/11/2022,04/17/2022,Beacon America,Discover,Single,$ 0,$ 273.6,Insubuy  Inc,35,$ 95.76,,,,,,,,,,$ 64.98,$ 6.84,$ 41.04,,,,
Valdez Strocchia  Emanuel Benjamin,691802109631,03/11/2022,06/11/2022,Beacon International,Visa,Single,$ 0,$ 88.35,Insubuy Inc.,35,$ 30.92,Insubuy  Inc,0,$ 0,,,,,,,$ 20.98,$ 2.21,$ 13.25,,,,
Niezgoda  Joshua Lawrence,691802110582,03/11/2022,03/19/2022,Beacon International,Visa,Single,$ 0,$ 7.2,Insubuy  Inc,35,$ 2.52,,,,,,,,,,$ 1.71,$ 0.18,$ 1.08,,,,
rayala  padmavathi,691802110629,03/11/2022,09/10/2022,Beacon America,Discover,Single,$ 0,$ 892.4,Insubuy  Inc,35,$ 312.34,,,,,,,,,,$ 211.95,$ 22.31,$ 133.86,,,,
Ge  Yao,691802110215,03/11/2022,04/01/2022,Beacon International,AMEX,Single,$ 0,$ 20.9,Insubuy  Inc,35,$ 7.32,,,,,,,,,,$ 4.96,$ 0.52,$ 3.14,,,,
Wang  Yeliujing,691802108008,03/11/2022,03/19/2022,Beacon International,MasterCard,Single,$ 0,$ 0,Insubuy Inc.,35,$ 0,Insubuy  Inc,0,$ 0,,,,,,,$ 0,$ 0,$ 0,,,,
Abduljaber  Mussab Ahmed Suliman ,691802110622,03/11/2022,03/15/2022,Beacon International,MasterCard,Single,$ 0,$ 2.77,ARS Default,50,$ 1.39,,,,,,,,,,$ 0.66,$ 0.07,$ 0,,,,
Mulanjurvadkara  Prameela,691802110627,03/10/2022,06/10/2022,Beacon America,AMEX,Single,$ 0,$ 418.5,Insubuy  Inc,35,$ 146.48,,,,,,,,,,$ 99.39,$ 10.46,$ 62.78,,,,
Etufunwa  Kendra Oluchi,691802110116,03/10/2022,03/15/2022,Beacon International,Visa,Single,$ 0,$ 6.75,Shazreh Malik,20,$ 1.35,Insubuy  Inc,0,$ 0,,,,,,,$ 1.6,$ 0.17,$ 2.03,,,,
Tummala  Ramamoorthy Naidu,691802110624,03/10/2022,04/30/2022,Beacon America,Visa,Single,$ 0,$ 213.93,Insubuy  Inc,35,$ 74.88,,,,,,,,,,$ 50.81,$ 5.35,$ 32.09,,,,
jasti  Uma Maheswari,691802110452,03/10/2022,05/10/2022,Beacon America,Visa,Single,$ 0,$ 203.24,Insubuy  Inc,35,$ 71.13,,,,,,,,,,$ 48.27,$ 5.08,$ 30.49,,,,
Rosenberger  Issac,691802110616,03/10/2022,03/15/2022,Beacon International,AMEX,Single,$ 0,$ 16.35,Insubuy  Inc,35,$ 5.72,,,,,,,,,,$ 3.88,$ 0.41,$ 2.45,,,,
Van Oss  Matthew David,691802110261,03/10/2022,03/08/2023,Beacon International,MasterCard,Single,$ 0,$ 327.6,Insubuy  Inc,35,$ 114.66,,,,,,,,,,$ 77.81,$ 8.19,$ 49.14,,,,
Wang  Yue,691802110617,03/10/2022,08/31/2022,Beacon America,Visa,Single,$ 0,$ 0,Insubuy  Inc,35,$ 0,,,,,,,,,,$ 0,$ 0,$ 0,,,,
Ramadoss  Gunasegaran,691802110566,03/10/2022,09/03/2022,Beacon International,Visa,Single,$ 0,$ 802.78,Insubuy  Inc,35,$ 280.97,,,,,,,,,,$ 190.66,$ 20.07,$ 120.42,,,,
Abi Rizk  Rouphael,691802109210,03/10/2022,05/09/2022,Beacon America,Cheque,Single,$ 0,$ 135.42,Insubuy  Inc,35,$ 47.4,,,,,,,,,,$ 32.16,$ 3.39,$ 20.31,,,,
Advani  Neelam Manoharlal,691802110633,03/10/2022,04/28/2022,Beacon America,Visa,Single,$ 0,$ 149.6,Insubuy  Inc,35,$ 52.36,,,,,,,,,,$ 35.53,$ 3.74,$ 22.44,,,,
RAMISETTI  VENKATESHWARA RAO,691802110630,03/10/2022,04/10/2022,Beacon America,Discover,Single,$ 0,$ 192.64,Insubuy  Inc,35,$ 67.42,,,,,,,,,,$ 45.75,$ 4.82,$ 28.9,,,,
Deo  Pushpa,691802110592,03/10/2022,09/30/2022,Beacon America,Visa,Single,$ 0,$ 0,MCIS MultiChoice Insurance Services  LLC,29.5,$ 0,,,,,,,,,,$ 0,$ 0,$ 0,,,,
Gupta  Ravindra Kumar,691802110626,03/10/2022,04/24/2022,Beacon America,MasterCard,Single,$ 0,$ 343.85,Insubuy  Inc,35,$ 120.35,,,,,,,,,,$ 81.66,$ 8.6,$ 51.58,,,,
Sewell  David,691802110621,03/10/2022,03/17/2022,Beacon International,Visa,Single,$ 0,$ 27.3,Insubuy  Inc,35,$ 9.56,,,,,,,,,,$ 6.48,$ 0.68,$ 4.1,,,,
shahriar  syed yousuf,691802110588,03/10/2022,03/26/2022,Beacon America,Visa,Single,$ 0,$ 57.72,Insubuy  Inc,35,$ 20.2,,,,,,,,,,$ 13.71,$ 1.44,$ 8.66,,,,
Gursel  Asli,691802110620,03/10/2022,03/14/2022,Beacon America,Visa,Single,$ 0,$ 13,Insubuy  Inc,35,$ 4.55,,,,,,,,,,$ 3.09,$ 0.33,$ 1.95,,,,
Meinhardt  Joan Marie,691802109638,03/10/2022,06/09/2022,Beacon International,MasterCard,Single,$ 0,$ 661.25,Insubuy Inc.,35,$ 231.44,Insubuy  Inc,0,$ 0,,,,,,,$ 157.05,$ 16.53,$ 99.19,,,,
XU  HEYANG,691802110593,03/09/2022,09/08/2022,Beacon America,MasterCard,Single,$ 0,$ 388.7,Wayne Wang,20,$ 77.74,Insubuy  Inc,0,$ 0,,,,,,,$ 92.32,$ 9.72,$ 116.61,,,,
Rodriguez  Agustin Jose,691802109818,03/09/2022,05/08/2022,Beacon International,Visa,Single,$ 0,$ 210.45,Insubuy Inc.,35,$ 73.66,Insubuy  Inc,0,$ 0,,,,,,,$ 49.98,$ 5.26,$ 31.57,,,,
Sukhathankar  Chandrakant Kamalakar,691802110509,03/09/2022,08/22/2022,Beacon America,AMEX,Single,$ 0,$ 1149.8,Insubuy  Inc,35,$ 402.43,,,,,,,,,,$ 273.08,$ 28.75,$ 172.47,,,,
Martinez  Alejandro,691802109564,03/09/2022,03/20/2022,Beacon International,Visa,Single,$ 0,$ 13.68,Insubuy  Inc,35,$ 4.79,,,,,,,,,,$ 3.25,$ 0.34,$ 2.05,,,,
Gomide  Carmen,691802110367,03/09/2022,06/09/2022,Beacon International,MasterCard,Single,$ 0,$ 575.44,Marcio Santos,20,$ 115.09,Marcio Santos,15,$ 86.32,Insubuy  Inc,-20,$ -115.09,,,,$ 136.67,$ 14.39,$ 201.4,,,,
Tai  AbdulKarim,691802110602,03/09/2022,03/18/2022,Beacon International,Visa,Single,$ 0,$ 49.5,Insubuy  Inc,35,$ 17.33,,,,,,,,,,$ 11.76,$ 1.24,$ 7.43,,,,
GREENBERG  PINCHAS,691802110599,03/09/2022,03/15/2022,Beacon International,Visa,Single,$ 0,$ 13.65,Jack Simca,10,$ 1.37,,,,,,,,,,$ 3.24,$ 0.34,$ 5.46,,,,
Salas  Rebecca Franco,691802110594,03/09/2022,04/25/2022,Beacon America,Visa,Single,$ 0,$ 179.4,Insubuy  Inc,35,$ 62.79,,,,,,,,,,$ 42.61,$ 4.49,$ 26.91,,,,
Haun  Eric William,691802110586,03/09/2022,03/14/2022,Beacon International,Visa,Single,$ 0,$ 4.08,Insubuy  Inc,35,$ 1.43,,,,,,,,,,$ 0.97,$ 0.1,$ 0.61,,,,
Dandawatimath  Mallikarjun,691802110584,03/09/2022,04/08/2022,Beacon America,AMEX,Single,$ 0,$ 146.63,Insubuy  Inc,35,$ 51.32,,,,,,,,,,$ 34.82,$ 3.67,$ 21.99,,,,
Narayanamoorthy  Shrinivasa,691802110556,03/09/2022,10/08/2022,Beacon America,AMEX,Single,$ 0,$ 1408.12,Insubuy  Inc,35,$ 492.84,,,,,,,,,,$ 334.43,$ 35.2,$ 211.22,,,,
annareddy  Krishna reddy,691802110465,03/09/2022,05/19/2022,Beacon America,Discover,Single,$ 0,$ 346.75,Insubuy  Inc,35,$ 121.36,,,,,,,,,,$ 82.35,$ 8.67,$ 52.01,,,,
annareddy  prashanthi,691802110466,03/09/2022,05/19/2022,Beacon America,Discover,Single,$ 0,$ 279.36,Insubuy  Inc,35,$ 97.78,,,,,,,,,,$ 66.35,$ 6.98,$ 41.9,,,,
Posca  Shauna Marie,691802107673,03/08/2022,03/31/2022,Beacon America,Cheque,Single,$ 0,$ 132.6,Miles Zimbaluk,20,$ 26.52,Insubuy  Inc,0,$ 0,,,,,,,$ 31.49,$ 3.32,$ 39.78,,,,
Ferguson  Roy,691802110577,03/08/2022,04/08/2022,Beacon America,Visa,Single,$ 0,$ 288,Jeff McKenzie,20,$ 57.6,Insubuy  Inc,0,$ 0,,,,,,,$ 68.4,$ 7.2,$ 86.4,,,,
Robalino Ponce  Wendy Isabel,691802110569,03/08/2022,03/12/2022,Beacon International,MasterCard,Single,$ 0,$ 5,Insubuy  Inc,35,$ 1.75,,,,,,,,,,$ 1.19,$ 0.13,$ 0.75,,,,
Yin  Xiaoling,691802108326,03/08/2022,04/30/2022,Beacon America,Cheque,Single,$ 0,$ 491.4,Insubuy  Inc,35,$ 171.99,,,,,,,,,,$ 116.71,$ 12.29,$ 73.71,,,,
Kaur  Jasvinder,691802110568,03/08/2022,04/09/2022,Beacon America,Visa,Single,$ 0,$ 198.66,Insubuy  Inc,35,$ 69.53,,,,,,,,,,$ 47.18,$ 4.97,$ 29.8,,,,
Lu  Jiajie,691802110565,03/08/2022,05/08/2022,Beacon America,MasterCard,Single,$ 0,$ 84.57,Insubuy  Inc,35,$ 29.6,,,,,,,,,,$ 20.09,$ 2.11,$ 12.69,,,,
Bombase  Maricel,691802110564,03/08/2022,03/12/2022,Beacon International,MasterCard,Single,$ 0,$ 5.88,Alonso R. Cornejo,25,$ 1.47,,,,,,,,,,$ 1.4,$ 0.15,$ 1.47,,,,
marmouget  vera,691802110563,03/08/2022,03/29/2022,Beacon International,Visa,Single,$ 0,$ 108.9,Insubuy  Inc,35,$ 38.12,,,,,,,,,,$ 25.86,$ 2.72,$ 16.34,,,,
Batra  Samanta,691802110065,03/08/2022,04/09/2022,Beacon International,AMEX,Single,$ 0,$ 61.88,Insubuy  Inc,35,$ 21.66,,,,,,,,,,$ 14.7,$ 1.55,$ 9.28,,,,
Josyula  Sivasankar,691802110553,03/08/2022,07/11/2022,Beacon America,Visa,Single,$ 0,$ 829.08,Insubuy  Inc,35,$ 290.18,,,,,,,,,,$ 196.91,$ 20.73,$ 124.36,,,,
Vu  Thi Hong Van,691802110578,03/08/2022,06/15/2022,Beacon America,Visa,Single,$ 0,$ 0,Insubuy  Inc,35,$ 0,,,,,,,,,,$ 0,$ 0,$ 0,,,,
king  jane,691802110435,03/07/2022,03/18/2022,Beacon International,MasterCard,Single,$ 0,$ 26.38,Doug Gulleson,22,$ 5.8,,,,,,,,,,$ 6.27,$ 0.66,$ 7.39,,,,
Owda  Qarma,691802110558,03/07/2022,03/11/2022,Beacon International,MasterCard,Single,$ 0,$ 33.28,Insubuy  Inc,35,$ 11.65,,,,,,,,,,$ 7.9,$ 0.83,$ 4.99,,,,
Lnu  Ravichandran Venugopal,691802110539,03/07/2022,07/10/2022,Beacon America,Visa,Single,$ 0,$ 530.71,ARS Default,50,$ 265.36,,,,,,,,,,$ 126.04,$ 13.27,$ 0,,,,
Mishra  Sushma,691802110480,03/07/2022,09/06/2022,Beacon America,Visa,Single,$ 0,$ 956.8,Insubuy  Inc,35,$ 334.88,,,,,,,,,,$ 227.24,$ 23.92,$ 143.52,,,,
Uzulens  Arturs,691802110514,03/07/2022,03/21/2022,Beacon International,Visa,Single,$ 0,$ 10.35,Insubuy  Inc,35,$ 3.62,,,,,,,,,,$ 2.46,$ 0.26,$ 1.55,,,,
Giannecchini  Philip Giovanni Francesco,691802110552,03/07/2022,05/16/2022,Beacon America,AMEX,Single,$ 0,$ 116.44,Insubuy  Inc,35,$ 40.75,,,,,,,,,,$ 27.65,$ 2.91,$ 17.47,,,,
Butun  Fatma,691802107526,03/07/2022,05/05/2022,Beacon America,Cheque,Single,$ 0,$ 283.8,Insubuy  Inc,35,$ 99.33,,,,,,,,,,$ 67.4,$ 7.1,$ 42.57,,,,
Azzazi  Miriam,691802110534,03/07/2022,03/11/2022,Beacon International,AMEX,Single,$ 0,$ 6.7,Insubuy  Inc,35,$ 2.35,,,,,,,,,,$ 1.59,$ 0.17,$ 1.01,,,,
Lang  Raphael,691802110547,03/07/2022,03/14/2022,Beacon International,Visa,Single,$ 0,$ 8,Insubuy  Inc,35,$ 2.8,,,,,,,,,,$ 1.9,$ 0.2,$ 1.2,,,,
Takalkar  Siya,691802110546,03/07/2022,03/14/2022,Beacon International,MasterCard,Single,$ 0,$ 7.07,Insubuy  Inc,35,$ 2.47,,,,,,,,,,$ 1.68,$ 0.18,$ 1.06,,,,
Gandhe  Prakash,691802110407,03/07/2022,07/14/2022,Beacon America,Amex,Single,$ 25,$ 0,MCIS MultiChoice Insurance Services  LLC,29.5,$ 7.38,,,,,,,,,,$ 5.94,$ 0.63,$ 5.13,,,,
Lizardo  Aileen,691802110545,03/07/2022,03/12/2022,Beacon International,Visa,Single,$ 0,$ 7.05,Alonso R. Cornejo,25,$ 1.76,,,,,,,,,,$ 1.67,$ 0.18,$ 1.76,,,,
Nair  Annikkattu Narayanan Janardhanan,691802109824,03/07/2022,04/06/2022,Beacon America,Cheque,Single,$ 0,$ 178.56,Insubuy  Inc,35,$ 62.5,,,,,,,,,,$ 42.41,$ 4.46,$ 26.78,,,,
Fonsmorti  Valerio,691802110542,03/07/2022,03/11/2022,Beacon America,Visa,Single,$ 0,$ 13,Insubuy  Inc,35,$ 4.55,,,,,,,,,,$ 3.09,$ 0.33,$ 1.95,,,,
Amin  Priyadarshini Hemraj,691802110537,03/07/2022,07/21/2022,Beacon America,AMEX,Single,$ 0,$ 901.46,Insubuy  Inc,35,$ 315.51,,,,,,,,,,$ 214.1,$ 22.54,$ 135.22,,,,
Mondal  Bhabani,691802110538,03/07/2022,04/05/2022,Beacon America,MasterCard,Single,$ 0,$ 216,Insubuy  Inc,35,$ 75.6,,,,,,,,,,$ 51.3,$ 5.4,$ 32.4,,,,
Ingraham  Sasha Taniesha,691802109666,03/07/2022,03/23/2022,Beacon International,Cheque,Single,$ 0,$ 11.56,Insubuy  Inc,35,$ 4.05,,,,,,,,,,$ 2.75,$ 0.29,$ 1.73,,,,
van Gulik  Merel Mireille,691802110195,03/07/2022,06/06/2022,Beacon International,MasterCard,Single,$ 0,$ 62.56,Insubuy  Inc,35,$ 21.9,,,,,,,,,,$ 14.86,$ 1.56,$ 9.38,,,,
Narine  Chunelall,691802110467,03/06/2022,03/27/2022,Beacon International,Visa,Single,$ 0,$ 63.58,Insubuy  Inc,35,$ 22.25,,,,,,,,,,$ 15.1,$ 1.59,$ 9.54,,,,
harrison  samuel clayton,691802109943,03/06/2022,03/16/2022,Beacon International,Visa,Single,$ 0,$ 34.16,Insubuy  Inc,35,$ 11.96,,,,,,,,,,$ 8.11,$ 0.85,$ 5.12,,,,
OConnor  Nancy,691802109760,03/06/2022,03/14/2022,Beacon International,Visa,Single,$ 0,$ 87.46,Bob Perogine,31,$ 27.11,,,,,,,,,,$ 20.77,$ 2.19,$ 16.62,,,,
BALASUBRAMANIAM  JEYALAKSHMI,691802109987,03/06/2022,08/20/2022,Beacon America,Visa,Single,$ 0,$ 1018.25,Insubuy  Inc,35,$ 356.39,,,,,,,,,,$ 241.83,$ 25.46,$ 152.74,,,,
Xu  Zhong,691802110128,03/06/2022,03/13/2022,Beacon International,Discover,Single,$ 0,$ 13.5,Insubuy  Inc,35,$ 4.73,,,,,,,,,,$ 3.21,$ 0.34,$ 2.03,,,,
Meuser  Jon mark,691802109683,03/06/2022,04/09/2022,Beacon International,Cheque,Single,$ 0,$ 162.75,Insubuy  Inc,35,$ 56.96,,,,,,,,,,$ 38.65,$ 4.07,$ 24.41,,,,
Xu  Zhong,691802110113,03/06/2022,03/13/2022,Beacon International,Discover,Single,$ 0,$ 0,Insubuy  Inc,35,$ 0,,,,,,,,,,$ 0,$ 0,$ 0,,,,
Jadapalli  Bhavani,691802110333,03/06/2022,06/20/2022,Beacon America,Discover,Single,$ 0,$ 342.4,Insubuy  Inc,35,$ 119.84,,,,,,,,,,$ 81.32,$ 8.56,$ 51.36,,,,
Silvestre  Elthan john Subia,691802110362,03/06/2022,04/03/2022,Beacon International,MasterCard,Single,$ 0,$ 19.72,Insubuy  Inc,35,$ 6.9,,,,,,,,,,$ 4.68,$ 0.49,$ 2.96,,,,
Silvestre  Edwin,691802110363,03/06/2022,04/03/2022,Beacon International,Visa,Single,$ 0,$ 60.96,Insubuy  Inc,35,$ 21.34,,,,,,,,,,$ 14.48,$ 1.52,$ 9.14,,,,
Vijayakumar  Cyenthia,691802110397,03/06/2022,04/04/2022,Beacon International,Visa,Single,$ 0,$ 56.25,Insubuy  Inc,35,$ 19.69,,,,,,,,,,$ 13.36,$ 1.41,$ 8.44,,,,
Subia  Wilfredo,691802110410,03/06/2022,03/15/2022,Beacon International,Discover,Single,$ 0,$ 28.9,Insubuy  Inc,35,$ 10.12,,,,,,,,,,$ 6.86,$ 0.72,$ 4.34,,,,
NAVANEETHAKRISHNAN  SUSILA,691802104723,03/06/2022,03/26/2022,Beacon America,Cheque,Single,$ 0,$ 200.81,Manikuttan Karthik Kailasam,20,$ 40.16,Insubuy  Inc,0,$ 0,,,,,,,$ 47.69,$ 5.02,$ 60.24,,,,
SIGLER  BENJAMIN ,691802110436,03/06/2022,03/09/2022,Beacon America,Visa,Single,$ 0,$ 10.69,Jack Simca,10,$ 1.07,,,,,,,,,,$ 2.54,$ 0.27,$ 4.28,,,,
Garcia Hernandez  Agata,691802110470,03/06/2022,03/22/2022,Beacon International,Visa,Single,$ 0,$ 13.6,Insubuy  Inc,35,$ 4.76,,,,,,,,,,$ 3.23,$ 0.34,$ 2.04,,,,
Amri  Elsa Edward,691802110472,03/06/2022,03/01/2023,Beacon International,Visa,Single,$ 0,$ 245.48,Insubuy  Inc,35,$ 85.92,,,,,,,,,,$ 58.3,$ 6.14,$ 36.82,,,,