Client Name,Identification #,Eff. Date,Term Date,Plan,Payment,Payment Mode,Premium,Agent #1,Comm %,Agent #1 Pmt.,Agent #2,Comm %,Agent #2 Pmt.,Agent #3,Comm %,Agent #3 Pmt.,Agent #4,Comm %,Agent #4 Pmt.,Claims Acc Fund,BMS Comm,ARS Comm,Comm Date,Merchant Fees,Surplus,
Meridian Series,
MORA  SHARON,691802107256,25/10/2021,23/10/2022,Essential America,Amex,Annual,$ 1216,Bob Jankovics,25,$ 304,,,,,,,,,,$ 288.8,$ 30.4,$ 304,,,,
Rasmussen  Junia,691802107251,21/10/2021,19/10/2022,Essential America,Visa,Annual,$ 0,Doug Gulleson,25,$ 0,,,,,,,,,,$ 0,$ 0,$ 0,,,,
Bhagavatula  Venkata,691802107225,21/10/2021,19/10/2022,Essential America,Visa,Monthly,$ 140.9,Ramesh or Bharati Patel,33,$ 46.497,,,,,,,,,,$ 33.46375,$ 3.5225,$ 23.953,,,,
Tiwari  Swapnil,691802107144,18/10/2021,16/10/2022,Essential America,Visa,Monthly,$ 224.2,Insurance Services of America,35,$ 78.47,,,,,,,,,,$ 53.2475,$ 5.605,$ 33.63,,,,
Huupponen  Krista,691802105669,18/10/2021,16/10/2022,Essential International,MasterCard,Annual,$ 689,ARS Default,50,$ 344.5,,,,,,,,,,$ 163.6375,$ 17.225,$ 0,,,,
Moorhead  Laura,691802107038,13/10/2021,11/10/2022,Essential America,Visa,Annual,$ 2437,Health Insurance Services International,20,$ 487.4,,,,,,,,,,$ 578.7875,$ 60.925,$ 731.1,,,,
Bixler  Jacqueline,691802106735,07/10/2021,05/10/2022,Essential America,Visa,Monthly,$ 161.2,Customer Service,35,$ 56.42,,,,,,,,,,$ 38.285,$ 4.03,$ 24.18,,,,
Bajpai  Amit,691802105771,04/10/2021,02/10/2022,Essential America,Visa,Monthly,$ 420.1,Visitors Insurance,15,$ 63.015,,,,,,,,,,$ 99.77375,$ 10.5025,$ 147.035,,,,
Fontes  Andrew,691802105811,04/10/2021,02/10/2022,Essential America,Visa,Annual,$ 1044,Launa Dene Brockman,20,$ 208.8,,,,,,,,,,$ 247.95,$ 26.1,$ 313.2,,,,
Wilson  Adam,691802105530,01/10/2021,29/09/2022,Enhanced America,Visa,Monthly,$ 316.7,ARS Default,50,$ 158.35,,,,,,,,,,$ 75.21625,$ 7.9175,$ 0,,,,
Thayer  Edmund,691802105567,01/10/2021,29/09/2022,Essential International,Visa,Annual,$ 1077,Insubuy  Inc,30,$ 323.1,,,,,,,,,,$ 255.7875,$ 26.925,$ 215.4,,,,
Iljazi  Servi,691802105586,27/09/2021,25/09/2022,Essential America,Visa,Monthly,$ 61.5,Insurance Services of America,35,$ 21.525,,,,,,,,,,$ 14.60625,$ 1.5375,$ 9.225,,,,
Ayala  Ricardo,691802105356,17/09/2021,15/09/2022,Enhanced America,Visa,Monthly,$ 284.855,ARS Default,50,$ 142.4275,,,,,,,,,,$ 67.6530625,$ 7.121375,$ 0,,,,
Evans  Mallory,691802104988,15/09/2021,13/09/2022,Enhanced America,Amex,Quarterly,$ 1844.654,Launa Dene Brockman,20,$ 368.9308,,,,,,,,,,$ 438.105325,$ 46.11635,$ 553.3962,,,,
Gordley  Andy,691802104931,02/09/2021,31/08/2022,Essential America,Visa,Annual,$ 6209,Doug Gulleson,25,$ 1552.25,,,,,,,,,,$ 1474.6375,$ 155.225,$ 1552.25,,,,
Warkenton  Christopher,691802104987,02/09/2021,31/08/2022,Enhanced America,MasterCard,Annual,$ 7108.9,Aldis Barsketis,17,$ 1208.513,Expat Insurance LLC,0,$ 0,,,,,,,$ 1688.36375,$ 177.7225,$ 2345.937,,,,
Koess  Stephen,691802104938,01/09/2021,30/08/2022,Essential International,Visa,Annual,$ 904,John McGee,30,$ 271.2,,,,,,,,,,$ 214.7,$ 22.6,$ 180.8,,,,
Dawson  Madeleine,691802105014,01/09/2021,30/08/2022,Essential America,Visa,Annual,$ 0,Doug Gulleson,25,$ 0,,,,,,,,,,$ 0,$ 0,$ 0,,,,
Histand  Carla,691802104556,01/09/2021,30/08/2022,Essential America,MasterCard,Annual,$ 2982.2,Doug Gulleson,25,$ 745.55,,,,,,,,,,$ 708.2725,$ 74.555,$ 745.55,,,,
Spalding  Martha,691802104880,01/09/2021,30/08/2022,Essential America,Visa,Annual,$ 4677.55,Warren Peterson,20,$ 935.51,,,,,,,,,,$ 1110.918125,$ 116.93875,$ 1403.265,,,,
Sackman  Sharon,691802104406,31/08/2021,29/08/2022,Enhanced America,MasterCard,Semi,$ 2085.6,Launa Dene Brockman,20,$ 417.12,,,,,,,,,,$ 495.33,$ 52.14,$ 625.68,,,,
kang  Susan,691802104964,30/08/2021,28/08/2022,Essential America,Visa,Monthly,$ 266.1,Launa Dene Brockman,20,$ 53.22,,,,,,,,,,$ 63.19875,$ 6.6525,$ 79.83,,,,
Saglimbeni  Sebastiano,691802104944,27/08/2021,25/08/2022,Essential America,MasterCard,Annual,$ 5055.75,Lourdes Calas,25,$ 1263.9375,,,,,,,,,,$ 1200.740625,$ 126.39375,$ 1263.9375,,,,
Abel  David,691802104892,25/08/2021,23/08/2022,Enhanced America,Amex,Annual,$ 2972.4,Expat Insurance LLC,25,$ 743.1,,,,,,,,,,$ 705.945,$ 74.31,$ 743.1,,,,
Myrte  Gabriel,691802104894,24/08/2021,22/08/2022,Essential America,Visa,Annual,$ 555,Doug Gulleson,25,$ 138.75,,,,,,,,,,$ 131.8125,$ 13.875,$ 138.75,,,,
Helmore  Claude ,691802104771,21/08/2021,19/08/2022,Enhanced America,Visa,Quarterly,$ 693.56,ARS Default,50,$ 346.78,,,,,,,,,,$ 164.7205,$ 17.339,$ 0,,,,
Adams  Benjamin,691802104720,21/08/2021,19/08/2022,Essential America,Visa,Annual,$ 4284,Craig Robinson,31,$ 1328.04,,,,,,,,,,$ 1017.45,$ 107.1,$ 813.96,,,,
Badrakh  Gantumur,691802104540,10/08/2021,08/08/2022,Essential America,Visa,Monthly,$ 722.4,ARS Default,50,$ 361.2,,,,,,,,,,$ 171.57,$ 18.06,$ 0,,,,
Wells  Daxell,691802098244,10/08/2021,08/08/2022,Essential America,Visa,Annual,$ 2791,Joseph James Pridgen,20,$ 558.2,,,,,,,,,,$ 662.8625,$ 69.775,$ 837.3,,,,
COUZYN  JAYDE,691802104430,05/08/2021,03/08/2022,Essential America,Visa,Monthly,$ 301.7,ARS Default,50,$ 150.85,,,,,,,,,,$ 71.65375,$ 7.5425,$ 0,,,,
WITTERSO  MAGNUS,691802104429,05/08/2021,03/08/2022,Enhanced America,Visa,Monthly,$ 316.7,ARS Default,50,$ 158.35,,,,,,,,,,$ 75.21625,$ 7.9175,$ 0,,,,
Rayle  Victoria,691802097705,03/08/2021,01/08/2022,Essential America,Visa,Annual,$ 1737,ARS Default,50,$ 868.5,,,,,,,,,,$ 412.5375,$ 43.425,$ 0,,,,
McElveen  Scott,691802078183,03/08/2021,01/08/2022,Essential America,Amex,Annual,$ 2426,Craig Robinson,31,$ 752.06,,,,,,,,,,$ 576.175,$ 60.65,$ 460.94,,,,
Collins  Philip,691802098052,02/08/2021,31/07/2022,Essential America,Visa,Annual,$ 5744,Craig Robinson,31,$ 1780.64,,,,,,,,,,$ 1364.2,$ 143.6,$ 1091.36,,,,
Nusair  Benyamin,691802098371,01/08/2021,30/07/2022,Essential International,MasterCard,Monthly,$ 105.9,Carisse L. Collins,15,$ 15.885,Craig Robinson,0,$ 0,,,,,,,$ 25.15125,$ 2.6475,$ 37.065,,,,
CHIRICHIELLO  LINDSEY,691802098369,01/08/2021,30/07/2022,Essential America,Visa,Monthly,$ 316.785,ARS Default,50,$ 158.3925,,,,,,,,,,$ 75.2364375,$ 7.919625,$ 0,,,,
Johnson  Stephen,691802078514,29/07/2021,27/07/2022,Essential America,MasterCard,Annual,$ 1784,John McGee,30,$ 535.2,,,,,,,,,,$ 423.7,$ 44.6,$ 356.8,,,,
Christensen  Dane,691802097974,26/07/2021,24/07/2022,Enhanced America,Visa,Annual,$ 1544.45,Mark Devlin,15,$ 231.6675,,,,,,,,,,$ 366.806875,$ 38.61125,$ 540.5575,,,,
Palamakula  Adithya,691802098336,26/07/2021,24/07/2022,Essential America,Amex,Semi,$ 1768.8,Visitors Insurance,15,$ 265.32,,,,,,,,,,$ 420.09,$ 44.22,$ 619.08,,,,
Delos Reyes  Myrna,691802078273,22/07/2021,20/07/2022,Essential America,Visa,Quarterly,$ 2632,Customer Service,35,$ 921.2,,,,,,,,,,$ 625.1,$ 65.8,$ 394.8,,,,
Zhang  Linkang,691802097992,16/07/2021,14/07/2022,Essential America,Visa,Annual,$ 836,ARS Default,50,$ 418,,,,,,,,,,$ 198.55,$ 20.9,$ 0,,,,
Thompson  Jeffery,691802078498,08/07/2021,06/07/2022,Clear America,Visa,Monthly,$ 14.99904,Robert Seay,15,$ 2.249856,,,,,,,,,,$ 3.562272,$ 0.374976,$ 5.249664,,,,
Jacobs  Spencer,691802078507,07/07/2021,05/07/2022,Essential America,Visa,Annual,$ 741,Steve Fillinger,15,$ 111.15,,,,,,,,,,$ 175.9875,$ 18.525,$ 259.35,,,,
Van Der Meer  Tasha ,691802078381,03/07/2021,01/07/2022,Essential America,Visa,Annual,$ 3603,ARS Default,50,$ 1801.5,,,,,,,,,,$ 855.7125,$ 90.075,$ 0,,,,
Entebi  Abraham,691802078131,01/07/2021,29/06/2022,Essential America,MasterCard,Monthly,$ 219.5,Carlos Noguera,25,$ 54.875,,,,,,,,,,$ 52.13125,$ 5.4875,$ 54.875,,,,
Gripman  Jacqueline,691802078269,01/07/2021,29/06/2022,Essential International,Visa,Monthly,$ 292.95,Carisse L. Collins,15,$ 43.9425,Craig Robinson,0,$ 0,,,,,,,$ 69.575625,$ 7.32375,$ 102.5325,,,,
Coahuila  Alejandra,691802078103,30/06/2021,28/06/2022,Essential America,Amex,Annual,$ 3191.58,Lourdes Calas,25,$ 797.895,,,,,,,,,,$ 758.00025,$ 79.7895,$ 797.895,,,,
Greene  Benjamin ,691802078232,29/06/2021,27/06/2022,Essential International,Visa,Annual,$ 2753,Launa Dene Brockman,20,$ 550.6,,,,,,,,,,$ 653.8375,$ 68.825,$ 825.9,,,,
Wood  Michael,691802077850,27/06/2021,25/06/2022,Essential America,Visa,Annual,$ 1248,Insurance Services of America,35,$ 436.8,,,,,,,,,,$ 296.4,$ 31.2,$ 187.2,,,,
Wood  Claire,691802077851,27/06/2021,25/06/2022,Essential International,Visa,Annual,$ 650,Insurance Services of America,35,$ 227.5,,,,,,,,,,$ 154.375,$ 16.25,$ 97.5,,,,
KUHNHOFF  KEVIN,691802077742,15/06/2021,13/06/2022,Essential America,Visa,Annual,$ 1135,Bob Jankovics,25,$ 283.75,,,,,,,,,,$ 269.5625,$ 28.375,$ 283.75,,,,
Vacca  Scott,691802077408,15/06/2021,13/06/2022,Essential America,Visa,Annual,$ 5126,Launa Dene Brockman,20,$ 1025.2,,,,,,,,,,$ 1217.425,$ 128.15,$ 1537.8,,,,
Jensen  Patrick,691802077473,15/06/2021,13/06/2022,Essential International,Visa,Annual,$ 3367.6,Customer Service,35,$ 1178.66,,,,,,,,,,$ 799.805,$ 84.19,$ 505.14,,,,
Hoover  Jackson,691802077871,15/06/2021,13/06/2022,Essential America,Visa,Annual,$ 524,Doug Gulleson,25,$ 131,,,,,,,,,,$ 124.45,$ 13.1,$ 131,,,,
Wild  Jill,691802077123,14/06/2021,12/06/2022,Essential America,Visa,Annual,$ 2196,Launa Dene Brockman,20,$ 439.2,,,,,,,,,,$ 521.55,$ 54.9,$ 658.8,,,,
Meyer  Sheryl,691802077326,01/06/2021,30/05/2022,Essential America,MasterCard,Quarterly,$ 767.48,Insurance Services of America,35,$ 268.618,,,,,,,,,,$ 182.2765,$ 19.187,$ 115.122,,,,
Otte  Grant,691802077296,01/06/2021,30/05/2022,Essential International,Visa,Annual,$ 676,ARS Default,50,$ 338,,,,,,,,,,$ 160.55,$ 16.9,$ 0,,,,
Fuller  Kenneth ,691802077233,31/05/2021,29/05/2022,Essential America,MasterCard,Annual,$ 950.25,Customer Service,35,$ 332.5875,,,,,,,,,,$ 225.684375,$ 23.75625,$ 142.5375,,,,
Singer  Nathan,691802076755,15/05/2021,13/05/2022,Essential America,Visa,Annual,$ 1135,John McGee,30,$ 340.5,,,,,,,,,,$ 269.5625,$ 28.375,$ 227,,,,
Hetzel  Richard,691802076895,12/05/2021,10/05/2022,Essential America,Visa,Annual,$ 3540.2325,Doug Gulleson,25,$ 885.058125,,,,,,,,,,$ 840.80521875,$ 88.5058125,$ 885.058125,,,,
Richardson  Eric,691802051857,07/05/2021,05/05/2022,Essential America,Visa,Annual,$ 2030,Customer Service,35,$ 710.5,,,,,,,,,,$ 482.125,$ 50.75,$ 304.5,,,,
Goyani  Shailesh Kumar,691802076807,06/05/2021,04/05/2022,Enhanced America,Visa,Monthly,$ 327.08,Visitors Insurance,15,$ 49.062,,,,,,,,,,$ 77.6815,$ 8.177,$ 114.478,,,,
Perelstein  Scott,691802053755,01/05/2021,29/04/2022,Essential International,Visa,Monthly,$ 330.36,John McGee,30,$ 99.108,,,,,,,,,,$ 78.4605,$ 8.259,$ 66.072,,,,
Waldorf  Lynn,691802053886,30/04/2021,28/04/2022,Essential International,Visa,Annual,$ 3030,Craig Robinson,31,$ 939.3,,,,,,,,,,$ 719.625,$ 75.75,$ 575.7,,,,
Quinn  Katelyn,691802053961,28/04/2021,26/04/2022,Essential America,Visa,Annual,$ 811,Craig Robinson,31,$ 251.41,,,,,,,,,,$ 192.6125,$ 20.275,$ 154.09,,,,
Mendoza  Cindi,691802053932,27/04/2021,25/04/2022,Essential America,Visa,Annual,$ 2496,Insurance Services of America,35,$ 873.6,,,,,,,,,,$ 592.8,$ 62.4,$ 374.4,,,,
Feder  Matthew,691802053630,23/04/2021,21/04/2022,Essential America,Visa,Annual,$ 5857,Craig Robinson,31,$ 1815.67,,,,,,,,,,$ 1391.0375,$ 146.425,$ 1112.83,,,,
Weil  Bonny,691802053522,12/04/2021,10/04/2022,Essential International,MasterCard,Annual,$ 2790,Launa Dene Brockman,20,$ 558,,,,,,,,,,$ 662.625,$ 69.75,$ 837,,,,
Witte  Dylan,691802053391,08/04/2021,06/04/2022,Essential America,MasterCard,Annual,$ 905,Craig Robinson,31,$ 280.55,,,,,,,,,,$ 214.9375,$ 22.625,$ 171.95,,,,
Ediga Venkata  Krishna Chaitanya,691802053465,05/04/2021,03/04/2022,Essential America,Visa,Monthly,$ 148.8,Visitors Insurance,15,$ 22.32,,,,,,,,,,$ 35.34,$ 3.72,$ 52.08,,,,
VanDeusen  Lesli,691802053415,01/04/2021,30/03/2022,Essential America,Amex,Annual,$ 5686,Cecille Brechin,27,$ 1535.22,,,,,,,,,,$ 1350.425,$ 142.15,$ 1307.78,,,,
Edwardes  Grace,691802053335,26/03/2021,24/03/2022,Essential America,MasterCard,Quarterly,$ 705.32,Customer Service,35,$ 246.862,,,,,,,,,,$ 167.5135,$ 17.633,$ 105.798,,,,
Bezerra  Gustavo ,691802053234,19/03/2021,17/03/2022,Essential America,Visa,Monthly,$ 337.05,Luiz M. Dasilva,25,$ 84.2625,Insurance Services of America,0,$ 0,,,,,,,$ 80.049375,$ 8.42625,$ 84.2625,,,,
lewis  jordan,691802050835,10/03/2021,08/03/2022,Essential America,Visa,Annual,$ 3525.9525,ARS Default,50,$ 1762.97625,,,,,,,,,,$ 837.41371875,$ 88.1488125,$ 0,,,,
BARRIOS  MARIA,691802052930,09/03/2021,07/03/2022,Clear International,Visa,Monthly,$ 97.8,Elberto J. Vaughan,30,$ 29.34,,,,,,,,,,$ 23.2275,$ 2.445,$ 19.56,,,,
Streever  William,691802052632,07/03/2021,05/03/2022,Essential America,MasterCard,Annual,$ 3751,Anita Warwick,25,$ 937.75,,,,,,,,,,$ 890.8625,$ 93.775,$ 937.75,,,,
Martin  Nickolas,691802052882,06/03/2021,04/03/2022,Essential America,Visa,Annual,$ 3402.85,Craig Robinson,31,$ 1054.8835,,,,,,,,,,$ 808.176875,$ 85.07125,$ 646.5415,,,,
Prouty  Shannon ,691802052676,05/03/2021,03/03/2022,Enhanced America,Amex,Annual,$ 5593.245,Health Insurance Services International,20,$ 1118.649,,,,,,,,,,$ 1328.3956875,$ 139.831125,$ 1677.9735,,,,
Squitieri  Andres,691802052817,05/03/2021,03/03/2022,Essential America,Visa,Annual,$ 853,Carlos Noguera,25,$ 213.25,,,,,,,,,,$ 202.5875,$ 21.325,$ 213.25,,,,
Fennessy  Kellie,691802052713,01/03/2021,27/02/2022,Essential America,Visa,Annual,$ 3313,Cecille Brechin,27,$ 894.51,,,,,,,,,,$ 786.8375,$ 82.825,$ 761.99,,,,
Hynson  Brittany,691802052705,01/03/2021,27/02/2022,Essential America,Visa,Annual,$ 2656,Doug Gulleson,25,$ 664,,,,,,,,,,$ 630.8,$ 66.4,$ 664,,,,
MASCI  BRUNO,691802052699,23/02/2021,21/02/2022,Enhanced America,Visa,Annual,$ 7183.9,Robert Williams,30,$ 2155.17,,,,,,,,,,$ 1706.17625,$ 179.5975,$ 1436.78,,,,
Baldino  Jimena,691802052544,17/02/2021,15/02/2022,Essential America,Visa,Quarterly,$ 761.544,Customer Service,35,$ 266.5404,,,,,,,,,,$ 180.8667,$ 19.0386,$ 114.2316,,,,
Yong  Brian,691802052598,17/02/2021,15/02/2022,Enhanced America,Visa,Quarterly,$ 1024.1343,ARS Default,50,$ 512.06715,,,,,,,,,,$ 243.23189625,$ 25.6033575,$ 0,,,,
Ker  Chloe,691802052231,16/02/2021,14/02/2022,Essential America,MasterCard,Quarterly,$ 453.84192,Customer Service,35,$ 158.844672,,,,,,,,,,$ 107.787456,$ 11.346048,$ 68.076288,,,,
Germanovich  Angela,691802051853,15/02/2021,13/02/2022,Essential America,MasterCard,Annual,$ 1521,Craig Robinson,31,$ 471.51,,,,,,,,,,$ 361.2375,$ 38.025,$ 288.99,,,,
Johnson  Jesse,691802052206,02/02/2021,31/01/2022,Essential America,Visa,Annual,$ 996,Doug Gulleson,25,$ 249,,,,,,,,,,$ 236.55,$ 24.9,$ 249,,,,
King  Chris,691802052109,02/02/2021,31/01/2022,Essential America,MasterCard,Semi,$ 3175.535,Customer Service,35,$ 1111.43725,,,,,,,,,,$ 754.1895625,$ 79.388375,$ 476.33025,,,,
Walker  Rachel,691802052207,01/02/2021,30/01/2022,Essential America,Visa,Annual,$ 1319,ARS Default,50,$ 659.5,,,,,,,,,,$ 313.2625,$ 32.975,$ 0,,,,
Summers  Joshua,691802052053,01/02/2021,30/01/2022,Essential America,Visa,Annual,$ 2173.2,Doug Gulleson,25,$ 543.3,,,,,,,,,,$ 516.135,$ 54.33,$ 543.3,,,,
Province  Derek,691802052110,29/01/2021,27/01/2022,Essential International,Visa,Monthly,$ 207.263448,Craig Robinson,31,$ 64.25166888,,,,,,,,,,$ 49.2250689,$ 5.1815862,$ 39.38005512,,,,
Wilkes  Samantha,691802051463,25/01/2021,23/01/2022,Enhanced America,MasterCard,Monthly,$ 795.648,ARS Default,50,$ 397.824,,,,,,,,,,$ 188.9664,$ 19.8912,$ 0,,,,
Summerlin  Nicholas,691802052059,22/01/2021,20/01/2022,Essential International,MasterCard,Quarterly,$ 779.24,Carisse L. Collins,15,$ 116.886,Craig Robinson,0,$ 0,,,,,,,$ 185.0695,$ 19.481,$ 272.734,,,,
Selby  Gabriela,691802052039,20/01/2021,18/01/2022,Essential America,Visa,Monthly,$ 109.8,Customer Service,35,$ 38.43,,,,,,,,,,$ 26.0775,$ 2.745,$ 16.47,,,,
Burke  Robert,691802049165,16/01/2021,14/01/2022,Essential America,Visa,Annual,$ 3589,ARS Default,50,$ 1794.5,,,,,,,,,,$ 852.3875,$ 89.725,$ 0,,,,
Swain  Emma,691802051843,13/01/2021,11/01/2022,Enhanced America,Visa,Annual,$ 0,Cecille Brechin,27,$ 0,,,,,,,,,,$ 0,$ 0,$ 0,,,,
Phillips  Jena,691802051784,12/01/2021,10/01/2022,Essential America,MasterCard,Quarterly,$ 665.756,Doug Gulleson,25,$ 166.439,,,,,,,,,,$ 158.11705,$ 16.6439,$ 166.439,,,,
Smith  Ronald,691802051730,11/01/2021,09/01/2022,Essential America,Visa,Annual,$ 3543,Doug Gulleson,25,$ 885.75,,,,,,,,,,$ 841.4625,$ 88.575,$ 885.75,,,,
Irwin  Hannah,691802051798,11/01/2021,09/01/2022,Essential America,Visa,Annual,$ 1123,ARS Default,50,$ 561.5,,,,,,,,,,$ 266.7125,$ 28.075,$ 0,,,,
Barisich  Brooke,691802051655,10/01/2021,08/01/2022,Essential America,Visa,Annual,$ 1521,ARS Default,50,$ 760.5,,,,,,,,,,$ 361.2375,$ 38.025,$ 0,,,,
Reed  Matthew,691802051744,04/01/2021,02/01/2022,Essential International,Visa,Annual,$ 1123.55,Craig Robinson,31,$ 348.3005,,,,,,,,,,$ 266.843125,$ 28.08875,$ 213.4745,,,,
Neufeld  Erik,691802051461,01/01/2021,30/12/2021,Essential America,Visa,Annual,$ 3440.2,Doug Gulleson,25,$ 860.05,,,,,,,,,,$ 817.0475,$ 86.005,$ 860.05,,,,
Chen  Guojian,691802051283,01/01/2021,30/12/2021,Essential America,Visa,Annual,$ 5366,ARS Default,50,$ 2683,,,,,,,,,,$ 1274.425,$ 134.15,$ 0,,,,
Haynes  Matthew,691802051477,01/01/2021,30/12/2021,Essential America,Visa,Quarterly,$ 829.92,Joseph James Pridgen,20,$ 165.984,,,,,,,,,,$ 197.106,$ 20.748,$ 248.976,,,,
Nelson  William,691802051727,01/01/2021,30/12/2021,Essential America,Visa,Annual,$ 1863,Doug Gulleson,25,$ 465.75,,,,,,,,,,$ 442.4625,$ 46.575,$ 465.75,,,,
Neville  Michael ,691802051502,01/01/2021,30/12/2021,Enhanced America,Amex,Annual,$ 2898,Craig Robinson,31,$ 898.38,,,,,,,,,,$ 688.275,$ 72.45,$ 550.62,,,,
Beacon Series,
Isila  Roberto santos,691802104994,31/10/2021,30/11/2021,Beacon International,Visa,Single,$ 24.8,Insubuy  Inc,35,$ 8.68,,,,,,,,,,$ 5.89,$ 0.62,$ 3.72,,,,
BRUZON CANTALLOPS  ALESSIA LEYANET,691802107419,31/10/2021,17/11/2021,Beacon International,Visa,Single,$ 21.38,Insubuy  Inc,35,$ 7.483,,,,,,,,,,$ 5.07775,$ 0.5345,$ 3.207,,,,
Rehman  Nigar,691802104334,31/10/2021,30/11/2021,Beacon America,,Single,$ 163.18,Insubuy  Inc,35,$ 57.113,,,,,,,,,,$ 38.75525,$ 4.0795,$ 24.477,,,,
Cadavieco Landeiro  Rigoberto,691802107402,31/10/2021,24/11/2021,Beacon International,Visa,Single,$ 57.75,Insubuy  Inc,35,$ 20.2125,,,,,,,,,,$ 13.715625,$ 1.44375,$ 8.6625,,,,
Rani  Nagamani Sudhakar,691802107182,31/10/2021,28/11/2021,Beacon America,MasterCard,Single,$ 111.85,Insubuy  Inc,35,$ 39.1475,,,,,,,,,,$ 26.564375,$ 2.79625,$ 16.7775,,,,
Said  Ola Nasir Mahmoud,691802107365,31/10/2021,07/11/2021,Beacon International,Visa,Single,$ 4.42,ARS Default,50,$ 2.21,,,,,,,,,,$ 1.04975,$ 0.1105,$ 0,,,,
Mendoza Verastegui  Jhosdan Norman,691802107409,31/10/2021,15/11/2021,Beacon International,Visa,Single,$ 11.04,Insubuy  Inc,35,$ 3.864,,,,,,,,,,$ 2.622,$ 0.276,$ 1.656,,,,
Rodriguez  Leilany,691802107413,31/10/2021,06/11/2021,Beacon International,Visa,Single,$ 6.19,Insubuy  Inc,35,$ 2.1665,,,,,,,,,,$ 1.470125,$ 0.15475,$ 0.9285,,,,
Assiri  Norah Mahdi A,691802107367,31/10/2021,07/11/2021,Beacon International,MasterCard,Single,$ 4.42,ARS Default,50,$ 2.21,,,,,,,,,,$ 1.04975,$ 0.1105,$ 0,,,,
baroudi  marwah,691802107368,31/10/2021,07/11/2021,Beacon International,Visa,Single,$ 4.42,ARS Default,50,$ 2.21,,,,,,,,,,$ 1.04975,$ 0.1105,$ 0,,,,
Ali  Mohammed Tajammul,691802107425,31/10/2021,04/11/2021,Beacon America,AMEX,Single,$ 21.6,Insubuy  Inc,35,$ 7.56,,,,,,,,,,$ 5.13,$ 0.54,$ 3.24,,,,
Gurla  Krishna Kumar,691802107428,31/10/2021,05/12/2021,Beacon America,Visa,Single,$ 0,Insubuy  Inc,35,$ 0,,,,,,,,,,$ 0,$ 0,$ 0,,,,
yousif  safa hussien badri,691802107366,31/10/2021,07/11/2021,Beacon International,Visa,Single,$ 4.42,ARS Default,50,$ 2.21,,,,,,,,,,$ 1.04975,$ 0.1105,$ 0,,,,
Hanumantharayappa  Lakshminarayana,691802107431,31/10/2021,04/11/2021,Beacon America,Visa,Single,$ 19.45,Insubuy  Inc,35,$ 6.8075,,,,,,,,,,$ 4.619375,$ 0.48625,$ 2.9175,,,,
Gorthi  Venkata Visalakshi,691802107424,31/10/2021,28/02/2022,Beacon America,Visa,Single,$ 544.5,Insubuy  Inc,35,$ 190.575,,,,,,,,,,$ 129.31875,$ 13.6125,$ 81.675,,,,
fang  bo,691802107322,31/10/2021,14/11/2021,Beacon International,MasterCard,Single,$ 20.25,Insubuy  Inc,35,$ 7.0875,,,,,,,,,,$ 4.809375,$ 0.50625,$ 3.0375,,,,
Hainsworth  Deborah Joan,691802107344,31/10/2021,28/02/2022,Beacon America,MasterCard,Single,$ 728.42,Insubuy  Inc,35,$ 254.947,,,,,,,,,,$ 172.99975,$ 18.2105,$ 109.263,,,,
Frias Termini  Fernando Antonio,691802104981,31/10/2021,30/11/2021,Beacon America,,Single,$ 49.99,Nelson Sucre Rivas,15,$ 7.4985,Elite International E. Gelves,-30,$ -14.997,,,,,,,$ 11.872625,$ 1.24975,$ 32.4935,,,,
safa  firas,691802105311,30/10/2021,07/11/2021,Beacon America,MasterCard,Single,$ 18.45,Insubuy  Inc,35,$ 6.4575,,,,,,,,,,$ 4.381875,$ 0.46125,$ 2.7675,,,,
Coulombe  Danny,691802107305,30/10/2021,01/01/2022,Beacon International,MasterCard,Single,$ 64.51,ARS Default,50,$ 32.255,,,,,,,,,,$ 15.321125,$ 1.61275,$ 0,,,,
Umaira  Safira,691802104985,30/10/2021,06/11/2021,Beacon International,Visa,Single,$ 6.8,Insubuy  Inc,35,$ 2.38,,,,,,,,,,$ 1.615,$ 0.17,$ 1.02,,,,
Chin Yuen Kee  Deryk Andrew,691802107371,30/10/2021,30/04/2022,Beacon International,MasterCard,Single,$ 358.68,Insubuy  Inc,35,$ 125.538,,,,,,,,,,$ 85.1865,$ 8.967,$ 53.802,,,,
guedez  marisela,691802107387,30/10/2021,08/11/2021,Beacon America,Visa,Single,$ 34.4,Insubuy  Inc,35,$ 12.04,,,,,,,,,,$ 8.17,$ 0.86,$ 5.16,,,,
Mohamed Sidy  Sidi Mohamed,691802106924,30/10/2021,06/11/2021,Beacon International,Visa,Single,$ 11.7,Insubuy Inc.,35,$ 4.095,Insubuy  Inc,0,$ 0,,,,,,,$ 2.77875,$ 0.2925,$ 1.755,,,,
Semenenko  Larisa,691802107416,30/10/2021,27/11/2021,Beacon America,Visa,Single,$ 130.5,Insubuy  Inc,35,$ 45.675,,,,,,,,,,$ 30.99375,$ 3.2625,$ 19.575,,,,
Limbu Pehim  Bhumi Raj,691802107410,30/10/2021,30/12/2021,Beacon America,Visa,Single,$ 245.52,Insubuy  Inc,35,$ 85.932,,,,,,,,,,$ 58.311,$ 6.138,$ 36.828,,,,
KIM  JOOEUN,691802107363,30/10/2021,15/11/2021,Beacon International,AMEX,Single,$ 55.25,Insubuy  Inc,35,$ 19.3375,,,,,,,,,,$ 13.121875,$ 1.38125,$ 8.2875,,,,
BHATNAGAR  SARANSH,691802107360,30/10/2021,31/12/2021,Beacon America,Discover,Single,$ 133.09,Insubuy  Inc,35,$ 46.5815,,,,,,,,,,$ 31.608875,$ 3.32725,$ 19.9635,,,,
Bhatnagar  Vandana,691802107357,30/10/2021,31/12/2021,Beacon America,Discover,Single,$ 386.98,Insubuy  Inc,35,$ 135.443,,,,,,,,,,$ 91.90775,$ 9.6745,$ 58.047,,,,
Lin  Christen,691802107215,30/10/2021,19/11/2021,Beacon International,Visa,Single,$ 0,Linda Lynn,15,$ 0,,,,,,,,,,$ 0,$ 0,$ 0,,,,
Urena  Carla Ruth,691802107347,30/10/2021,20/11/2021,Beacon International,Visa,Single,$ 55.9,Insubuy  Inc,35,$ 19.565,,,,,,,,,,$ 13.27625,$ 1.3975,$ 8.385,,,,
Mizban  Hebah,691802105239,30/10/2021,30/09/2022,Beacon International,Visa,Single,$ 285.6,Insubuy Inc.,35,$ 99.96,Insubuy  Inc,0,$ 0,,,,,,,$ 67.83,$ 7.14,$ 42.84,,,,
Cancilla  Kevin,691802107282,30/10/2021,07/11/2021,Beacon International,Visa,Single,$ 26.01,Insubuy  Inc,35,$ 9.1035,,,,,,,,,,$ 6.177375,$ 0.65025,$ 3.9015,,,,
Coburn  Calum Ross,691802107390,30/10/2021,05/11/2021,Beacon International,MasterCard,Single,$ 9.45,Insubuy  Inc,35,$ 3.3075,,,,,,,,,,$ 2.244375,$ 0.23625,$ 1.4175,,,,
Kovach  Vasyl,691802107379,29/10/2021,04/11/2021,Beacon International,MasterCard,Single,$ 4.76,Insubuy  Inc,35,$ 1.666,,,,,,,,,,$ 1.1305,$ 0.119,$ 0.714,,,,
alazhary  yasser taha taha ,691802107341,29/10/2021,04/11/2021,Beacon International,Visa,Single,$ 4.61,ARS Default,50,$ 2.305,,,,,,,,,,$ 1.094875,$ 0.11525,$ 0,,,,
Lomude  Ware Aaron,691802107361,29/10/2021,31/01/2022,Beacon America,Discover,Single,$ 874,Insubuy  Inc,35,$ 305.9,,,,,,,,,,$ 207.575,$ 21.85,$ 131.1,,,,
Phrompechrut  Raweeratch,691802105159,29/10/2021,04/11/2021,Beacon America,,Single,$ 21.98,Visitors Insurance,15,$ 3.297,,,,,,,,,,$ 5.22025,$ 0.5495,$ 7.693,,,,
Chirkov  Mikhail,691802107401,29/10/2021,02/03/2022,Beacon America,Visa,Single,$ 432,Insubuy  Inc,35,$ 151.2,,,,,,,,,,$ 102.6,$ 10.8,$ 64.8,,,,
Rodriguez  David,691802106937,29/10/2021,05/01/2022,Beacon International,Visa,Single,$ 46.92,Insubuy  Inc,35,$ 16.422,,,,,,,,,,$ 11.1435,$ 1.173,$ 7.038,,,,