Client Name,Identification #,Eff. Date,Term Date,Plan,Payment,Payment Mode,Premium,Agent #1,Comm %,Agent #1 Pmt.,Agent #2,Comm %,Agent #2 Pmt.,Agent #3,Comm %,Agent #3 Pmt.,Agent #4,Comm %,Agent #4 Pmt.,Claims Acc Fund,BMS Comm,ARS Comm,Comm Date,Merchant Fees,Surplus,
Meridian Series,
Adkins  Benjamin,802049102,27/07/2020,25/07/2021,Enhanced America,Visa,Annual,$ 0,Doug Gulleson,25,$ 0,,,,,,,,,,$ 0,$ 0,$ 0,,,,
ALVIAREZ  CARLOS,802048977,20/07/2020,18/07/2021,Enhanced America,Visa,Annual,$ 7882.35,Jose Salgado,30,$ 2364.705,,,,,,,,,,$ 1872.058125,$ 197.05875,$ 1576.47,,,,
Scheer  Andrew,802048973,20/07/2020,18/07/2021,Essential America,Visa,Monthly,$ 183.8,Craig Robinson,31,$ 56.978,,,,,,,,,,$ 43.6525,$ 4.595,$ 34.922,,,,
Pagano Jr  Martin,802048877,15/07/2020,13/07/2021,Essential America,Visa,Annual,$ 3859.6,Craig Robinson,31,$ 1196.476,,,,,,,,,,$ 916.655,$ 96.49,$ 733.324,,,,
Bassham  Philip,802048693,15/07/2020,13/07/2021,Essential America,Visa,Annual,$ 2816,Doug Gulleson,25,$ 704,,,,,,,,,,$ 668.8,$ 70.4,$ 704,,,,
Carpinteyro Cabrera  Fernando,802048710,14/07/2020,12/07/2021,Essential America,Visa,Annual,$ 2426.4,Customer Service,35,$ 849.24,,,,,,,,,,$ 576.27,$ 60.66,$ 363.96,,,,
Sumpter  Chase,802048885,13/07/2020,11/07/2021,Essential America,Visa,Annual,$ 1017,Cecille Brechin,27,$ 274.59,,,,,,,,,,$ 241.5375,$ 25.425,$ 233.91,,,,
Stanczak  Elisabeth,802048800,07/07/2020,05/07/2021,Enhanced America,Visa,Annual,$ 3439,Andrew S. Cosentino,15,$ 515.85,ADH Insurance Agency,0,$ 0,,,,,,,$ 816.7625,$ 85.975,$ 1203.65,,,,
Mesfin  Solomie,802048709,03/07/2020,01/07/2021,Essential America,Visa,Monthly,$ 164.7,Customer Service,35,$ 57.645,,,,,,,,,,$ 39.11625,$ 4.1175,$ 24.705,,,,
Parsons  Michael ,802048658,02/07/2020,30/06/2021,Essential America,Visa,Annual,$ 3372,Doug Gulleson,25,$ 843,,,,,,,,,,$ 800.85,$ 84.3,$ 843,,,,
Wiederholt  Eric,802048624,02/07/2020,30/06/2021,Essential America,Visa,Annual,$ 2588,Doug Gulleson,25,$ 647,,,,,,,,,,$ 614.65,$ 64.7,$ 647,,,,
Osborn  Demetrius,802048517,01/07/2020,29/06/2021,Essential America,MasterCard,Annual,$ 1807,Craig Robinson,31,$ 560.17,,,,,,,,,,$ 429.1625,$ 45.175,$ 343.33,,,,
SCHLOETER  JUAN,802048680,01/07/2020,29/06/2021,Essential America,MasterCard,Monthly,$ 104.7294,Carlos Noguera,25,$ 26.18235,,,,,,,,,,$ 24.8732325,$ 2.618235,$ 26.18235,,,,
Llamozas  Ana,802048650,01/07/2020,29/06/2021,Essential America,MasterCard,Annual,$ 1239.7185,Carlos Noguera,25,$ 309.929625,,,,,,,,,,$ 294.43314375,$ 30.9929625,$ 309.929625,,,,
Kondaveeti  Bhavana,802048685,30/06/2020,28/06/2021,Essential America,Discover,Monthly,$ 178,Visitors Insurance,15,$ 26.7,,,,,,,,,,$ 42.275,$ 4.45,$ 62.3,,,,
Beacon Series,
KASZOVITZ  ROBERT,802049041,28/07/2020,17/08/2020,Beacon International,AMEX,Single,$ 84.53,Insubuy  Inc,35,$ 29.5855,,,,,,,,,,$ 20.075875,$ 2.11325,$ 12.6795,,,,
Adhikari  Basandhari,802048015,28/07/2020,27/08/2020,Beacon America,,Single,$ 245.52,Insubuy  Inc,35,$ 85.932,,,,,,,,,,$ 58.311,$ 6.138,$ 36.828,,,,
zhang  wanlu,802049111,28/07/2020,27/10/2020,Beacon America,Visa,Single,$ 118.45,Insubuy  Inc,35,$ 41.4575,,,,,,,,,,$ 28.131875,$ 2.96125,$ 17.7675,,,,
Taqqu  Shlomo A,802049118,28/07/2020,19/08/2020,Beacon America,MasterCard,Single,$ 68.43,Prime Insurance Agency,15,$ 10.2645,,,,,,,,,,$ 16.252125,$ 1.71075,$ 23.9505,,,,
Gelves  Eufracio,802048686,28/07/2020,01/08/2020,Beacon International,,Single,$ 20.31,Elite International E. Gelves,30,$ 6.093,,,,,,,,,,$ 4.823625,$ 0.50775,$ 4.062,,,,
Schmidt  Christian,802049109,28/07/2020,06/09/2020,Beacon International,Visa,Single,$ 75.96,Insubuy  Inc,35,$ 26.586,,,,,,,,,,$ 18.0405,$ 1.899,$ 11.394,,,,
Naduvilthara  Lala Shashi,802049107,27/07/2020,31/10/2020,Beacon America,AMEX,Single,$ 362.54,Insubuy  Inc,35,$ 126.889,,,,,,,,,,$ 86.10325,$ 9.0635,$ 54.381,,,,
Kaushal  Kulbhushan,802049084,27/07/2020,14/09/2020,Beacon America,Visa,Single,$ 128.5,Insubuy  Inc,35,$ 44.975,,,,,,,,,,$ 30.51875,$ 3.2125,$ 19.275,,,,
Trampe  Diane Rosal,802049108,27/07/2020,12/08/2020,Beacon America,Visa,Single,$ 28.9,Insubuy  Inc,35,$ 10.115,,,,,,,,,,$ 6.86375,$ 0.7225,$ 4.335,,,,
Enus  Michael,802048520,27/07/2020,27/09/2020,Beacon International,,Single,$ 155.23,ARS Default,35,$ 54.3305,,,,,,,,,,$ 36.867125,$ 3.88075,$ 23.2845,,,,
Kamatchi Sundaram  Selvan,802049104,27/07/2020,09/08/2020,Beacon America,Discover,Single,$ 78.4,ARS Default,35,$ 27.44,,,,,,,,,,$ 18.62,$ 1.96,$ 11.76,,,,
Rolin  Johnathan,802048938,26/07/2020,07/01/2021,Beacon International,MasterCard,Single,$ 286.35,Insurance Services of America,30,$ 85.905,,,,,,,,,,$ 68.008125,$ 7.15875,$ 57.27,,,,
Anantharaman  Mahalakshmi,802049079,26/07/2020,01/11/2020,Beacon America,Visa,Single,$ 651.42,Insubuy  Inc,35,$ 227.997,,,,,,,,,,$ 154.71225,$ 16.2855,$ 97.713,,,,
Lefkowits  Joseph,802049081,26/07/2020,08/09/2020,Beacon America,Visa,Single,$ 55.8,Squaremouth  Inc.,30,$ 16.74,,,,,,,,,,$ 13.2525,$ 1.395,$ 11.16,,,,
M  Bonnie,802048939,26/07/2020,07/01/2021,Beacon International,MasterCard,Single,$ 244.85,Insurance Services of America,30,$ 73.455,,,,,,,,,,$ 58.151875,$ 6.12125,$ 48.97,,,,
DSouza  Carolyn,802049077,25/07/2020,31/07/2020,Beacon America,Visa,Single,$ 26.16,Insubuy  Inc,35,$ 9.156,,,,,,,,,,$ 6.213,$ 0.654,$ 3.924,,,,
Supaongprapa  Kerati,802048958,24/07/2020,11/11/2020,Beacon International,MasterCard,Single,$ 124.88,Insubuy  Inc,35,$ 43.708,,,,,,,,,,$ 29.659,$ 3.122,$ 18.732,,,,
JIN  YUJIA,802049056,24/07/2020,22/08/2020,Beacon International,MasterCard,Single,$ 24,Insubuy  Inc,35,$ 8.4,,,,,,,,,,$ 5.7,$ 0.6,$ 3.6,,,,
VASQUEZ  EDILIO,802049007,24/07/2020,01/08/2020,Beacon International,Visa,Single,$ 7.65,Insubuy  Inc,35,$ 2.6775,,,,,,,,,,$ 1.816875,$ 0.19125,$ 1.1475,,,,
Brezel  Yaakov,802049067,24/07/2020,23/08/2020,Beacon International,Amex,Single,$ 53.48,Prime Insurance Agency,15,$ 8.022,,,,,,,,,,$ 12.7015,$ 1.337,$ 18.718,,,,
Rajpurohit  Sharda,802049064,23/07/2020,30/07/2020,Beacon America,Visa,Single,$ 37.4,Insubuy  Inc,35,$ 13.09,,,,,,,,,,$ 8.8825,$ 0.935,$ 5.61,,,,
Gelves  Eufracio,802048686,23/07/2020,27/07/2020,Beacon International,,Single,$ 20.31,Elite International E. Gelves,30,$ 6.093,,,,,,,,,,$ 4.823625,$ 0.50775,$ 4.062,,,,
COHEN  YACOV NAFTOLI,802049058,23/07/2020,28/03/2021,Beacon America,MasterCard,Single,$ 385.95,Insubuy  Inc,35,$ 135.0825,,,,,,,,,,$ 91.663125,$ 9.64875,$ 57.8925,,,,
Cuahonte  Maria Andreina,802049061,23/07/2020,23/08/2020,Beacon America,Visa,Single,$ 49.6,Nelson Sucre Rivas,15,$ 7.44,Elite International E. Gelves,-30,$ -14.88,,,,,,,$ 11.78,$ 1.24,$ 32.24,,,,
shen  bingkui,802048972,23/07/2020,29/08/2020,Beacon America,Discover,Single,$ 209.38,Insubuy  Inc,35,$ 73.283,,,,,,,,,,$ 49.72775,$ 5.2345,$ 31.407,,,,
Jones  Elizabeth,802049047,22/07/2020,26/08/2020,Beacon America,Mastercard,Single,$ 88.2,Squaremouth  Inc.,30,$ 26.46,,,,,,,,,,$ 20.9475,$ 2.205,$ 17.64,,,,
Gazzard  Eliane,802049049,22/07/2020,01/09/2020,Beacon America,Visa,Single,$ 68.88,Squaremouth  Inc.,30,$ 20.664,,,,,,,,,,$ 16.359,$ 1.722,$ 13.776,,,,
Upadhyay  Meenu,802049048,22/07/2020,26/07/2020,Beacon America,Discover,Single,$ 6.56,Squaremouth  Inc.,30,$ 1.968,,,,,,,,,,$ 1.558,$ 0.164,$ 1.312,,,,
Lipschitz  Malky,802049046,22/07/2020,30/09/2020,Beacon International,Visa,Single,$ 145.55,Prime Insurance Agency,15,$ 21.8325,,,,,,,,,,$ 34.568125,$ 3.63875,$ 50.9425,,,,
Munoz  Elias,802049044,22/07/2020,30/07/2020,Beacon International,Visa,Single,$ 20.25,ARS Default,15,$ 3.0375,,,,,,,,,,$ 4.809375,$ 0.50625,$ 7.0875,,,,
Qi  Honglin,802049005,22/07/2020,26/07/2020,Beacon America,Visa,Single,$ 23.65,Insubuy  Inc,35,$ 8.2775,,,,,,,,,,$ 5.616875,$ 0.59125,$ 3.5475,,,,
Sutrick  Susan,802048997,22/07/2020,20/07/2021,Beacon America,Visa,Single,$ 2735.46,Joseph James Pridgen,20,$ 547.092,,,,,,,,,,$ 649.67175,$ 68.3865,$ 820.638,,,,
Sutrick  Thomas,802048989,22/07/2020,20/07/2021,Beacon International,Visa,Single,$ 1670.76,Joseph James Pridgen,20,$ 334.152,,,,,,,,,,$ 396.8055,$ 41.769,$ 501.228,,,,
Mazumdar  Sushama,802048898,22/07/2020,20/10/2020,Beacon International,MasterCard,Single,$ 95.55,Insubuy  Inc,35,$ 33.4425,,,,,,,,,,$ 22.693125,$ 2.38875,$ 14.3325,,,,
Allen  Chealsea,802046079,21/07/2020,20/08/2020,Beacon International,,Single,$ 42.63,ARS Default,35,$ 14.9205,,,,,,,,,,$ 10.124625,$ 1.06575,$ 6.3945,,,,
Gold  Aaron,802048579,21/07/2020,31/12/2020,Beacon America,,Single,$ 268.96,Squaremouth  Inc.,30,$ 80.688,,,,,,,,,,$ 63.878,$ 6.724,$ 53.792,,,,
DAWSON  BRONTE LAURA,802048242,21/07/2020,25/10/2020,Beacon America,,Single,$ 156.36,Insubuy  Inc,35,$ 54.726,,,,,,,,,,$ 37.1355,$ 3.909,$ 23.454,,,,
Zhang  Hengrui,802049001,21/07/2020,19/07/2021,Beacon America,Visa,Single,$ 640.24,ARS Default,35,$ 224.084,,,,,,,,,,$ 152.057,$ 16.006,$ 96.036,,,,
Garza  Marie Juliana,802048864,20/07/2020,11/07/2021,Beacon International,Visa,Single,$ 339.15,Insubuy  Inc,35,$ 118.7025,,,,,,,,,,$ 80.548125,$ 8.47875,$ 50.8725,,,,
Test  Chantel ,802048981,20/07/2020,24/07/2020,Beacon International,Amex,Single,$ 6.86,ARS Default,35,$ 2.401,,,,,,,,,,$ 1.62925,$ 0.1715,$ 1.029,,,,
Saidakramov  Akbar,802048998,20/07/2020,30/09/2020,Beacon America,MasterCard,Single,$ 93.99,Insubuy  Inc,35,$ 32.8965,,,,,,,,,,$ 22.322625,$ 2.34975,$ 14.0985,,,,
govindu  Danamma,802048992,20/07/2020,18/08/2020,Beacon America,Visa,Single,$ 91.88,Insubuy  Inc,35,$ 32.158,,,,,,,,,,$ 21.8215,$ 2.297,$ 13.782,,,,
Tranie  Jerome ,802049050,20/07/2020,05/08/2020,Beacon International,Amex,Single,$ 47.65,Scott Rose,27.5,$ 13.10375,,,,,,,,,,$ 11.316875,$ 1.19125,$ 10.72125,,,,
Umo  Manuel,802048985,19/07/2020,07/09/2020,Beacon International,Visa,Single,$ 79.97,Bob Jankovics,25,$ 19.9925,,,,,,,,,,$ 18.992875,$ 1.99925,$ 19.9925,,,,
Kathleen  Lisa,802048987,18/07/2020,18/08/2020,Beacon America,Visa,Single,$ 115.2,Squaremouth  Inc.,30,$ 34.56,,,,,,,,,,$ 27.36,$ 2.88,$ 23.04,,,,
Ibrahim  Mohamed,802048623,18/07/2020,17/08/2020,Beacon International,MasterCard,Single,$ 21.08,Insubuy  Inc,35,$ 7.378,,,,,,,,,,$ 5.0065,$ 0.527,$ 3.162,,,,
Morales  Miguel,802048976,18/07/2020,17/08/2020,Beacon America,Visa,Single,$ 48.05,ARS Default,35,$ 16.8175,,,,,,,,,,$ 11.411875,$ 1.20125,$ 7.2075,,,,
Valmir  Ejymson,802048971,17/07/2020,31/12/2020,Beacon America,Visa,Single,$ 208.32,Insubuy  Inc,35,$ 72.912,,,,,,,,,,$ 49.476,$ 5.208,$ 31.248,,,,
Sharma  Rekha,802048969,17/07/2020,31/10/2020,Beacon America,Visa,Single,$ 506.11,Insubuy  Inc,35,$ 177.1385,,,,,,,,,,$ 120.201125,$ 12.65275,$ 75.9165,,,,
D Ambrosio  Megan,802048959,17/07/2020,21/08/2020,Beacon International,MasterCard,Single,$ 74.88,Louis Bernardi,15,$ 11.232,,,,,,,,,,$ 17.784,$ 1.872,$ 26.208,,,,
Zhao  Shuhuan,802048957,17/07/2020,16/08/2020,Beacon America,Visa,Single,$ 39.53,Insubuy  Inc,35,$ 13.8355,,,,,,,,,,$ 9.388375,$ 0.98825,$ 5.9295,,,,
ALALUF  RACHEL,802048945,17/07/2020,10/09/2020,Beacon America,Visa,Single,$ 428.4,Bob Perogine,31,$ 132.804,,,,,,,,,,$ 101.745,$ 10.71,$ 81.396,,,,
Jaiswal  Krishana Kumar,802048487,17/07/2020,15/08/2020,Beacon America,,Single,$ 127.71,Insubuy  Inc,35,$ 44.6985,,,,,,,,,,$ 30.331125,$ 3.19275,$ 19.1565,,,,
Boyapati  Lakshmi Prasanna,802045739,17/07/2020,16/08/2020,Beacon America,,Single,$ 181.35,Visitors Insurance,15,$ 27.2025,,,,,,,,,,$ 43.070625,$ 4.53375,$ 63.4725,,,,
Wang  Handan,802048960,16/07/2020,31/07/2020,Beacon America,Visa,Single,$ 15.23,Wayne Wang,20,$ 3.046,Insubuy  Inc,0,$ 0,,,,,,,$ 3.617125,$ 0.38075,$ 4.569,,,,
Zhang  Huimin,802048642,16/07/2020,20/07/2020,Beacon America,,Single,$ 22.5,Insubuy  Inc,35,$ 7.875,,,,,,,,,,$ 5.34375,$ 0.5625,$ 3.375,,,,
Pereira Marca  Yuri,802048907,16/07/2020,03/09/2020,Beacon International,Visa,Single,$ 47.5,ARS Default,35,$ 16.625,,,,,,,,,,$ 11.28125,$ 1.1875,$ 7.125,,,,
GiwaAmu  Obafemi Ohiole,802048944,16/07/2020,31/08/2020,Beacon America,Visa,Single,$ 141.94,Insubuy  Inc,35,$ 49.679,,,,,,,,,,$ 33.71075,$ 3.5485,$ 21.291,,,,
Luo  Bin,802048942,16/07/2020,16/09/2020,Beacon America,Visa,Single,$ 188.37,Insubuy  Inc,35,$ 65.9295,,,,,,,,,,$ 44.737875,$ 4.70925,$ 28.2555,,,,
Kilavuz  Servet,701942666,16/07/2020,12/11/2020,Beacon America,,Single,$ 734.4,MCIS MultiChoice Insurance Services  LLC,29.5,$ 216.648,,,,,,,,,,$ 174.42,$ 18.36,$ 150.552,,,,
Valliant  Patrick,802048377,16/07/2020,15/08/2020,Beacon International,,Single,$ 105.4,Bob Jankovics,25,$ 26.35,,,,,,,,,,$ 25.0325,$ 2.635,$ 26.35,,,,
Gelves  Eufracio,802048686,16/07/2020,22/07/2020,Beacon International,,Single,$ 28.44,Elite International E. Gelves,30,$ 8.532,,,,,,,,,,$ 6.7545,$ 0.711,$ 5.688,,,,
Li  Changyun,802048970,16/07/2020,30/09/2020,Beacon America,Visa,Single,$ 466.81,Insubuy  Inc,35,$ 163.3835,,,,,,,,,,$ 110.867375,$ 11.67025,$ 70.0215,,,,
Jiang  Huaying,802044169,16/07/2020,31/08/2020,Beacon America,,Single,$ 259.68,Linda Lynn,15,$ 38.952,,,,,,,,,,$ 61.674,$ 6.492,$ 90.888,,,,
Dreyer  Sophie,802048968,16/07/2020,28/08/2020,Beacon America,American Express,Single,$ 54.56,Squaremouth  Inc.,30,$ 16.368,,,,,,,,,,$ 12.958,$ 1.364,$ 10.912,,,,
KURUMARTHI ABISHEKAM  JACOB,802048963,16/07/2020,15/01/2021,Beacon America,Discover,Single,$ 373.52,Insubuy  Inc,35,$ 130.732,,,,,,,,,,$ 88.711,$ 9.338,$ 56.028,,,,
MADDELA ADMIRAL  LAVEENA SWAROOPA,802048962,16/07/2020,15/01/2021,Beacon America,Discover,Single,$ 373.52,Insubuy  Inc,35,$ 130.732,,,,,,,,,,$ 88.711,$ 9.338,$ 56.028,,,,
KURUMARTHI JACOB  CAROLIN PEARL,802048961,16/07/2020,15/01/2021,Beacon America,Discover,Single,$ 189.52,Insubuy  Inc,35,$ 66.332,,,,,,,,,,$ 45.011,$ 4.738,$ 28.428,,,,
Gaur  Arvind Kumar Singh,802048954,16/07/2020,18/09/2020,Beacon America,Discover,Single,$ 204.75,MCIS MultiChoice Insurance Services  LLC,29.5,$ 60.40125,,,,,,,,,,$ 48.628125,$ 5.11875,$ 41.97375,,,,
Lago  Apache,802048816,15/07/2020,13/07/2021,Beacon International,Visa,Single,$ 536.9,Insubuy  Inc,35,$ 187.915,,,,,,,,,,$ 127.51375,$ 13.4225,$ 80.535,,,,
Zaltzman  Tall,802048937,15/07/2020,03/08/2020,Beacon International,Visa,Single,$ 27,Squaremouth  Inc.,30,$ 8.1,,,,,,,,,,$ 6.4125,$ 0.675,$ 5.4,,,,
eldokmak  mohamed mahmoud,802048931,14/07/2020,15/08/2020,Beacon America,AMEX,Single,$ 54.12,Insubuy  Inc,35,$ 18.942,,,,,,,,,,$ 12.8535,$ 1.353,$ 8.118,,,,
Dietrich  Laura,802048566,14/07/2020,21/07/2020,Beacon International,Visa,Single,$ 27.63,Source Insurance Group & Financial Services  Inc.,20,$ 5.526,,,,,,,,,,$ 6.562125,$ 0.69075,$ 8.289,,,,
Herring  Scott ,802048568,14/07/2020,21/07/2020,Beacon International,Visa,Single,$ 27.63,Source Insurance Group & Financial Services  Inc.,20,$ 5.526,,,,,,,,,,$ 6.562125,$ 0.69075,$ 8.289,,,,
Powell  Melody,802048638,14/07/2020,11/07/2021,Beacon International,Visa,Single,$ 744.15,Robert Williams,25,$ 186.0375,,,,,,,,,,$ 176.735625,$ 18.60375,$ 186.0375,,,,
Kang  Jay,802048913,13/07/2020,16/07/2020,Beacon International,Visa,Single,$ 7.59,Squaremouth  Inc.,30,$ 2.277,,,,,,,,,,$ 1.802625,$ 0.18975,$ 1.518,,,,
Jagannathan  Rengarajan,802048905,13/07/2020,21/11/2020,Beacon International,Visa,Single,$ 364.32,Insubuy  Inc,35,$ 127.512,,,,,,,,,,$ 86.526,$ 9.108,$ 54.648,,,,
Harvey  Amanda,802048673,13/07/2020,15/11/2020,Beacon International,Visa,Single,$ 143.64,Insubuy  Inc,35,$ 50.274,,,,,,,,,,$ 34.1145,$ 3.591,$ 21.546,,,,
Karakozov  Samson,802048917,13/07/2020,31/10/2020,Beacon America,Visa,Single,$ 649.35,Insubuy  Inc,35,$ 227.2725,,,,,,,,,,$ 154.220625,$ 16.23375,$ 97.4025,,,,
Feferkorn  Sarah,802048896,12/07/2020,16/07/2020,Beacon International,Visa,Single,$ 5.63,Squaremouth  Inc.,30,$ 1.689,,,,,,,,,,$ 1.337125,$ 0.14075,$ 1.126,,,,
Shrestha  Suravi,802048904,12/07/2020,31/07/2020,Beacon America,Visa,Single,$ 20.6,Insubuy  Inc,35,$ 7.21,,,,,,,,,,$ 4.8925,$ 0.515,$ 3.09,,,,
Pummer  Denise,802048875,11/07/2020,31/07/2020,Beacon International,Amex,Single,$ 45.28,ARS Default,35,$ 15.848,,,,,,,,,,$ 10.754,$ 1.132,$ 6.792,,,,
Tao  Liping,802048576,11/07/2020,10/08/2020,Beacon America,,Single,$ 89.28,Insubuy  Inc,35,$ 31.248,,,,,,,,,,$ 21.204,$ 2.232,$ 13.392,,,,
Coopersmith  Deborah,802048869,10/07/2020,15/09/2020,Beacon International,Visa,Single,$ 130.39,Mitchell Coopersmith,10,$ 13.039,,,,,,,,,,$ 30.967625,$ 3.25975,$ 52.156,,,,
Demetroudis  Daphne Denisse,802048848,10/07/2020,27/07/2020,Beacon International,Visa,Single,$ 29.7,Insubuy  Inc,35,$ 10.395,,,,,,,,,,$ 7.05375,$ 0.7425,$ 4.455,,,,
Reyes Sanchez  Johanna Caterine,802048868,09/07/2020,06/09/2020,Beacon America,Visa,Single,$ 81.84,Insubuy  Inc,35,$ 28.644,,,,,,,,,,$ 19.437,$ 2.046,$ 12.276,,,,
HOODA  KARTAR SINGH,802048853,09/07/2020,10/01/2021,Beacon America,Visa,Single,$ 1223.88,Insubuy  Inc,35,$ 428.358,,,,,,,,,,$ 290.6715,$ 30.597,$ 183.582,,,,
Seki  Yoshinori,802048861,09/07/2020,01/08/2020,Beacon America,Amex,Single,$ 116.69,Visitors Insurance,15,$ 17.5035,,,,,,,,,,$ 27.713875,$ 2.91725,$ 40.8415,,,,
Khan  Shahid Parvez,802048865,09/07/2020,17/08/2020,Beacon America,Visa,Single,$ 172.8,Insubuy  Inc,35,$ 60.48,,,,,,,,,,$ 41.04,$ 4.32,$ 25.92,,,,
MARIN  GABRIEL,802044328,08/07/2020,31/12/2020,Beacon International,,Single,$ 168.15,ARS Default,35,$ 58.8525,,,,,,,,,,$ 39.935625,$ 4.20375,$ 25.2225,,,,
Schob  Greg,802048789,08/07/2020,15/07/2020,Beacon International,Amex,Single,$ 41.8,ARS Default,35,$ 14.63,,,,,,,,,,$ 9.9275,$ 1.045,$ 6.27,,,,
Boyer  Melissa,802048627,08/07/2020,18/07/2020,Beacon America,,Single,$ 32.73,Insurance Services of America,30,$ 9.819,,,,,,,,,,$ 7.773375,$ 0.81825,$ 6.546,,,,
Schob  Vicki,802048788,08/07/2020,15/07/2020,Beacon International,Amex,Single,$ 41.8,ARS Default,30,$ 12.54,,,,,,,,,,$ 9.9275,$ 1.045,$ 8.36,,,,
Larman  Ashlei,802048067,08/07/2020,11/07/2020,Beacon International,Visa,Single,$ 2.42,Insubuy  Inc,35,$ 0.847,,,,,,,,,,$ 0.57475,$ 0.0605,$ 0.363,,,,
Sinha  Arjun,802048805,07/07/2020,06/10/2020,Beacon International,Visa,Single,$ 239.2,Squaremouth  Inc.,30,$ 71.76,,,,,,,,,,$ 56.81,$ 5.98,$ 47.84,,,,
kocsis  gabor,802048649,07/07/2020,08/08/2020,Beacon America,Visa,Single,$ 232.65,Andrew Tatar Insurance Broker,30,$ 69.795,,,,,,,,,,$ 55.254375,$ 5.81625,$ 46.53,,,,
Awad  Julia mohammed,802048698,07/07/2020,06/10/2020,Beacon International,Visa,Single,$ 63.48,Insubuy  Inc,35,$ 22.218,,,,,,,,,,$ 15.0765,$ 1.587,$ 9.522,,,,
Ishizumi  Asuka,701939778,07/07/2020,31/07/2020,Beacon International,,Single,$ 22.5,ARS Default,35,$ 7.875,,,,,,,,,,$ 5.34375,$ 0.5625,$ 3.375,,,,
Morgan  Aaron John moffat,802048801,07/07/2020,30/11/2020,Beacon America,Visa,Single,$ 352.51,Insubuy  Inc,35,$ 123.3785,,,,,,,,,,$ 83.721125,$ 8.81275,$ 52.8765,,,,
pollak  yisroel,802048817,07/07/2020,17/09/2020,Beacon America,MasterCard,Single,$ 75.19,Insubuy  Inc,35,$ 26.3165,,,,,,,,,,$ 17.857625,$ 1.87975,$ 11.2785,,,,
Zhang  Zheng,802048822,07/07/2020,31/07/2020,Beacon America,Visa,Single,$ 146.25,Insubuy  Inc,35,$ 51.1875,,,,,,,,,,$ 34.734375,$ 3.65625,$ 21.9375,,,,
Krishnavilas Gopala Pillai  Somasekhara Pillai,802048826,07/07/2020,31/12/2020,Beacon America,MasterCard,Single,$ 925.6,Insubuy  Inc,35,$ 323.96,,,,,,,,,,$ 219.83,$ 23.14,$ 138.84,,,,
Levin  Avraham Z D,802048793,06/07/2020,08/07/2020,Beacon International,Visa,Single,$ 18.63,Prime Insurance Agency,15,$ 2.7945,,,,,,,,,,$ 4.424625,$ 0.46575,$ 6.5205,,,,
Rosenfeld  Laura,802048761,06/07/2020,29/07/2020,Beacon America,Visa,Single,$ 29.76,Squaremouth  Inc.,30,$ 8.928,,,,,,,,,,$ 7.068,$ 0.744,$ 5.952,,,,
SEN  SAJIB,802048804,06/07/2020,05/09/2020,Beacon America,Discover,Single,$ 148.68,Insubuy  Inc,35,$ 52.038,,,,,,,,,,$ 35.3115,$ 3.717,$ 22.302,,,,
Fares  Rami John,802048407,05/07/2020,16/07/2020,Beacon International,Visa,Single,$ 6.72,Insubuy  Inc,35,$ 2.352,,,,,,,,,,$ 1.596,$ 0.168,$ 1.008,,,,
Cooper  Eliezer,802048668,05/07/2020,10/07/2020,Beacon America,Mastercard,Single,$ 14.7,Squaremouth  Inc.,30,$ 4.41,,,,,,,,,,$ 3.49125,$ 0.3675,$ 2.94,,,,
Willig  Chana,802048708,05/07/2020,26/07/2020,Beacon America,Visa,Single,$ 33.83,Squaremouth  Inc.,30,$ 10.149,,,,,,,,,,$ 8.034625,$ 0.84575,$ 6.766,,,,
Markpwits  Meier,802048783,05/07/2020,13/07/2020,Beacon International,Visa,Single,$ 57.38,Prime Insurance Agency,15,$ 8.607,,,,,,,,,,$ 13.62775,$ 1.4345,$ 20.083,,,,
EINSTADTER  CHANA,802048704,05/07/2020,16/08/2020,Beacon America,Mastercard,Single,$ 66.11,Squaremouth  Inc.,30,$ 19.833,,,,,,,,,,$ 15.701125,$ 1.65275,$ 13.222,,,,
Bakkamanthala  Usha Kumari,802048782,05/07/2020,08/07/2020,Beacon America,MasterCard,Single,$ 28.63,Insubuy  Inc,35,$ 10.0205,,,,,,,,,,$ 6.799625,$ 0.71575,$ 4.2945,,,,
Sharp  Michael Leslie,802048773,05/07/2020,31/08/2020,Beacon America,MasterCard,Single,$ 74.68,Insubuy  Inc,35,$ 26.138,,,,,,,,,,$ 17.7365,$ 1.867,$ 11.202,,,,
Awad  Catherine Farahat Sedky Abouelkhel,802048772,04/07/2020,07/08/2020,Beacon America,Visa,Single,$ 83.3,Insubuy  Inc,35,$ 29.155,,,,,,,,,,$ 19.78375,$ 2.0825,$ 12.495,,,,
Sarode  Vidullata,802045338,04/07/2020,31/10/2020,Beacon America,,Single,$ 691.2,MCIS MultiChoice Insurance Services  LLC,29.5,$ 203.904,,,,,,,,,,$ 164.16,$ 17.28,$ 141.696,,,,
Gunderson  Ruby,802047160,04/07/2020,02/08/2020,Beacon International,,Single,$ 36.3,ARS Default,29.5,$ 10.7085,,,,,,,,,,$ 8.62125,$ 0.9075,$ 7.4415,,,,
Awad  Farahat Sedky Abouelkhel,802048770,04/07/2020,11/08/2020,Beacon America,Visa,Single,$ 228.15,Insubuy  Inc,35,$ 79.8525,,,,,,,,,,$ 54.185625,$ 5.70375,$ 34.2225,,,,
Patel  Swaroopa,802048769,04/07/2020,05/08/2020,Beacon America,Visa,Single,$ 252.45,Insubuy  Inc,35,$ 88.3575,,,,,,,,,,$ 59.956875,$ 6.31125,$ 37.8675,,,,
Bhandari  Ashok Pratapmal,802048764,03/07/2020,13/07/2020,Beacon America,Visa,Single,$ 42.77,Insubuy  Inc,35,$ 14.9695,,,,,,,,,,$ 10.157875,$ 1.06925,$ 6.4155,,,,
Rahaman  Mijanur,802048254,03/07/2020,02/10/2020,Beacon International,MasterCard,Single,$ 110.95,Insubuy  Inc,35,$ 38.8325,,,,,,,,,,$ 26.350625,$ 2.77375,$ 16.6425,,,,
YU  XIUHUI,802048714,03/07/2020,03/08/2020,Beacon America,MasterCard,Single,$ 168.45,Yuying Cheng,20,$ 33.69,Insubuy  Inc,0,$ 0,,,,,,,$ 40.006875,$ 4.21125,$ 50.535,,,,
Bozhko  Mariia,802048609,03/07/2020,03/08/2020,Beacon America,Visa,Single,$ 57.73,Squaremouth  Inc.,30,$ 17.319,,,,,,,,,,$ 13.710875,$ 1.44325,$ 11.546,,,,
Vemulapally  Jayachandra,802048571,03/07/2020,01/07/2021,Beacon America,Visa,Single,$ 1016.9,Insubuy  Inc,35,$ 355.915,,,,,,,,,,$ 241.51375,$ 25.4225,$ 152.535,,,,
Tousley  Brian,802048599,03/07/2020,13/07/2020,Beacon International,Amex,Single,$ 71.95,Alonso R. Cornejo,25,$ 17.9875,,,,,,,,,,$ 17.088125,$ 1.79875,$ 17.9875,,,,
Ruiz  Rosa Elvira,802048754,02/07/2020,01/10/2020,Beacon America,Visa,Single,$ 385.71,Insurance Services of America,30,$ 115.713,,,,,,,,,,$ 91.606125,$ 9.64275,$ 77.142,,,,
Herrera Rodriguez  Jorge Eduardo,802048753,02/07/2020,01/10/2020,Beacon America,Visa,Single,$ 385.71,Insurance Services of America,30,$ 115.713,,,,,,,,,,$ 91.606125,$ 9.64275,$ 77.142,,,,
chen  ying,802048752,02/07/2020,31/08/2020,Beacon America,Visa,Single,$ 337.03,Linda Lynn,15,$ 50.5545,,,,,,,,,,$ 80.044625,$ 8.42575,$ 117.9605,,,,
BALILI KATZ  GLORIA,802048031,02/07/2020,01/08/2020,Beacon International,,Single,$ 118.58,John K. Arnold Insurance  Inc.,30,$ 35.574,,,,,,,,,,$ 28.16275,$ 2.9645,$ 23.716,,,,
Burke  Paul ,802048665,02/07/2020,13/08/2020,Beacon International,Visa,Single,$ 108.02,ARS Default,30,$ 32.406,,,,,,,,,,$ 25.65475,$ 2.7005,$ 21.604,,,,
Koelling  Chris,802045448,02/07/2020,03/08/2020,Beacon International,,Single,$ 55.69,Squaremouth  Inc.,30,$ 16.707,,,,,,,,,,$ 13.226375,$ 1.39225,$ 11.138,,,,
Sridharan  Kilapandal Balasubramanian,802048760,02/07/2020,02/08/2020,Beacon America,Visa,Single,$ 207.36,Insubuy  Inc,35,$ 72.576,,,,,,,,,,$ 49.248,$ 5.184,$ 31.104,,,,
Israelite  Wendy,802046086,02/07/2020,01/08/2020,Beacon International,,Single,$ 124.78,Robert S. Loeb,10,$ 12.478,,,,,,,,,,$ 29.63525,$ 3.1195,$ 49.912,,,,
Lambert  Andrew,802043326,01/07/2020,29/06/2021,Beacon International,Visa,Single,$ 409.5,Insurance Services of America,30,$ 122.85,,,,,,,,,,$ 97.25625,$ 10.2375,$ 81.9,,,,
Rubin  Semen,802048706,01/07/2020,10/07/2020,Beacon America,MasterCard,Single,$ 42.57,Insubuy  Inc,35,$ 14.8995,,,,,,,,,,$ 10.110375,$ 1.06425,$ 6.3855,,,,