EE Transaction Type,Dependent Transaction Type,Effective Date,Expiry Date,EE Signature,EE Signature Date,Control,Suffix,Account,Plan Number,Plan Name,Claim Office,Network ID Number,Customer Code,EE SSN,Dependent SSN,Dependent Relationship,Last Name,First Name,Middle Initial,DOB,Gender,Ethnicity,PCP/PCD,PCP/PCD Current Patient,Provider Cap Office Number,COB,Dep Student Indicator,Dep OOA Indicator,EE Prior Coverage Indicator,EE Late Entrant,EE Language Indicator,Hire Date,Earnings,Earnings Frequency,Beneficiary (Last Name First Name MI),Beneficiary Relationship,Continuation of Coverage Expiration Date,Continuation of Coverage Event Date,Continuation of Coverage Length of Coverage,Work Location Zip Code,Street Address Line 1,Street Address Line 2,City,State,Zip Code,Home Phone Number,Work Phone Number,Accept Code,Evidence Code,EE Email Address,Communication Disability Code,EE Alternate ID,Dep Alternate ID,Old Control,Old Suffix,Old Account,New Control,New Suffix,New Account,
Not captured,Not captured,02/08/2021,02/28/2021,Not captured,Not captured,863949,020,00072,ARS-01-0058309,Beacon International,Not captured,Not captured,Not captured,,,,Razvi,Imran,H,10/18/1990,male,Not captured,Not captured,Not captured,Not captured,Not captured,Not captured,Not captured,Not captured,Not captured,Not captured,Not captured,Not captured,Not captured,,,Not captured,Not captured,Not captured,Not captured,2425 Sage Road Apt# 138,,Houston,,77056,,,Not captured,Not captured,imran18101@gmail.com,Not captured,802052516,,Not captured,Not captured,Not captured,Not captured,Not captured,Not captured,
Not captured,Not captured,02/08/2021,03/31/2021,Not captured,Not captured,863949,020,00072,ARS-02-0058308,Beacon America,Not captured,Not captured,Not captured,Passport(P6684847),,,Vijayakumar,Sarala,,04/26/1959,female,Not captured,Not captured,Not captured,Not captured,Not captured,Not captured,Not captured,Not captured,Not captured,Not captured,Not captured,Not captured,Not captured,Kamesh Khanna Andisamy Vijayakumar,,Not captured,Not captured,Not captured,Not captured,5/3 Sastri Nagar 10th Cross Street,,Chennai,TN,600020,+1-7022665607,,Not captured,Not captured,kamesh.andisamy@gmail.com,Not captured,802052515,,Not captured,Not captured,Not captured,Not captured,Not captured,Not captured,
Not captured,Not captured,02/08/2021,02/14/2021,Not captured,Not captured,863949,020,00072,ARS-02-0058305,Beacon America,Not captured,Not captured,Not captured,,,,Levitz,Y Michoel,,11/05/2014,male,Not captured,Not captured,Not captured,Not captured,Not captured,Not captured,Not captured,Not captured,Not captured,Not captured,Not captured,Not captured,Not captured,,,Not captured,Not captured,Not captured,Not captured,2 Fraser Wood Ave,,Toronto,Ontario,M6d2N4,647-835-1662,,Not captured,Not captured,penigross@gmail.com,Not captured,802052512,,Not captured,Not captured,Not captured,Not captured,Not captured,Not captured,
Not captured,Not captured,02/08/2021,02/14/2021,Not captured,Not captured,863949,020,00072,ARS-02-0058304,Beacon America,Not captured,Not captured,Not captured,,,,Levitz,Sarah,,06/17/2016,female,Not captured,Not captured,Not captured,Not captured,Not captured,Not captured,Not captured,Not captured,Not captured,Not captured,Not captured,Not captured,Not captured,,,Not captured,Not captured,Not captured,Not captured,2 Fraser Wood Ave,,Toronto,Ontario,M6d2N4,647-835-1662,,Not captured,Not captured,penigross@gmail.com,Not captured,802052511,,Not captured,Not captured,Not captured,Not captured,Not captured,Not captured,
Not captured,Not captured,02/08/2021,02/14/2021,Not captured,Not captured,863949,020,00072,ARS-02-0058303,Beacon America,Not captured,Not captured,Not captured,,,,Levitz,Rivka,,09/11/2020,female,Not captured,Not captured,Not captured,Not captured,Not captured,Not captured,Not captured,Not captured,Not captured,Not captured,Not captured,Not captured,Not captured,,,Not captured,Not captured,Not captured,Not captured,2 Fraser Wood Ave,,Toronto,Ontario,M6d2N4,647-835-1662,,Not captured,Not captured,penigross@gmail.com,Not captured,802052510,,Not captured,Not captured,Not captured,Not captured,Not captured,Not captured,
Not captured,Not captured,02/08/2021,02/14/2021,Not captured,Not captured,863949,020,00072,ARS-02-0058302,Beacon America,Not captured,Not captured,Not captured,,,,Levitz,Leah,,07/14/2018,female,Not captured,Not captured,Not captured,Not captured,Not captured,Not captured,Not captured,Not captured,Not captured,Not captured,Not captured,Not captured,Not captured,,,Not captured,Not captured,Not captured,Not captured,2 Fraser Wood Ave,,Toronto,Ontario,M6d2N4,647-835-1662,,Not captured,Not captured,penigross@gmail.com,Not captured,802052509,,Not captured,Not captured,Not captured,Not captured,Not captured,Not captured,
Not captured,Not captured,02/08/2021,02/14/2021,Not captured,Not captured,863949,020,00072,ARS-02-0058301,Beacon America,Not captured,Not captured,Not captured,,,,Levitz,Dovid,,03/31/1990,male,Not captured,Not captured,Not captured,Not captured,Not captured,Not captured,Not captured,Not captured,Not captured,Not captured,Not captured,Not captured,Not captured,,,Not captured,Not captured,Not captured,Not captured,2 Fraser Wood Ave,,Toronto,Ontario,M6d2N4,647-835-1662,,Not captured,Not captured,penigross@gmail.com,Not captured,802052508,,Not captured,Not captured,Not captured,Not captured,Not captured,Not captured,
Not captured,Not captured,02/08/2021,02/14/2021,Not captured,Not captured,863949,020,00072,ARS-02-0058300,Beacon America,Not captured,Not captured,Not captured,,,,Levitz,Penina,,01/30/1989,female,Not captured,Not captured,Not captured,Not captured,Not captured,Not captured,Not captured,Not captured,Not captured,Not captured,Not captured,Not captured,Not captured,,,Not captured,Not captured,Not captured,Not captured,2 Fraser Wood Ave,,Toronto,Ontario,M6d2N4,647-835-1662,,Not captured,Not captured,penigross@gmail.com,Not captured,802052507,,Not captured,Not captured,Not captured,Not captured,Not captured,Not captured,
Not captured,Not captured,02/07/2021,02/28/2021,Not captured,Not captured,863949,020,00072,ARS-02-0058298,Beacon America,Not captured,Not captured,Not captured,Passport(K9359850),,,Mehta,Kokilaben,,12/06/1945,female,Not captured,Not captured,Not captured,Not captured,Not captured,Not captured,Not captured,Not captured,Not captured,Not captured,Not captured,Not captured,Not captured,Devalkumar Mehta,,Not captured,Not captured,Not captured,Not captured,B/3 Anmol-Ratna Flats Pritamangar,,Ahmedabad,GJ,380006,+1-5106760081,+1-5106760081,Not captured,Not captured,devalm@gmail.com,Not captured,802052505,,Not captured,Not captured,Not captured,Not captured,Not captured,Not captured,
Not captured,Not captured,02/07/2021,03/05/2021,Not captured,Not captured,863949,020,00072,ARS-02-0058294,Beacon America,Not captured,Not captured,Not captured,Passport(K5378728),,,Shah,Pankaj,,05/19/1956,male,Not captured,Not captured,Not captured,Not captured,Not captured,Not captured,Not captured,Not captured,Not captured,Not captured,Not captured,Not captured,Not captured,Manav Shah,,Not captured,Not captured,Not captured,Not captured,B3 31bachani nagar chs daftary road,,Mumbai,MH,400097,+1-4089212801,+1-4089212801,Not captured,Not captured,manavshah9@gmail.com,Not captured,802052501,,Not captured,Not captured,Not captured,Not captured,Not captured,Not captured,
Not captured,Not captured,02/08/2021,02/12/2021,Not captured,Not captured,863949,020,00072,ARS-02-0058291,Beacon America,Not captured,Not captured,Not captured,Passport(E49227541),,,Wang,Lingxiao,,02/21/1997,male,Not captured,Not captured,Not captured,Not captured,Not captured,Not captured,Not captured,Not captured,Not captured,Not captured,Not captured,Not captured,Not captured,Fei Zheng,,Not captured,Not captured,Not captured,Not captured,11 Lindabei Rd. Haidian District,,Beijing,Beijing,100083,+1-6147724108,,Not captured,Not captured,wanglingxiao1997221@gmail.com,Not captured,802052498,,Not captured,Not captured,Not captured,Not captured,Not captured,Not captured,
Not captured,Not captured,02/07/2021,02/14/2021,Not captured,Not captured,863949,020,00072,ARS-01-0058290,Beacon International,Not captured,Not captured,Not captured,,,,Fraser,Hero,E,01/27/2003,male,Not captured,Not captured,Not captured,Not captured,Not captured,Not captured,Not captured,Not captured,Not captured,Not captured,Not captured,Not captured,Not captured,,,Not captured,Not captured,Not captured,Not captured,2901 Opal Court,,McKinney,Texas,75071,,,Not captured,Not captured,swbfraser2@sbcglobal.net,Not captured,802052497,,Not captured,Not captured,Not captured,Not captured,Not captured,Not captured,
Not captured,Not captured,02/07/2021,02/14/2021,Not captured,Not captured,863949,020,00072,ARS-01-0058289,Beacon International,Not captured,Not captured,Not captured,,,,Fraser,Steven,W,02/25/1965,male,Not captured,Not captured,Not captured,Not captured,Not captured,Not captured,Not captured,Not captured,Not captured,Not captured,Not captured,Not captured,Not captured,,,Not captured,Not captured,Not captured,Not captured,2901 Opal Court,,McKinney,Texas,75071,,,Not captured,Not captured,swbfraser2@sbcglobal.net,Not captured,802052496,,Not captured,Not captured,Not captured,Not captured,Not captured,Not captured,
Not captured,Not captured,02/06/2021,04/30/2021,Not captured,Not captured,863949,020,00072,ARS-02-0058287,Beacon America,Not captured,Not captured,Not captured,Passport(AY5197733),,,Shaikh,Arslan ahmed,,10/20/1991,male,Not captured,Not captured,Not captured,Not captured,Not captured,Not captured,Not captured,Not captured,Not captured,Not captured,Not captured,Not captured,Not captured,Aamna Vawda,,Not captured,Not captured,Not captured,Not captured,100/1 3rd commercial street phase 4 DHA,,Karachi,Sindh,77040,+1-8329038030,,Not captured,Not captured,arslan.shaikh@icloud.com,Not captured,802052494,,Not captured,Not captured,Not captured,Not captured,Not captured,Not captured,
Not captured,Not captured,02/08/2021,06/30/2021,Not captured,Not captured,863949,020,00072,ARS-02-0058286,Beacon America,Not captured,Not captured,Not captured,Passport(EJ4311292),,,FAN,XIANG,,09/27/2009,male,Not captured,Not captured,Not captured,Not captured,Not captured,Not captured,Not captured,Not captured,Not captured,Not captured,Not captured,Not captured,Not captured,GENGDONG SUN,Dependent,Not captured,Not captured,Not captured,Not captured,WANGJIN DONGHUWAN XIQU BLDG8-2 CHAOYANG,,BEIJING,BEIJING,100102,+1-6467013775,+1-6464312821,Not captured,Not captured,gd_sun@yahoo.com,Not captured,802052493,,Not captured,Not captured,Not captured,Not captured,Not captured,Not captured,
Not captured,Not captured,02/08/2021,06/30/2021,Not captured,Not captured,863949,020,00072,ARS-02-0058285,Beacon America,Not captured,Not captured,Not captured,Passport(EB8558295),,,YUAN,MIN,,05/25/1971,female,Not captured,Not captured,Not captured,Not captured,Not captured,Not captured,Not captured,Not captured,Not captured,Not captured,Not captured,Not captured,Not captured,GENGDONG SUN,,Not captured,Not captured,Not captured,Not captured,WANGJIN DONGHUWAN XIQU BLDG8-2 CHAOYANG,,BEIJING,BEIJING,100102,+1-6467013775,+1-6464312821,Not captured,Not captured,gd_sun@yahoo.com,Not captured,802052492,,Not captured,Not captured,Not captured,Not captured,Not captured,Not captured,
Not captured,Not captured,02/06/2021,02/28/2021,Not captured,Not captured,863949,020,00072,ARS-01-0058284,Beacon International,Not captured,Not captured,Not captured,,,,Lipp,Murray,,07/24/1976,male,Not captured,Not captured,Not captured,Not captured,Not captured,Not captured,Not captured,Not captured,Not captured,Not captured,Not captured,Not captured,Not captured,,,Not captured,Not captured,Not captured,Not captured,2196 THIRD AVE PMB 20129,,New York,New York,10035,,,Not captured,Not captured,murray.lipp@gmail.com,Not captured,802052491,,Not captured,Not captured,Not captured,Not captured,Not captured,Not captured,
Not captured,Not captured,02/05/2021,02/26/2021,Not captured,Not captured,863949,020,00072,ARS-01-0058283,Beacon International,Not captured,Not captured,Not captured,Passport(570282762),,,Alhely,Zaina,,07/21/2016,female,Not captured,Not captured,Not captured,Not captured,Not captured,Not captured,Not captured,Not captured,Not captured,Not captured,Not captured,Not captured,Not captured,Kammal,Dependent,Not captured,Not captured,Not captured,Not captured,4818 sea oats cir,,West Palm Beach,FL,33417,+1-5615370575,,Not captured,Not captured,ali.alhely@gmail.com,Not captured,802052490,,Not captured,Not captured,Not captured,Not captured,Not captured,Not captured,
Not captured,Not captured,02/05/2021,02/26/2021,Not captured,Not captured,863949,020,00072,ARS-01-0058282,Beacon International,Not captured,Not captured,Not captured,Passport(652935717),,,Alhely,Seedra,,09/02/2014,female,Not captured,Not captured,Not captured,Not captured,Not captured,Not captured,Not captured,Not captured,Not captured,Not captured,Not captured,Not captured,Not captured,Kammal,Dependent,Not captured,Not captured,Not captured,Not captured,4818 sea oats cir,,West Palm Beach,FL,33417,+1-5615370575,,Not captured,Not captured,ali.alhely@gmail.com,Not captured,802052489,,Not captured,Not captured,Not captured,Not captured,Not captured,Not captured,
Not captured,Not captured,02/05/2021,02/26/2021,Not captured,Not captured,863949,020,00072,ARS-01-0058281,Beacon International,Not captured,Not captured,Not captured,Passport(558038504),,,Jarbou,Safaa,,01/01/1989,female,Not captured,Not captured,Not captured,Not captured,Not captured,Not captured,Not captured,Not captured,Not captured,Not captured,Not captured,Not captured,Not captured,Kammal,Spouse,Not captured,Not captured,Not captured,Not captured,4818 sea oats cir,,West Palm Beach,FL,33417,+1-5615370575,,Not captured,Not captured,ali.alhely@gmail.com,Not captured,802052488,,Not captured,Not captured,Not captured,Not captured,Not captured,Not captured,
Not captured,Not captured,02/05/2021,02/26/2021,Not captured,Not captured,863949,020,00072,ARS-01-0058280,Beacon International,Not captured,Not captured,Not captured,Passport(594806925),,,Alhely,Ali D,,12/04/1987,male,Not captured,Not captured,Not captured,Not captured,Not captured,Not captured,Not captured,Not captured,Not captured,Not captured,Not captured,Not captured,Not captured,Kammal,,Not captured,Not captured,Not captured,Not captured,4818 sea oats cir,,West Palm Beach,FL,33417,+1-5615370575,,Not captured,Not captured,ali.alhely@gmail.com,Not captured,802052487,,Not captured,Not captured,Not captured,Not captured,Not captured,Not captured,
Not captured,Not captured,02/06/2021,02/12/2021,Not captured,Not captured,863949,020,00072,ARS-01-0058279,Beacon International,Not captured,Not captured,Not captured,Passport(599235912),,,Pierce,Josie,,09/21/2000,female,Not captured,Not captured,Not captured,Not captured,Not captured,Not captured,Not captured,Not captured,Not captured,Not captured,Not captured,Not captured,Not captured,,,Not captured,Not captured,Not captured,Not captured,12206 brookshire parkway,,Carmel,Indiana,46033,3178502962,,Not captured,Not captured,Josiepierce11@gmail.com,Not captured,802052486,,Not captured,Not captured,Not captured,Not captured,Not captured,Not captured,
Not captured,Not captured,02/05/2021,04/07/2021,Not captured,Not captured,863949,020,00072,ARS-01-0058278,Beacon International,Not captured,Not captured,Not captured,Passport(012389917),,,Albouidani,Anouar,,04/03/1965,male,Not captured,Not captured,Not captured,Not captured,Not captured,Not captured,Not captured,Not captured,Not captured,Not captured,Not captured,Not captured,Not captured,Hadieh Albouidani,,Not captured,Not captured,Not captured,Not captured,7301 Alma Rd,,Plano,TX,75025,+1-4697340639,,Not captured,Not captured,anouar19655@gmail.com,Not captured,802052485,,Not captured,Not captured,Not captured,Not captured,Not captured,Not captured,
Not captured,Not captured,02/05/2021,03/31/2021,Not captured,Not captured,863949,020,00072,ARS-01-0058275,Beacon International,Not captured,Not captured,Not captured,,,,Goldfeld,Julia,,11/26/1990,female,Not captured,Not captured,Not captured,Not captured,Not captured,Not captured,Not captured,Not captured,Not captured,Not captured,Not captured,Not captured,Not captured,,,Not captured,Not captured,Not captured,Not captured,750 Kappock St,,Bronx,New York,10463,,,Not captured,Not captured,juliagoldfeld@gmail.com,Not captured,802052482,,Not captured,Not captured,Not captured,Not captured,Not captured,Not captured,
Not captured,Not captured,02/04/2021,02/13/2021,Not captured,Not captured,863949,020,00072,ARS-01-0058273,Beacon International,Not captured,Not captured,Not captured,,,,Nebergall,Alexandra,,05/18/1992,female,Not captured,Not captured,Not captured,Not captured,Not captured,Not captured,Not captured,Not captured,Not captured,Not captured,Not captured,Not captured,Not captured,,,Not captured,Not captured,Not captured,Not captured,1319 snow mountain circle,,Keller,Texas,76248,,,Not captured,Not captured,bcnebergall@gmail.com,Not captured,802052480,,Not captured,Not captured,Not captured,Not captured,Not captured,Not captured,
Not captured,Not captured,02/04/2021,02/13/2021,Not captured,Not captured,863949,020,00072,ARS-01-0058272,Beacon International,Not captured,Not captured,Not captured,,,,Nebergall,Benjamin,,08/30/1990,male,Not captured,Not captured,Not captured,Not captured,Not captured,Not captured,Not captured,Not captured,Not captured,Not captured,Not captured,Not captured,Not captured,,,Not captured,Not captured,Not captured,Not captured,1319 snow mountain circle,,Keller,Texas,76248,,,Not captured,Not captured,bcnebergall@gmail.com,Not captured,802052479,,Not captured,Not captured,Not captured,Not captured,Not captured,Not captured,
Not captured,Not captured,02/04/2021,02/18/2021,Not captured,Not captured,863949,020,00072,ARS-01-0058271,Beacon International,Not captured,Not captured,Not captured,Passport(651580937),,,hasan saab,falesteen rami,,12/13/2019,female,Not captured,Not captured,Not captured,Not captured,Not captured,Not captured,Not captured,Not captured,Not captured,Not captured,Not captured,Not captured,Not captured,rami,Dependent,Not captured,Not captured,Not captured,Not captured,56-47,,Maspeth,NY,11378,+1-3479341442,,Not captured,Not captured,llorens.estefania@gmail.com,Not captured,802052478,,Not captured,Not captured,Not captured,Not captured,Not captured,Not captured,
Not captured,Not captured,02/04/2021,02/18/2021,Not captured,Not captured,863949,020,00072,ARS-01-0058270,Beacon International,Not captured,Not captured,Not captured,Passport(xdc415822),,,llorens sanchez,estefania,,01/18/1992,female,Not captured,Not captured,Not captured,Not captured,Not captured,Not captured,Not captured,Not captured,Not captured,Not captured,Not captured,Not captured,Not captured,rami,,Not captured,Not captured,Not captured,Not captured,56-47,,Maspeth,NY,11378,+1-3479341442,,Not captured,Not captured,llorens.estefania@gmail.com,Not captured,802052477,,Not captured,Not captured,Not captured,Not captured,Not captured,Not captured,
Not captured,Not captured,02/04/2021,04/30/2021,Not captured,Not captured,863949,020,00072,ARS-01-0058269,Beacon International,Not captured,Not captured,Not captured,Passport(649185801),,,Scaglione,Ashton Albert,,09/06/2019,male,Not captured,Not captured,Not captured,Not captured,Not captured,Not captured,Not captured,Not captured,Not captured,Not captured,Not captured,Not captured,Not captured,Connie Scaglione,Dependent,Not captured,Not captured,Not captured,Not captured,24196 Loma Prieta Ave,,Los Gatos,CA,95033,+1-8052845923,+1-3106134960,Not captured,Not captured,abeyrae@gmail.com,Not captured,802052476,,Not captured,Not captured,Not captured,Not captured,Not captured,Not captured,
Not captured,Not captured,02/04/2021,04/30/2021,Not captured,Not captured,863949,020,00072,ARS-01-0058268,Beacon International,Not captured,Not captured,Not captured,Passport(546911106),,,Scaglione,Vaughn Clark,,12/15/2015,male,Not captured,Not captured,Not captured,Not captured,Not captured,Not captured,Not captured,Not captured,Not captured,Not captured,Not captured,Not captured,Not captured,Connie Scaglione,Dependent,Not captured,Not captured,Not captured,Not captured,24196 Loma Prieta Ave,,Los Gatos,CA,95033,+1-8052845923,+1-3106134960,Not captured,Not captured,abeyrae@gmail.com,Not captured,802052475,,Not captured,Not captured,Not captured,Not captured,Not captured,Not captured,
Not captured,Not captured,02/04/2021,04/30/2021,Not captured,Not captured,863949,020,00072,ARS-01-0058267,Beacon International,Not captured,Not captured,Not captured,Passport(AE088085),,,Scaglione,Abey Rae,,09/17/1981,female,Not captured,Not captured,Not captured,Not captured,Not captured,Not captured,Not captured,Not captured,Not captured,Not captured,Not captured,Not captured,Not captured,Connie Scaglione,Spouse,Not captured,Not captured,Not captured,Not captured,24196 Loma Prieta Ave,,Los Gatos,CA,95033,+1-8052845923,+1-3106134960,Not captured,Not captured,abeyrae@gmail.com,Not captured,802052474,,Not captured,Not captured,Not captured,Not captured,Not captured,Not captured,
Not captured,Not captured,02/04/2021,04/30/2021,Not captured,Not captured,863949,020,00072,ARS-01-0058266,Beacon International,Not captured,Not captured,Not captured,Passport(528273930),,,Abey Scaglione,Matthew Vaughn,,08/23/1984,male,Not captured,Not captured,Not captured,Not captured,Not captured,Not captured,Not captured,Not captured,Not captured,Not captured,Not captured,Not captured,Not captured,Connie Scaglione,,Not captured,Not captured,Not captured,Not captured,24196 Loma Prieta Ave,,Los Gatos,CA,95033,+1-8052845923,+1-3106134960,Not captured,Not captured,abeyrae@gmail.com,Not captured,802052473,,Not captured,Not captured,Not captured,Not captured,Not captured,Not captured,
Not captured,Not captured,02/07/2021,02/11/2021,Not captured,Not captured,863949,020,00072,ARS-01-0058264,Beacon International,Not captured,Not captured,Not captured,,,,Katz,Gitty,,09/01/1999,female,Not captured,Not captured,Not captured,Not captured,Not captured,Not captured,Not captured,Not captured,Not captured,Not captured,Not captured,Not captured,Not captured,,,Not captured,Not captured,Not captured,Not captured,149 Glen Ave,,Lakewood NJ,,08701,973-800-3888,,Not captured,Not captured,hershiekatz@gmail.com,Not captured,802052471,,Not captured,Not captured,Not captured,Not captured,Not captured,Not captured,
Not captured,Not captured,02/07/2021,02/11/2021,Not captured,Not captured,863949,020,00072,ARS-01-0058263,Beacon International,Not captured,Not captured,Not captured,,,,Katz,Heshie,,04/09/1996,male,Not captured,Not captured,Not captured,Not captured,Not captured,Not captured,Not captured,Not captured,Not captured,Not captured,Not captured,Not captured,Not captured,,,Not captured,Not captured,Not captured,Not captured,149 Glen Ave,,Lakewood NJ,,08701,973-800-3888,,Not captured,Not captured,hershiekatz@gmail.com,Not captured,802052470,,Not captured,Not captured,Not captured,Not captured,Not captured,Not captured,
Not captured,Not captured,02/05/2021,02/18/2021,Not captured,Not captured,863949,020,00072,ARS-01-0058262,Beacon International,Not captured,Not captured,Not captured,Passport(A7508477),,,ALAZAWI,WATHEQ JAAFAR KATTEA,,09/09/1968,male,Not captured,Not captured,Not captured,Not captured,Not captured,Not captured,Not captured,Not captured,Not captured,Not captured,Not captured,Not captured,Not captured,SUHAM QASIM HAJEM ALABOODI,,Not captured,Not captured,Not captured,Not captured,2435 LAURELWOOD CIR,,ANN ARBOR,MI,48108,+1-7342184625,+1-3137120053,Not captured,Not captured,theab1978@gmail.com,Not captured,802052469,,Not captured,Not captured,Not captured,Not captured,Not captured,Not captured,