EE Transaction Type,Dependent Transaction Type,Effective Date,Expiry Date,EE Signature,EE Signature Date,Control,Suffix,Account,Plan Number,Plan Name,Claim Office,Network ID Number,Customer Code,EE SSN,Dependent SSN,Dependent Relationship,Last Name,First Name,Middle Initial,DOB,Gender,Ethnicity,PCP/PCD,PCP/PCD Current Patient,Provider Cap Office Number,COB,Dep Student Indicator,Dep OOA Indicator,EE Prior Coverage Indicator,EE Late Entrant,EE Language Indicator,Hire Date,Earnings,Earnings Frequency,Beneficiary (Last Name First Name MI),Beneficiary Relationship,Continuation of Coverage Expiration Date,Continuation of Coverage Event Date,Continuation of Coverage Length of Coverage,Work Location Zip Code,Street Address Line 1,Street Address Line 2,City,State,Zip Code,Home Phone Number,Work Phone Number,Accept Code,Evidence Code,EE Email Address,Communication Disability Code,EE Alternate ID,Dep Alternate ID,Old Control,Old Suffix,Old Account,New Control,New Suffix,New Account,
Not captured,Not captured,02/07/2021,02/28/2021,Not captured,Not captured,863949,020,00072,ARS-02-0058298,Beacon America,Not captured,Not captured,Not captured,Passport(K9359850),,,Mehta,Kokilaben,,12/06/1945,female,Not captured,Not captured,Not captured,Not captured,Not captured,Not captured,Not captured,Not captured,Not captured,Not captured,Not captured,Not captured,Not captured,Devalkumar Mehta,,Not captured,Not captured,Not captured,Not captured,B/3 Anmol-Ratna Flats Pritamangar,,Ahmedabad,GJ,380006,+1-5106760081,+1-5106760081,Not captured,Not captured,devalm@gmail.com,Not captured,802052505,,Not captured,Not captured,Not captured,Not captured,Not captured,Not captured,
Not captured,Not captured,02/07/2021,03/05/2021,Not captured,Not captured,863949,020,00072,ARS-02-0058294,Beacon America,Not captured,Not captured,Not captured,Passport(K5378728),,,Shah,Pankaj,,05/19/1956,male,Not captured,Not captured,Not captured,Not captured,Not captured,Not captured,Not captured,Not captured,Not captured,Not captured,Not captured,Not captured,Not captured,Manav Shah,,Not captured,Not captured,Not captured,Not captured,B3 31bachani nagar chs daftary road,,Mumbai,MH,400097,+1-4089212801,+1-4089212801,Not captured,Not captured,manavshah9@gmail.com,Not captured,802052501,,Not captured,Not captured,Not captured,Not captured,Not captured,Not captured,
Not captured,Not captured,02/07/2021,02/14/2021,Not captured,Not captured,863949,020,00072,ARS-01-0058290,Beacon International,Not captured,Not captured,Not captured,,,,Fraser,Hero,E,01/27/2003,male,Not captured,Not captured,Not captured,Not captured,Not captured,Not captured,Not captured,Not captured,Not captured,Not captured,Not captured,Not captured,Not captured,,,Not captured,Not captured,Not captured,Not captured,2901 Opal Court,,McKinney,Texas,75071,,,Not captured,Not captured,swbfraser2@sbcglobal.net,Not captured,802052497,,Not captured,Not captured,Not captured,Not captured,Not captured,Not captured,
Not captured,Not captured,02/07/2021,02/14/2021,Not captured,Not captured,863949,020,00072,ARS-01-0058289,Beacon International,Not captured,Not captured,Not captured,,,,Fraser,Steven,W,02/25/1965,male,Not captured,Not captured,Not captured,Not captured,Not captured,Not captured,Not captured,Not captured,Not captured,Not captured,Not captured,Not captured,Not captured,,,Not captured,Not captured,Not captured,Not captured,2901 Opal Court,,McKinney,Texas,75071,,,Not captured,Not captured,swbfraser2@sbcglobal.net,Not captured,802052496,,Not captured,Not captured,Not captured,Not captured,Not captured,Not captured,
Not captured,Not captured,02/06/2021,04/30/2021,Not captured,Not captured,863949,020,00072,ARS-02-0058287,Beacon America,Not captured,Not captured,Not captured,Passport(AY5197733),,,Shaikh,Arslan ahmed,,10/20/1991,male,Not captured,Not captured,Not captured,Not captured,Not captured,Not captured,Not captured,Not captured,Not captured,Not captured,Not captured,Not captured,Not captured,Aamna Vawda,,Not captured,Not captured,Not captured,Not captured,100/1 3rd commercial street phase 4 DHA,,Karachi,Sindh,77040,+1-8329038030,,Not captured,Not captured,arslan.shaikh@icloud.com,Not captured,802052494,,Not captured,Not captured,Not captured,Not captured,Not captured,Not captured,
Not captured,Not captured,02/06/2021,02/28/2021,Not captured,Not captured,863949,020,00072,ARS-01-0058284,Beacon International,Not captured,Not captured,Not captured,,,,Lipp,Murray,,07/24/1976,male,Not captured,Not captured,Not captured,Not captured,Not captured,Not captured,Not captured,Not captured,Not captured,Not captured,Not captured,Not captured,Not captured,,,Not captured,Not captured,Not captured,Not captured,2196 THIRD AVE PMB 20129,,New York,New York,10035,,,Not captured,Not captured,murray.lipp@gmail.com,Not captured,802052491,,Not captured,Not captured,Not captured,Not captured,Not captured,Not captured,
Not captured,Not captured,02/05/2021,02/26/2021,Not captured,Not captured,863949,020,00072,ARS-01-0058283,Beacon International,Not captured,Not captured,Not captured,Passport(570282762),,,Alhely,Zaina,,07/21/2016,female,Not captured,Not captured,Not captured,Not captured,Not captured,Not captured,Not captured,Not captured,Not captured,Not captured,Not captured,Not captured,Not captured,Kammal,Dependent,Not captured,Not captured,Not captured,Not captured,4818 sea oats cir,,West Palm Beach,FL,33417,+1-5615370575,,Not captured,Not captured,ali.alhely@gmail.com,Not captured,802052490,,Not captured,Not captured,Not captured,Not captured,Not captured,Not captured,
Not captured,Not captured,02/05/2021,02/26/2021,Not captured,Not captured,863949,020,00072,ARS-01-0058282,Beacon International,Not captured,Not captured,Not captured,Passport(652935717),,,Alhely,Seedra,,09/02/2014,female,Not captured,Not captured,Not captured,Not captured,Not captured,Not captured,Not captured,Not captured,Not captured,Not captured,Not captured,Not captured,Not captured,Kammal,Dependent,Not captured,Not captured,Not captured,Not captured,4818 sea oats cir,,West Palm Beach,FL,33417,+1-5615370575,,Not captured,Not captured,ali.alhely@gmail.com,Not captured,802052489,,Not captured,Not captured,Not captured,Not captured,Not captured,Not captured,
Not captured,Not captured,02/05/2021,02/26/2021,Not captured,Not captured,863949,020,00072,ARS-01-0058281,Beacon International,Not captured,Not captured,Not captured,Passport(558038504),,,Jarbou,Safaa,,01/01/1989,female,Not captured,Not captured,Not captured,Not captured,Not captured,Not captured,Not captured,Not captured,Not captured,Not captured,Not captured,Not captured,Not captured,Kammal,Spouse,Not captured,Not captured,Not captured,Not captured,4818 sea oats cir,,West Palm Beach,FL,33417,+1-5615370575,,Not captured,Not captured,ali.alhely@gmail.com,Not captured,802052488,,Not captured,Not captured,Not captured,Not captured,Not captured,Not captured,
Not captured,Not captured,02/05/2021,02/26/2021,Not captured,Not captured,863949,020,00072,ARS-01-0058280,Beacon International,Not captured,Not captured,Not captured,Passport(594806925),,,Alhely,Ali D,,12/04/1987,male,Not captured,Not captured,Not captured,Not captured,Not captured,Not captured,Not captured,Not captured,Not captured,Not captured,Not captured,Not captured,Not captured,Kammal,,Not captured,Not captured,Not captured,Not captured,4818 sea oats cir,,West Palm Beach,FL,33417,+1-5615370575,,Not captured,Not captured,ali.alhely@gmail.com,Not captured,802052487,,Not captured,Not captured,Not captured,Not captured,Not captured,Not captured,
Not captured,Not captured,02/06/2021,02/12/2021,Not captured,Not captured,863949,020,00072,ARS-01-0058279,Beacon International,Not captured,Not captured,Not captured,Passport(599235912),,,Pierce,Josie,,09/21/2000,female,Not captured,Not captured,Not captured,Not captured,Not captured,Not captured,Not captured,Not captured,Not captured,Not captured,Not captured,Not captured,Not captured,,,Not captured,Not captured,Not captured,Not captured,12206 brookshire parkway,,Carmel,Indiana,46033,3178502962,,Not captured,Not captured,Josiepierce11@gmail.com,Not captured,802052486,,Not captured,Not captured,Not captured,Not captured,Not captured,Not captured,
Not captured,Not captured,02/05/2021,04/07/2021,Not captured,Not captured,863949,020,00072,ARS-01-0058278,Beacon International,Not captured,Not captured,Not captured,Passport(012389917),,,Albouidani,Anouar,,04/03/1965,male,Not captured,Not captured,Not captured,Not captured,Not captured,Not captured,Not captured,Not captured,Not captured,Not captured,Not captured,Not captured,Not captured,Hadieh Albouidani,,Not captured,Not captured,Not captured,Not captured,7301 Alma Rd,,Plano,TX,75025,+1-4697340639,,Not captured,Not captured,anouar19655@gmail.com,Not captured,802052485,,Not captured,Not captured,Not captured,Not captured,Not captured,Not captured,
Not captured,Not captured,02/05/2021,03/31/2021,Not captured,Not captured,863949,020,00072,ARS-01-0058275,Beacon International,Not captured,Not captured,Not captured,,,,Goldfeld,Julia,,11/26/1990,female,Not captured,Not captured,Not captured,Not captured,Not captured,Not captured,Not captured,Not captured,Not captured,Not captured,Not captured,Not captured,Not captured,,,Not captured,Not captured,Not captured,Not captured,750 Kappock St,,Bronx,New York,10463,,,Not captured,Not captured,juliagoldfeld@gmail.com,Not captured,802052482,,Not captured,Not captured,Not captured,Not captured,Not captured,Not captured,
Not captured,Not captured,02/04/2021,02/13/2021,Not captured,Not captured,863949,020,00072,ARS-01-0058273,Beacon International,Not captured,Not captured,Not captured,,,,Nebergall,Alexandra,,05/18/1992,female,Not captured,Not captured,Not captured,Not captured,Not captured,Not captured,Not captured,Not captured,Not captured,Not captured,Not captured,Not captured,Not captured,,,Not captured,Not captured,Not captured,Not captured,1319 snow mountain circle,,Keller,Texas,76248,,,Not captured,Not captured,bcnebergall@gmail.com,Not captured,802052480,,Not captured,Not captured,Not captured,Not captured,Not captured,Not captured,
Not captured,Not captured,02/04/2021,02/13/2021,Not captured,Not captured,863949,020,00072,ARS-01-0058272,Beacon International,Not captured,Not captured,Not captured,,,,Nebergall,Benjamin,,08/30/1990,male,Not captured,Not captured,Not captured,Not captured,Not captured,Not captured,Not captured,Not captured,Not captured,Not captured,Not captured,Not captured,Not captured,,,Not captured,Not captured,Not captured,Not captured,1319 snow mountain circle,,Keller,Texas,76248,,,Not captured,Not captured,bcnebergall@gmail.com,Not captured,802052479,,Not captured,Not captured,Not captured,Not captured,Not captured,Not captured,
Not captured,Not captured,02/04/2021,02/18/2021,Not captured,Not captured,863949,020,00072,ARS-01-0058271,Beacon International,Not captured,Not captured,Not captured,Passport(651580937),,,hasan saab,falesteen rami,,12/13/2019,female,Not captured,Not captured,Not captured,Not captured,Not captured,Not captured,Not captured,Not captured,Not captured,Not captured,Not captured,Not captured,Not captured,rami,Dependent,Not captured,Not captured,Not captured,Not captured,56-47,,Maspeth,NY,11378,+1-3479341442,,Not captured,Not captured,llorens.estefania@gmail.com,Not captured,802052478,,Not captured,Not captured,Not captured,Not captured,Not captured,Not captured,
Not captured,Not captured,02/04/2021,02/18/2021,Not captured,Not captured,863949,020,00072,ARS-01-0058270,Beacon International,Not captured,Not captured,Not captured,Passport(xdc415822),,,llorens sanchez,estefania,,01/18/1992,female,Not captured,Not captured,Not captured,Not captured,Not captured,Not captured,Not captured,Not captured,Not captured,Not captured,Not captured,Not captured,Not captured,rami,,Not captured,Not captured,Not captured,Not captured,56-47,,Maspeth,NY,11378,+1-3479341442,,Not captured,Not captured,llorens.estefania@gmail.com,Not captured,802052477,,Not captured,Not captured,Not captured,Not captured,Not captured,Not captured,
Not captured,Not captured,02/04/2021,04/30/2021,Not captured,Not captured,863949,020,00072,ARS-01-0058269,Beacon International,Not captured,Not captured,Not captured,Passport(649185801),,,Scaglione,Ashton Albert,,09/06/2019,male,Not captured,Not captured,Not captured,Not captured,Not captured,Not captured,Not captured,Not captured,Not captured,Not captured,Not captured,Not captured,Not captured,Connie Scaglione,Dependent,Not captured,Not captured,Not captured,Not captured,24196 Loma Prieta Ave,,Los Gatos,CA,95033,+1-8052845923,+1-3106134960,Not captured,Not captured,abeyrae@gmail.com,Not captured,802052476,,Not captured,Not captured,Not captured,Not captured,Not captured,Not captured,
Not captured,Not captured,02/04/2021,04/30/2021,Not captured,Not captured,863949,020,00072,ARS-01-0058268,Beacon International,Not captured,Not captured,Not captured,Passport(546911106),,,Scaglione,Vaughn Clark,,12/15/2015,male,Not captured,Not captured,Not captured,Not captured,Not captured,Not captured,Not captured,Not captured,Not captured,Not captured,Not captured,Not captured,Not captured,Connie Scaglione,Dependent,Not captured,Not captured,Not captured,Not captured,24196 Loma Prieta Ave,,Los Gatos,CA,95033,+1-8052845923,+1-3106134960,Not captured,Not captured,abeyrae@gmail.com,Not captured,802052475,,Not captured,Not captured,Not captured,Not captured,Not captured,Not captured,
Not captured,Not captured,02/04/2021,04/30/2021,Not captured,Not captured,863949,020,00072,ARS-01-0058267,Beacon International,Not captured,Not captured,Not captured,Passport(AE088085),,,Scaglione,Abey Rae,,09/17/1981,female,Not captured,Not captured,Not captured,Not captured,Not captured,Not captured,Not captured,Not captured,Not captured,Not captured,Not captured,Not captured,Not captured,Connie Scaglione,Spouse,Not captured,Not captured,Not captured,Not captured,24196 Loma Prieta Ave,,Los Gatos,CA,95033,+1-8052845923,+1-3106134960,Not captured,Not captured,abeyrae@gmail.com,Not captured,802052474,,Not captured,Not captured,Not captured,Not captured,Not captured,Not captured,
Not captured,Not captured,02/04/2021,04/30/2021,Not captured,Not captured,863949,020,00072,ARS-01-0058266,Beacon International,Not captured,Not captured,Not captured,Passport(528273930),,,Abey Scaglione,Matthew Vaughn,,08/23/1984,male,Not captured,Not captured,Not captured,Not captured,Not captured,Not captured,Not captured,Not captured,Not captured,Not captured,Not captured,Not captured,Not captured,Connie Scaglione,,Not captured,Not captured,Not captured,Not captured,24196 Loma Prieta Ave,,Los Gatos,CA,95033,+1-8052845923,+1-3106134960,Not captured,Not captured,abeyrae@gmail.com,Not captured,802052473,,Not captured,Not captured,Not captured,Not captured,Not captured,Not captured,
Not captured,Not captured,02/07/2021,02/11/2021,Not captured,Not captured,863949,020,00072,ARS-01-0058264,Beacon International,Not captured,Not captured,Not captured,,,,Katz,Gitty,,09/01/1999,female,Not captured,Not captured,Not captured,Not captured,Not captured,Not captured,Not captured,Not captured,Not captured,Not captured,Not captured,Not captured,Not captured,,,Not captured,Not captured,Not captured,Not captured,149 Glen Ave,,Lakewood NJ,,08701,973-800-3888,,Not captured,Not captured,hershiekatz@gmail.com,Not captured,802052471,,Not captured,Not captured,Not captured,Not captured,Not captured,Not captured,
Not captured,Not captured,02/07/2021,02/11/2021,Not captured,Not captured,863949,020,00072,ARS-01-0058263,Beacon International,Not captured,Not captured,Not captured,,,,Katz,Heshie,,04/09/1996,male,Not captured,Not captured,Not captured,Not captured,Not captured,Not captured,Not captured,Not captured,Not captured,Not captured,Not captured,Not captured,Not captured,,,Not captured,Not captured,Not captured,Not captured,149 Glen Ave,,Lakewood NJ,,08701,973-800-3888,,Not captured,Not captured,hershiekatz@gmail.com,Not captured,802052470,,Not captured,Not captured,Not captured,Not captured,Not captured,Not captured,
Not captured,Not captured,02/05/2021,02/18/2021,Not captured,Not captured,863949,020,00072,ARS-01-0058262,Beacon International,Not captured,Not captured,Not captured,Passport(A7508477),,,ALAZAWI,WATHEQ JAAFAR KATTEA,,09/09/1968,male,Not captured,Not captured,Not captured,Not captured,Not captured,Not captured,Not captured,Not captured,Not captured,Not captured,Not captured,Not captured,Not captured,SUHAM QASIM HAJEM ALABOODI,,Not captured,Not captured,Not captured,Not captured,2435 LAURELWOOD CIR,,ANN ARBOR,MI,48108,+1-7342184625,+1-3137120053,Not captured,Not captured,theab1978@gmail.com,Not captured,802052469,,Not captured,Not captured,Not captured,Not captured,Not captured,Not captured,
Not captured,Not captured,02/04/2021,02/28/2021,Not captured,Not captured,863949,020,00072,ARS-02-0058261,Beacon America,Not captured,Not captured,Not captured,Passport(G13874755),,,Hernaiz Leonardo,Sofia,,09/26/1994,female,Not captured,Not captured,Not captured,Not captured,Not captured,Not captured,Not captured,Not captured,Not captured,Not captured,Not captured,Not captured,Not captured,Martin Guerra,,Not captured,Not captured,Not captured,Not captured,Privada de Tamarindos 29,,Cuajimalpa,CDMX,05120,+52-5537274672,,Not captured,Not captured,sofiahernaizl@gmail.com,Not captured,802052457,,Not captured,Not captured,Not captured,Not captured,Not captured,Not captured,
Not captured,Not captured,02/04/2021,02/23/2021,Not captured,Not captured,863949,020,00072,ARS-02-0058260,Beacon America,Not captured,Not captured,Not captured,Passport(R5924533),,,jaltar,yadaiah,,04/30/1954,male,Not captured,Not captured,Not captured,Not captured,Not captured,Not captured,Not captured,Not captured,Not captured,Not captured,Not captured,Not captured,Not captured,sudeshna jaltar,,Not captured,Not captured,Not captured,Not captured,pno.1 syno.32 vanitha hsg society new city colony,,secunderabad,TG,500011,+1-9373444799,+1-4699558254,Not captured,Not captured,jaltar_sudeshna@yahoo.com,Not captured,802052456,,Not captured,Not captured,Not captured,Not captured,Not captured,Not captured,
Not captured,Not captured,02/05/2021,02/09/2021,Not captured,Not captured,863949,020,00072,ARS-01-0058259,Beacon International,Not captured,Not captured,Not captured,Passport(K270121),,,Gonzalez Dominguez,Ernesto Israel,,10/21/1997,male,Not captured,Not captured,Not captured,Not captured,Not captured,Not captured,Not captured,Not captured,Not captured,Not captured,Not captured,Not captured,Not captured,Darlyn rodriguez,,Not captured,Not captured,Not captured,Not captured,2430 Virginia Dr,,Altamonte Springs,FL,32714,+1-3214447007,,Not captured,Not captured,darlyndarlyn10@hotmail.com,Not captured,802052455,,Not captured,Not captured,Not captured,Not captured,Not captured,Not captured,
Not captured,Not captured,02/06/2021,02/10/2021,Not captured,Not captured,863949,020,00072,ARS-01-0058255,Beacon International,Not captured,Not captured,Not captured,Passport(EC4802294),,,FANG,QIMING,,06/15/1965,male,Not captured,Not captured,Not captured,Not captured,Not captured,Not captured,Not captured,Not captured,Not captured,Not captured,Not captured,Not captured,Not captured,MR HABIB,,Not captured,Not captured,Not captured,Not captured,MUDU SHZHOU CHINA,,SHZHOU,JIANGSU,215000,+251-926898989,+251-926898989,Not captured,Not captured,eartextile2019@gmail.com,Not captured,802052451,,Not captured,Not captured,Not captured,Not captured,Not captured,Not captured,
Not captured,Not captured,02/02/2021,02/07/2021,Not captured,Not captured,863949,020,00072,ARS-02-0058252,Beacon America,Not captured,Not captured,Not captured,Passport(32706427),,,Einann,Afek,,12/19/1997,male,Not captured,Not captured,Not captured,Not captured,Not captured,Not captured,Not captured,Not captured,Not captured,Not captured,Not captured,Not captured,Not captured,Guy Einann,,Not captured,Not captured,Not captured,Not captured,Yagor 11,,Dimona,Israel,38000,+1-9294262754,,Not captured,Not captured,afeke3@gmail.com,Not captured,802052230,,Not captured,Not captured,Not captured,Not captured,Not captured,Not captured,
Not captured,Not captured,02/04/2021,02/14/2021,Not captured,Not captured,863949,020,00072,ARS-01-0058251,Beacon International,Not captured,Not captured,Not captured,,,,Deshpande,Shantanu Nishant,,10/10/2004,male,Not captured,Not captured,Not captured,Not captured,Not captured,Not captured,Not captured,Not captured,Not captured,Not captured,Not captured,Not captured,Not captured,nishant deshpande,Dependent,Not captured,Not captured,Not captured,Not captured,880 North California AVenue,,Palo Alto,CA,94303,+1-6502485157,,Not captured,Not captured,nina.bhanap@gmail.com,Not captured,802052229,,Not captured,Not captured,Not captured,Not captured,Not captured,Not captured,
Not captured,Not captured,02/04/2021,02/14/2021,Not captured,Not captured,863949,020,00072,ARS-01-0058250,Beacon International,Not captured,Not captured,Not captured,Passport(555351575),,,Bhanap,Nina,,03/22/1973,female,Not captured,Not captured,Not captured,Not captured,Not captured,Not captured,Not captured,Not captured,Not captured,Not captured,Not captured,Not captured,Not captured,nishant deshpande,,Not captured,Not captured,Not captured,Not captured,880 North California AVenue,,Palo Alto,CA,94303,+1-6502485157,,Not captured,Not captured,nina.bhanap@gmail.com,Not captured,802052228,,Not captured,Not captured,Not captured,Not captured,Not captured,Not captured,
Not captured,Not captured,02/02/2021,01/31/2022,Not captured,Not captured,863949,020,00072,ARS-03-0058175,Essential America,Not captured,Not captured,Not captured,Passport(537717831),,,King,Chris,Charles,07/05/1980,male,Not captured,Not captured,Not captured,Not captured,Not captured,Not captured,Not captured,Not captured,Not captured,Not captured,Not captured,Not captured,Not captured,,,Not captured,Not captured,Not captured,Not captured,563 Camino Las Diligencias,,Irapuato,Guanajuato,36620,208-610-4038,,Not captured,Not captured,chris.king6525@gmail.com,Not captured,802052109,,Not captured,Not captured,Not captured,Not captured,Not captured,Not captured,
Not captured,Not captured,02/02/2021,01/31/2022,Not captured,Not captured,863949,020,00072,ARS-03-0058175,Essential America,Not captured,Not captured,Not captured,,Passport(560896119),Spouse,King,Christy,Lee,09/21/1981,female,Not captured,Not captured,Not captured,Not captured,Not captured,Not captured,Not captured,Not captured,Not captured,Not captured,Not captured,Not captured,Not captured,,,Not captured,Not captured,Not captured,Not captured,563 Camino Las Diligencias,,Irapuato,Guanajuato,36620,208-610-4038,,Not captured,Not captured,chris.king6525@gmail.com,Not captured,,802052221,Not captured,Not captured,Not captured,Not captured,Not captured,Not captured,
Not captured,Not captured,02/02/2021,01/31/2022,Not captured,Not captured,863949,020,00072,ARS-03-0058175,Essential America,Not captured,Not captured,Not captured,,Passport(580667933),Dependant,King,Camden,Lewis,04/03/2005,male,Not captured,Not captured,Not captured,Not captured,Not captured,Not captured,Not captured,Not captured,Not captured,Not captured,Not captured,Not captured,Not captured,,,Not captured,Not captured,Not captured,Not captured,563 Camino Las Diligencias,,Irapuato,Guanajuato,36620,208-610-4038,,Not captured,Not captured,chris.king6525@gmail.com,Not captured,,802052222,Not captured,Not captured,Not captured,Not captured,Not captured,Not captured,