EE Transaction Type,Dependent Transaction Type,Effective Date,Expiry Date,EE Signature,EE Signature Date,Control,Suffix,Account,Plan Number,Plan Name,Claim Office,Network ID Number,Customer Code,EE SSN,Dependent SSN,Dependent Relationship,Last Name,First Name,Middle Initial,DOB,Gender,Ethnicity,PCP/PCD,PCP/PCD Current Patient,Provider Cap Office Number,COB,Dep Student Indicator,Dep OOA Indicator,EE Prior Coverage Indicator,EE Late Entrant,EE Language Indicator,Hire Date,Earnings,Earnings Frequency,Beneficiary (Last Name First Name MI),Beneficiary Relationship,Continuation of Coverage Expiration Date,Continuation of Coverage Event Date,Continuation of Coverage Length of Coverage,Work Location Zip Code,Street Address Line 1,Street Address Line 2,City,State,Zip Code,Home Phone Number,Work Phone Number,Accept Code,Evidence Code,EE Email Address,Communication Disability Code,EE Alternate ID,Dep Alternate ID,Old Control,Old Suffix,Old Account,New Control,New Suffix,New Account,
Not captured,Not captured,01/30/2021,04/10/2021,Not captured,Not captured,863949,020,00072,ARS-01-0058234,Beacon International,Not captured,Not captured,Not captured,,,,Markarid,Melanie,,11/05/1991,female,Not captured,Not captured,Not captured,Not captured,Not captured,Not captured,Not captured,Not captured,Not captured,Not captured,Not captured,Not captured,Not captured,,,Not captured,Not captured,Not captured,Not captured,6255 honolulu ave,,Tujunga,California,91042,,,Not captured,Not captured,melaniemarkarid@gmail.com,Not captured,802052205,,Not captured,Not captured,Not captured,Not captured,Not captured,Not captured,
Not captured,Not captured,01/29/2021,02/28/2021,Not captured,Not captured,863949,020,00072,ARS-02-0058232,Beacon America,Not captured,Not captured,Not captured,,,,Toshniwal,Durga Devi,,08/22/1960,female,Not captured,Not captured,Not captured,Not captured,Not captured,Not captured,Not captured,Not captured,Not captured,Not captured,Not captured,Not captured,Not captured,Ashish Toshniwal,Spouse,Not captured,Not captured,Not captured,Not captured,86 ballygunge place,,kolkata,WB,700019,+1-7654093794,+1-7656107051,Not captured,Not captured,ashishtoshniwal@gmail.com,Not captured,802052203,,Not captured,Not captured,Not captured,Not captured,Not captured,Not captured,
Not captured,Not captured,01/29/2021,02/28/2021,Not captured,Not captured,863949,020,00072,ARS-02-0058231,Beacon America,Not captured,Not captured,Not captured,Passport(N2862255),,,Toshniwal,Chand Prakash,,09/10/1957,male,Not captured,Not captured,Not captured,Not captured,Not captured,Not captured,Not captured,Not captured,Not captured,Not captured,Not captured,Not captured,Not captured,Ashish Toshniwal,,Not captured,Not captured,Not captured,Not captured,86 ballygunge place,,kolkata,WB,700019,+1-7654093794,+1-7656107051,Not captured,Not captured,ashishtoshniwal@gmail.com,Not captured,802052202,,Not captured,Not captured,Not captured,Not captured,Not captured,Not captured,
Not captured,Not captured,01/29/2021,02/27/2021,Not captured,Not captured,863949,020,00072,ARS-02-0058230,Beacon America,Not captured,Not captured,Not captured,Passport(G39555010),,,GARCIA AGUILAR,ERNESTINA,,01/02/1937,female,Not captured,Not captured,Not captured,Not captured,Not captured,Not captured,Not captured,Not captured,Not captured,Not captured,Not captured,Not captured,Not captured,ANA BOLANOS,,Not captured,Not captured,Not captured,Not captured,ave. jalalpa lt 52 manzana 10,,CIUDAD DE MEXICO,CIUDAD DE MEXICO,CIUDAD DE,+1-3868521108,+1-3867171581,Not captured,Not captured,anab678@yahoo.com,Not captured,802052201,,Not captured,Not captured,Not captured,Not captured,Not captured,Not captured,
Not captured,Not captured,01/30/2021,02/28/2021,Not captured,Not captured,863949,020,00072,ARS-01-0058227,Beacon International,Not captured,Not captured,Not captured,,,,Wiren,Leif,M,06/30/1964,male,Not captured,Not captured,Not captured,Not captured,Not captured,Not captured,Not captured,Not captured,Not captured,Not captured,Not captured,Not captured,Not captured,,,Not captured,Not captured,Not captured,Not captured,Långsjövägen 18,,Fjällbacka,,45740,,,Not captured,Not captured,wirenmartin007@gmail.com,Not captured,802052198,,Not captured,Not captured,Not captured,Not captured,Not captured,Not captured,
Not captured,Not captured,01/30/2021,02/07/2021,Not captured,Not captured,863949,020,00072,ARS-02-0058226,Beacon America,Not captured,Not captured,Not captured,,,,Zapata Sarmiento,Jhon Alex,,01/27/2014,male,Not captured,Not captured,Not captured,Not captured,Not captured,Not captured,Not captured,Not captured,Not captured,Not captured,Not captured,Not captured,Not captured,estate,other,Not captured,Not captured,Not captured,Not captured,National Center for State Courts,,Bogota,Distrito Capltal de Santa Fe de Bogotã,na,5714898640 114,,Not captured,Not captured,yrodriguez@ncsc.co,Not captured,802052197,,Not captured,Not captured,Not captured,Not captured,Not captured,Not captured,
Not captured,Not captured,01/30/2021,02/07/2021,Not captured,Not captured,863949,020,00072,ARS-02-0058225,Beacon America,Not captured,Not captured,Not captured,,,,Zapata Sarmiento,Johan Stiven,,01/14/2010,male,Not captured,Not captured,Not captured,Not captured,Not captured,Not captured,Not captured,Not captured,Not captured,Not captured,Not captured,Not captured,Not captured,estate,other,Not captured,Not captured,Not captured,Not captured,National Center for State Courts,,Bogota,Distrito Capltal de Santa Fe de Bogotã,na,5714898640 114,,Not captured,Not captured,yrodriguez@ncsc.co,Not captured,802052196,,Not captured,Not captured,Not captured,Not captured,Not captured,Not captured,
Not captured,Not captured,01/30/2021,02/07/2021,Not captured,Not captured,863949,020,00072,ARS-02-0058224,Beacon America,Not captured,Not captured,Not captured,,,,Zapata Sarmiento,Andres Felipe,,04/18/2004,male,Not captured,Not captured,Not captured,Not captured,Not captured,Not captured,Not captured,Not captured,Not captured,Not captured,Not captured,Not captured,Not captured,estate,other,Not captured,Not captured,Not captured,Not captured,National Center for State Courts,,Bogota,Distrito Capltal de Santa Fe de Bogotã,na,5714898640 114,,Not captured,Not captured,yrodriguez@ncsc.co,Not captured,802052195,,Not captured,Not captured,Not captured,Not captured,Not captured,Not captured,
Not captured,Not captured,01/30/2021,02/07/2021,Not captured,Not captured,863949,020,00072,ARS-02-0058223,Beacon America,Not captured,Not captured,Not captured,,,,Sarmiento Vaquez,Andrea Del Pilar,,09/02/1986,female,Not captured,Not captured,Not captured,Not captured,Not captured,Not captured,Not captured,Not captured,Not captured,Not captured,Not captured,Not captured,Not captured,estate,other,Not captured,Not captured,Not captured,Not captured,National Center for State Courts,,Bogota,Distrito Capltal de Santa Fe de Bogotã,na,5714898640 114,,Not captured,Not captured,yrodriguez@ncsc.co,Not captured,802052194,,Not captured,Not captured,Not captured,Not captured,Not captured,Not captured,
Not captured,Not captured,01/30/2021,02/07/2021,Not captured,Not captured,863949,020,00072,ARS-02-0058222,Beacon America,Not captured,Not captured,Not captured,,,,Zapata Zapata,Jhon Fredy,,02/10/1975,male,Not captured,Not captured,Not captured,Not captured,Not captured,Not captured,Not captured,Not captured,Not captured,Not captured,Not captured,Not captured,Not captured,estate,other,Not captured,Not captured,Not captured,Not captured,National Center for State Courts,,Bogota,Distrito Capltal de Santa Fe de Bogotã,na,5714898640 114,,Not captured,Not captured,yrodriguez@ncsc.co,Not captured,802052193,,Not captured,Not captured,Not captured,Not captured,Not captured,Not captured,
Not captured,Not captured,01/29/2021,01/27/2022,Not captured,Not captured,863949,020,00072,ARS-03-0058176,Essential International,Not captured,Not captured,Not captured,Passport(452006132),,,Province,Derek,Adam,04/14/1989,male,Not captured,Not captured,Not captured,Not captured,Not captured,Not captured,Not captured,Not captured,Not captured,Not captured,Not captured,Not captured,Not captured,,,Not captured,Not captured,Not captured,Not captured,233 S 3rd Street,,Cocoa Beach,Florida,32931,7659605015,,Not captured,Not captured,provincederek@gmail.com,Not captured,802052110,,Not captured,Not captured,Not captured,Not captured,Not captured,Not captured,
Not captured,Not captured,01/29/2021,01/27/2022,Not captured,Not captured,863949,020,00072,ARS-03-0058176,Essential International,Not captured,Not captured,Not captured,,Passport(488719654),Spouse,Province,Chelse,Danielle,09/13/1991,female,Not captured,Not captured,Not captured,Not captured,Not captured,Not captured,Not captured,Not captured,Not captured,Not captured,Not captured,Not captured,Not captured,,,Not captured,Not captured,Not captured,Not captured,233 S 3rd Street,,Cocoa Beach,Florida,32931,7659605015,,Not captured,Not captured,provincederek@gmail.com,Not captured,,802052190,Not captured,Not captured,Not captured,Not captured,Not captured,Not captured,
Not captured,Not captured,01/29/2021,01/27/2022,Not captured,Not captured,863949,020,00072,ARS-03-0058176,Essential International,Not captured,Not captured,Not captured,,Passport(720446667),Dependant,Province,Jonah,Gabriel,06/26/2015,male,Not captured,Not captured,Not captured,Not captured,Not captured,Not captured,Not captured,Not captured,Not captured,Not captured,Not captured,Not captured,Not captured,,,Not captured,Not captured,Not captured,Not captured,233 S 3rd Street,,Cocoa Beach,Florida,32931,7659605015,,Not captured,Not captured,provincederek@gmail.com,Not captured,,802052191,Not captured,Not captured,Not captured,Not captured,Not captured,Not captured,
Not captured,Not captured,01/29/2021,01/27/2022,Not captured,Not captured,863949,020,00072,ARS-03-0058176,Essential International,Not captured,Not captured,Not captured,,Passport(567393149),Dependant,Province,Elias,Owen,02/17/2018,male,Not captured,Not captured,Not captured,Not captured,Not captured,Not captured,Not captured,Not captured,Not captured,Not captured,Not captured,Not captured,Not captured,,,Not captured,Not captured,Not captured,Not captured,233 S 3rd Street,,Cocoa Beach,Florida,32931,7659605015,,Not captured,Not captured,provincederek@gmail.com,Not captured,,802052192,Not captured,Not captured,Not captured,Not captured,Not captured,Not captured,
Not captured,Not captured,01/30/2021,08/01/2021,Not captured,Not captured,863949,020,00072,ARS-02-0058221,Beacon America,Not captured,Not captured,Not captured,,,,Zapata Sarmiento,Jhon Alex,,01/27/2014,male,Not captured,Not captured,Not captured,Not captured,Not captured,Not captured,Not captured,Not captured,Not captured,Not captured,Not captured,Not captured,Not captured,estate,other,Not captured,Not captured,Not captured,Not captured,National Center For State Courts,,Bogota,Distrito Capltal de Santa Fe de Bogotã,na,5714898640 114,,Not captured,Not captured,yrodriguez@ncsc.co,Not captured,802052189,,Not captured,Not captured,Not captured,Not captured,Not captured,Not captured,
Not captured,Not captured,01/30/2021,08/01/2021,Not captured,Not captured,863949,020,00072,ARS-02-0058220,Beacon America,Not captured,Not captured,Not captured,,,,Zapata Sarmiento,John Stiven,,01/14/2010,male,Not captured,Not captured,Not captured,Not captured,Not captured,Not captured,Not captured,Not captured,Not captured,Not captured,Not captured,Not captured,Not captured,estate,other,Not captured,Not captured,Not captured,Not captured,National Center For State Courts,,Bogota,Distrito Capltal de Santa Fe de Bogotã,na,5714898640 114,,Not captured,Not captured,yrodriguez@ncsc.co,Not captured,802052188,,Not captured,Not captured,Not captured,Not captured,Not captured,Not captured,
Not captured,Not captured,01/30/2021,08/01/2021,Not captured,Not captured,863949,020,00072,ARS-02-0058219,Beacon America,Not captured,Not captured,Not captured,,,,Zapata Sarmiento,Andres Felipe,,04/18/2004,male,Not captured,Not captured,Not captured,Not captured,Not captured,Not captured,Not captured,Not captured,Not captured,Not captured,Not captured,Not captured,Not captured,estate,other,Not captured,Not captured,Not captured,Not captured,National Center For State Courts,,Bogota,Distrito Capltal de Santa Fe de Bogotã,na,5714898640 114,,Not captured,Not captured,yrodriguez@ncsc.co,Not captured,802052187,,Not captured,Not captured,Not captured,Not captured,Not captured,Not captured,
Not captured,Not captured,01/30/2021,08/01/2021,Not captured,Not captured,863949,020,00072,ARS-02-0058218,Beacon America,Not captured,Not captured,Not captured,,,,Sarmiento Vaquez,Andrea Del Pilar,,09/02/1986,female,Not captured,Not captured,Not captured,Not captured,Not captured,Not captured,Not captured,Not captured,Not captured,Not captured,Not captured,Not captured,Not captured,estate,other,Not captured,Not captured,Not captured,Not captured,National Center For State Courts,,Bogota,Distrito Capltal de Santa Fe de Bogotã,na,5714898640 114,,Not captured,Not captured,yrodriguez@ncsc.co,Not captured,802052186,,Not captured,Not captured,Not captured,Not captured,Not captured,Not captured,
Not captured,Not captured,01/30/2021,08/01/2021,Not captured,Not captured,863949,020,00072,ARS-02-0058217,Beacon America,Not captured,Not captured,Not captured,,,,Zapata Zapata,Jhon Fredy,,02/10/1975,male,Not captured,Not captured,Not captured,Not captured,Not captured,Not captured,Not captured,Not captured,Not captured,Not captured,Not captured,Not captured,Not captured,estate,other,Not captured,Not captured,Not captured,Not captured,National Center For State Courts,,Bogota,Distrito Capltal de Santa Fe de Bogotã,na,5714898640 114,,Not captured,Not captured,yrodriguez@ncsc.co,Not captured,802052185,,Not captured,Not captured,Not captured,Not captured,Not captured,Not captured,
Not captured,Not captured,01/30/2021,02/28/2021,Not captured,Not captured,863949,020,00072,ARS-02-0058216,Beacon America,Not captured,Not captured,Not captured,Passport(077437714),,,Guerrero,Gabriela,,01/11/1988,female,Not captured,Not captured,Not captured,Not captured,Not captured,Not captured,Not captured,Not captured,Not captured,Not captured,Not captured,Not captured,Not captured,Maritza Ayala,Madre,Not captured,Not captured,Not captured,Not captured,altos de paramillo M15 Pb,,San Cristobal,Tachira,5001,+582763571082,,Not captured,Not captured,gaby.gayala14@gmail.com,Not captured,802052184,,Not captured,Not captured,Not captured,Not captured,Not captured,Not captured,
Not captured,Not captured,01/29/2021,02/05/2021,Not captured,Not captured,863949,020,00072,ARS-01-0058214,Beacon International,Not captured,Not captured,Not captured,,,,Schoenhardt,Cally,D,09/06/1966,female,Not captured,Not captured,Not captured,Not captured,Not captured,Not captured,Not captured,Not captured,Not captured,Not captured,Not captured,Not captured,Not captured,,,Not captured,Not captured,Not captured,Not captured,1223 SANDERSON LN,,ALLEN,Texas,75002,,,Not captured,Not captured,emsav8er@gmail.com,Not captured,802052182,,Not captured,Not captured,Not captured,Not captured,Not captured,Not captured,
Not captured,Not captured,01/29/2021,02/05/2021,Not captured,Not captured,863949,020,00072,ARS-01-0058213,Beacon International,Not captured,Not captured,Not captured,,,,Schoenhardt,Scott,,07/26/1962,male,Not captured,Not captured,Not captured,Not captured,Not captured,Not captured,Not captured,Not captured,Not captured,Not captured,Not captured,Not captured,Not captured,,,Not captured,Not captured,Not captured,Not captured,1223 SANDERSON LN,,ALLEN,Texas,75002,,,Not captured,Not captured,emsav8er@gmail.com,Not captured,802052181,,Not captured,Not captured,Not captured,Not captured,Not captured,Not captured,
Not captured,Not captured,01/28/2021,02/25/2021,Not captured,Not captured,863949,020,00072,ARS-01-0058212,Beacon International,Not captured,Not captured,Not captured,Passport(YC503126),,,Matias Maximo,Guilherme,,02/10/1994,male,Not captured,Not captured,Not captured,Not captured,Not captured,Not captured,Not captured,Not captured,Not captured,Not captured,Not captured,Not captured,Not captured,Wanderleia Nascimento Matias,,Not captured,Not captured,Not captured,Not captured,67 Home St,,Malden,MA,02148,+1-8587177595,,Not captured,Not captured,guiomaximo@outlook.com,Not captured,802052180,,Not captured,Not captured,Not captured,Not captured,Not captured,Not captured,
Not captured,Not captured,01/29/2021,02/03/2021,Not captured,Not captured,863949,020,00072,ARS-02-0058211,Beacon America,Not captured,Not captured,Not captured,Passport(R2054664),,,INGUVA,ANNAPURNA,,02/04/1959,female,Not captured,Not captured,Not captured,Not captured,Not captured,Not captured,Not captured,Not captured,Not captured,Not captured,Not captured,Not captured,Not captured,RAVI INGUVA,,Not captured,Not captured,Not captured,Not captured,H.No. 40-404 P No 285 Jawahar Nagar,,Hyderabad,TG,500040,+1-4255030840,+1-4255030840,Not captured,Not captured,inguvaravi@yahoo.com,Not captured,802052159,,Not captured,Not captured,Not captured,Not captured,Not captured,Not captured,
Not captured,Not captured,01/29/2021,02/03/2021,Not captured,Not captured,863949,020,00072,ARS-02-0058210,Beacon America,Not captured,Not captured,Not captured,Passport(P9305499),,,Inguva,Nageswara Sarma,,12/03/1947,male,Not captured,Not captured,Not captured,Not captured,Not captured,Not captured,Not captured,Not captured,Not captured,Not captured,Not captured,Not captured,Not captured,Ravi Inguva,,Not captured,Not captured,Not captured,Not captured,H.No. 40-404 P no 285 Jawahar Nagar,,Hyderabad,TG,500040,+1-4255030840,+1-4255030840,Not captured,Not captured,inguvaravi@yahoo.com,Not captured,802052158,,Not captured,Not captured,Not captured,Not captured,Not captured,Not captured,
Not captured,Not captured,01/29/2021,05/10/2021,Not captured,Not captured,863949,020,00072,ARS-01-0058205,Beacon International,Not captured,Not captured,Not captured,Passport(657656925),,,Cirillo,Marina Ann,,01/24/2001,female,Not captured,Not captured,Not captured,Not captured,Not captured,Not captured,Not captured,Not captured,Not captured,Not captured,Not captured,Not captured,Not captured,Melanie Cirillo,,Not captured,Not captured,Not captured,Not captured,25 Ocean View Parkway,,Southampton,NY,11968,+1-6315069348,+1-6318756611,Not captured,Not captured,melges@optonline.net,Not captured,802052153,,Not captured,Not captured,Not captured,Not captured,Not captured,Not captured,
Not captured,Not captured,01/27/2021,02/05/2021,Not captured,Not captured,863949,020,00072,ARS-01-0058204,Beacon International,Not captured,Not captured,Not captured,,,,Losee,John,E,11/07/1963,male,Not captured,Not captured,Not captured,Not captured,Not captured,Not captured,Not captured,Not captured,Not captured,Not captured,Not captured,Not captured,Not captured,,,Not captured,Not captured,Not captured,Not captured,108 Campbell Lane,,Deering,New Hampshire,03244,,,Not captured,Not captured,jjlosee@hotmail.com,Not captured,802052152,,Not captured,Not captured,Not captured,Not captured,Not captured,Not captured,
Not captured,Not captured,01/27/2021,01/31/2021,Not captured,Not captured,863949,020,00072,ARS-01-0058200,Beacon International,Not captured,Not captured,Not captured,,,,sutor,Taylor,r,11/04/1994,female,Not captured,Not captured,Not captured,Not captured,Not captured,Not captured,Not captured,Not captured,Not captured,Not captured,Not captured,Not captured,Not captured,,,Not captured,Not captured,Not captured,Not captured,1851 n birdsell dr,,Wasilla,Alaska,99623,,,Not captured,Not captured,Taylorrsutor@gmail.com,Not captured,802052148,,Not captured,Not captured,Not captured,Not captured,Not captured,Not captured,
Not captured,Not captured,01/27/2021,01/31/2021,Not captured,Not captured,863949,020,00072,ARS-01-0058198,Beacon International,Not captured,Not captured,Not captured,,,,Warfman,Joel,,06/27/1980,male,Not captured,Not captured,Not captured,Not captured,Not captured,Not captured,Not captured,Not captured,Not captured,Not captured,Not captured,Not captured,Not captured,,,Not captured,Not captured,Not captured,Not captured,1352 52nd Street,,Brooklyn NY,,10950,732-886-5751,,Not captured,Not captured,avrumi43@gmail.com,Not captured,802052132,,Not captured,Not captured,Not captured,Not captured,Not captured,Not captured,
Not captured,Not captured,01/27/2021,01/31/2021,Not captured,Not captured,863949,020,00072,ARS-01-0058196,Beacon International,Not captured,Not captured,Not captured,,,,stein,chaim,h,09/25/1995,male,Not captured,Not captured,Not captured,Not captured,Not captured,Not captured,Not captured,Not captured,Not captured,Not captured,Not captured,Not captured,Not captured,,,Not captured,Not captured,Not captured,Not captured,53 walton st.,,brooklyn,New York,11206,,,Not captured,Not captured,chaimhstein@gmail.com,Not captured,802052130,,Not captured,Not captured,Not captured,Not captured,Not captured,Not captured,
Not captured,Not captured,01/27/2021,01/31/2021,Not captured,Not captured,863949,020,00072,ARS-01-0058194,Beacon International,Not captured,Not captured,Not captured,,,,Neuman,Wolf,,01/04/1988,male,Not captured,Not captured,Not captured,Not captured,Not captured,Not captured,Not captured,Not captured,Not captured,Not captured,Not captured,Not captured,Not captured,,,Not captured,Not captured,Not captured,Not captured,22 oak glen rd,,Monsey,New York,10952,,,Not captured,Not captured,zev.neuman@gmail.com,Not captured,802052128,,Not captured,Not captured,Not captured,Not captured,Not captured,Not captured,
Not captured,Not captured,01/27/2021,02/07/2021,Not captured,Not captured,863949,020,00072,ARS-01-0058193,Beacon International,Not captured,Not captured,Not captured,,,,Reuter,Diana,,08/12/1971,female,Not captured,Not captured,Not captured,Not captured,Not captured,Not captured,Not captured,Not captured,Not captured,Not captured,Not captured,Not captured,Not captured,,,Not captured,Not captured,Not captured,Not captured,4016 Hillbrook Dr,,Louisville,Kentucky,40220,,,Not captured,Not captured,eugenereuter@twc.com,Not captured,802052127,,Not captured,Not captured,Not captured,Not captured,Not captured,Not captured,
Not captured,Not captured,01/27/2021,02/07/2021,Not captured,Not captured,863949,020,00072,ARS-01-0058192,Beacon International,Not captured,Not captured,Not captured,,,,Reuter,Eugene,,10/29/1967,male,Not captured,Not captured,Not captured,Not captured,Not captured,Not captured,Not captured,Not captured,Not captured,Not captured,Not captured,Not captured,Not captured,,,Not captured,Not captured,Not captured,Not captured,4016 Hillbrook Dr,,Louisville,Kentucky,40220,,,Not captured,Not captured,eugenereuter@twc.com,Not captured,802052126,,Not captured,Not captured,Not captured,Not captured,Not captured,Not captured,
Not captured,Not captured,01/27/2021,01/31/2021,Not captured,Not captured,863949,020,00072,ARS-01-0058191,Beacon International,Not captured,Not captured,Not captured,,,,Ouedraogo,Moussa Yaya,,08/13/1984,male,Not captured,Not captured,Not captured,Not captured,Not captured,Not captured,Not captured,Not captured,Not captured,Not captured,Not captured,Not captured,Not captured,,,Not captured,Not captured,Not captured,Not captured,15 BP 15 Ouaga,,Ouagadougou,,15,,,Not captured,Not captured,cpoonwah@safer-access.com,Not captured,802052125,,Not captured,Not captured,Not captured,Not captured,Not captured,Not captured,