EE Transaction Type,Dependent Transaction Type,Effective Date,Expiry Date,EE Signature,EE Signature Date,Control,Suffix,Account,Plan Number,Plan Name,Claim Office,Network ID Number,Customer Code,EE SSN,Dependent SSN,Dependent Relationship,Last Name,First Name,Middle Initial,DOB,Gender,Ethnicity,PCP/PCD,PCP/PCD Current Patient,Provider Cap Office Number,COB,Dep Student Indicator,Dep OOA Indicator,EE Prior Coverage Indicator,EE Late Entrant,EE Language Indicator,Hire Date,Earnings,Earnings Frequency,Beneficiary (Last Name First Name MI),Beneficiary Relationship,Continuation of Coverage Expiration Date,Continuation of Coverage Event Date,Continuation of Coverage Length of Coverage,Work Location Zip Code,Street Address Line 1,Street Address Line 2,City,State,Zip Code,Home Phone Number,Work Phone Number,Accept Code,Evidence Code,EE Email Address,Communication Disability Code,EE Alternate ID,Dep Alternate ID,Old Control,Old Suffix,Old Account,New Control,New Suffix,New Account,
Not captured,Not captured,01/23/2021,01/27/2021,Not captured,Not captured,863949,020,00072,ARS-02-0058158,Beacon America,Not captured,Not captured,Not captured,Passport(96461327),,,Litzman,Avraham Osher,,03/06/1982,male,Not captured,Not captured,Not captured,Not captured,Not captured,Not captured,Not captured,Not captured,Not captured,Not captured,Not captured,Not captured,Not captured,Miriam musia Litzman,,Not captured,Not captured,Not captured,Not captured,744-17 Hannam-Dong,,Yongsan-Gu,Seoul,04348,+1-6467199022,,Not captured,Not captured,olitzman@gmail.com,Not captured,802052087,,Not captured,Not captured,Not captured,Not captured,Not captured,Not captured,
Not captured,Not captured,01/23/2021,05/31/2021,Not captured,Not captured,863949,020,00072,ARS-01-0058156,Beacon International,Not captured,Not captured,Not captured,,,,Kennedy,Erin,,10/21/2002,female,Not captured,Not captured,Not captured,Not captured,Not captured,Not captured,Not captured,Not captured,Not captured,Not captured,Not captured,Not captured,Not captured,,,Not captured,Not captured,Not captured,Not captured,31 NW Landing Road,,East Hampton,New York,11937,,,Not captured,Not captured,1859charlesdarwin@gmail.com,Not captured,802052085,,Not captured,Not captured,Not captured,Not captured,Not captured,Not captured,
Not captured,Not captured,01/23/2021,02/22/2021,Not captured,Not captured,863949,020,00072,ARS-02-0058155,Beacon America,Not captured,Not captured,Not captured,Passport(G7846092),,,Liao,Longbiao,,06/19/1974,male,Not captured,Not captured,Not captured,Not captured,Not captured,Not captured,Not captured,Not captured,Not captured,Not captured,Not captured,Not captured,Not captured,yan ma,,Not captured,Not captured,Not captured,Not captured,Baimiaocun W St Changping District Beijing ,,beijing,beijing,130665,+1-8323530686,,Not captured,Not captured,lbliao@gmail.com,Not captured,802052084,,Not captured,Not captured,Not captured,Not captured,Not captured,Not captured,
Not captured,Not captured,01/22/2021,03/05/2021,Not captured,Not captured,863949,020,00072,ARS-01-0058152,Beacon International,Not captured,Not captured,Not captured,Passport(541183895),,,Berguno,Cesar,,01/06/1963,male,Not captured,Not captured,Not captured,Not captured,Not captured,Not captured,Not captured,Not captured,Not captured,Not captured,Not captured,Not captured,Not captured,Peter Ohaie,,Not captured,Not captured,Not captured,Not captured,24101 hartland street,,West hills,CA,91307,+1-8185717409,,Not captured,Not captured,cesarberguno@yahoo.com,Not captured,802052081,,Not captured,Not captured,Not captured,Not captured,Not captured,Not captured,
Not captured,Not captured,01/23/2021,03/06/2021,Not captured,Not captured,863949,020,00072,ARS-02-0058151,Beacon America,Not captured,Not captured,Not captured,,,,Tafaj,Merita,,11/28/1959,female,Not captured,Not captured,Not captured,Not captured,Not captured,Not captured,Not captured,Not captured,Not captured,Not captured,Not captured,Not captured,Not captured,Olta Tafaj Reddy,Spouse,Not captured,Not captured,Not captured,Not captured,Rr Musa Maci pll 25 hyrja 4 apt 13,,Tirana,Tirana,1001,+1-6083350936,,Not captured,Not captured,yrakeshreddy@gmail.com,Not captured,802052080,,Not captured,Not captured,Not captured,Not captured,Not captured,Not captured,
Not captured,Not captured,01/23/2021,03/06/2021,Not captured,Not captured,863949,020,00072,ARS-02-0058150,Beacon America,Not captured,Not captured,Not captured,Passport(BI9437800),,,Tafaj,Astrit,,10/10/1953,male,Not captured,Not captured,Not captured,Not captured,Not captured,Not captured,Not captured,Not captured,Not captured,Not captured,Not captured,Not captured,Not captured,Olta Tafaj Reddy,,Not captured,Not captured,Not captured,Not captured,Rr Musa Maci pll 25 hyrja 4 apt 13,,Tirana,Tirana,1001,+1-6083350936,,Not captured,Not captured,yrakeshreddy@gmail.com,Not captured,802052079,,Not captured,Not captured,Not captured,Not captured,Not captured,Not captured,
Not captured,Not captured,01/23/2021,01/28/2021,Not captured,Not captured,863949,020,00072,ARS-01-0058149,Beacon International,Not captured,Not captured,Not captured,Passport(539444524),,,Azhar,Azaan,,04/30/2000,male,Not captured,Not captured,Not captured,Not captured,Not captured,Not captured,Not captured,Not captured,Not captured,Not captured,Not captured,Not captured,Not captured,Rehana Azhar,,Not captured,Not captured,Not captured,Not captured,146 Gladstone Park Gardens,,London,England,Nw2 6rl,+44-7806705736,,Not captured,Not captured,azaanazhar146@gmail.com,Not captured,802052078,,Not captured,Not captured,Not captured,Not captured,Not captured,Not captured,
Not captured,Not captured,01/22/2021,01/20/2022,Not captured,Not captured,863949,020,00072,ARS-03-0058137,Essential International,Not captured,Not captured,Not captured,Passport(C4G5Z2MF5),,,Summerlin,Nicholas,Maximilian,11/14/1984,male,Not captured,Not captured,Not captured,Not captured,Not captured,Not captured,Not captured,Not captured,Not captured,Not captured,Not captured,Not captured,Not captured,,,Not captured,Not captured,Not captured,Not captured,Erlenbacher Strasse 34,,Kaiserslautern,Rheinland-Pfalz,67659,+491726698817,,Not captured,Not captured,nicholas.summerlin@gmail.com,Not captured,802052059,,Not captured,Not captured,Not captured,Not captured,Not captured,Not captured,
Not captured,Not captured,01/22/2021,01/20/2022,Not captured,Not captured,863949,020,00072,ARS-03-0058137,Essential International,Not captured,Not captured,Not captured,,Passport(531247435),Spouse,Fox,Navvab,Palacios,07/24/1985,female,Not captured,Not captured,Not captured,Not captured,Not captured,Not captured,Not captured,Not captured,Not captured,Not captured,Not captured,Not captured,Not captured,,,Not captured,Not captured,Not captured,Not captured,Erlenbacher Strasse 34,,Kaiserslautern,Rheinland-Pfalz,67659,+491726698817,,Not captured,Not captured,nicholas.summerlin@gmail.com,Not captured,,802052071,Not captured,Not captured,Not captured,Not captured,Not captured,Not captured,
Not captured,Not captured,01/22/2021,01/20/2022,Not captured,Not captured,863949,020,00072,ARS-03-0058137,Essential International,Not captured,Not captured,Not captured,,Passport(C4VRP0V5H),Dependant,Summerlin,Leonardo,Antonio,05/14/2011,male,Not captured,Not captured,Not captured,Not captured,Not captured,Not captured,Not captured,Not captured,Not captured,Not captured,Not captured,Not captured,Not captured,,,Not captured,Not captured,Not captured,Not captured,Erlenbacher Strasse 34,,Kaiserslautern,Rheinland-Pfalz,67659,+491726698817,,Not captured,Not captured,nicholas.summerlin@gmail.com,Not captured,,802052072,Not captured,Not captured,Not captured,Not captured,Not captured,Not captured,
Not captured,Not captured,01/22/2021,01/20/2022,Not captured,Not captured,863949,020,00072,ARS-03-0058137,Essential International,Not captured,Not captured,Not captured,,Passport(C4VRK6519),Dependant,Summerlin,Maximilian,,06/09/2020,male,Not captured,Not captured,Not captured,Not captured,Not captured,Not captured,Not captured,Not captured,Not captured,Not captured,Not captured,Not captured,Not captured,,,Not captured,Not captured,Not captured,Not captured,Erlenbacher Strasse 34,,Kaiserslautern,Rheinland-Pfalz,67659,+491726698817,,Not captured,Not captured,nicholas.summerlin@gmail.com,Not captured,,802052073,Not captured,Not captured,Not captured,Not captured,Not captured,Not captured,
Not captured,Not captured,01/23/2021,01/26/2021,Not captured,Not captured,863949,020,00072,ARS-01-0058144,Beacon International,Not captured,Not captured,Not captured,,,,Dugas,Kayla,R,12/31/1981,female,Not captured,Not captured,Not captured,Not captured,Not captured,Not captured,Not captured,Not captured,Not captured,Not captured,Not captured,Not captured,Not captured,,,Not captured,Not captured,Not captured,Not captured,12302 Providence Circle,,Lithonia,Georgia,30038,,,Not captured,Not captured,Kayla.Dugas81@gmail.com,Not captured,802052066,,Not captured,Not captured,Not captured,Not captured,Not captured,Not captured,
Not captured,Not captured,01/22/2021,01/25/2021,Not captured,Not captured,863949,020,00072,ARS-01-0058143,Beacon International,Not captured,Not captured,Not captured,,,,Varia,Neelam,,04/28/1994,female,Not captured,Not captured,Not captured,Not captured,Not captured,Not captured,Not captured,Not captured,Not captured,Not captured,Not captured,Not captured,Not captured,,,Not captured,Not captured,Not captured,Not captured,198 E 7th St,,New York,New York,10009,,,Not captured,Not captured,alex.varia90@gmail.com,Not captured,802052065,,Not captured,Not captured,Not captured,Not captured,Not captured,Not captured,
Not captured,Not captured,01/22/2021,01/25/2021,Not captured,Not captured,863949,020,00072,ARS-01-0058142,Beacon International,Not captured,Not captured,Not captured,,,,Whitehead,Alexander,S,07/22/1990,male,Not captured,Not captured,Not captured,Not captured,Not captured,Not captured,Not captured,Not captured,Not captured,Not captured,Not captured,Not captured,Not captured,,,Not captured,Not captured,Not captured,Not captured,198 E 7th St,,New York,New York,10009,,,Not captured,Not captured,alex.varia90@gmail.com,Not captured,802052064,,Not captured,Not captured,Not captured,Not captured,Not captured,Not captured,
Not captured,Not captured,01/23/2021,01/29/2021,Not captured,Not captured,863949,020,00072,ARS-01-0058141,Beacon International,Not captured,Not captured,Not captured,Passport(nm6b8939),,,mansour,mohamed fouad kazem,,02/06/1996,male,Not captured,Not captured,Not captured,Not captured,Not captured,Not captured,Not captured,Not captured,Not captured,Not captured,Not captured,Not captured,Not captured,fouad,,Not captured,Not captured,Not captured,Not captured,18 redhill drive,,edgware,England,ha85jn,+44-07462942265,,Not captured,Not captured,modw_16@hotmail.com,Not captured,802052063,,Not captured,Not captured,Not captured,Not captured,Not captured,Not captured,
Not captured,Not captured,01/21/2021,02/05/2021,Not captured,Not captured,863949,020,00072,ARS-01-0058139,Beacon International,Not captured,Not captured,Not captured,Passport(641873255),,,Clark,Clifton,,08/01/1988,male,Not captured,Not captured,Not captured,Not captured,Not captured,Not captured,Not captured,Not captured,Not captured,Not captured,Not captured,Not captured,Not captured,Kimberly Clark,,Not captured,Not captured,Not captured,Not captured,9255 west russel road,,Las Vegas,NV,89148,+1-4048387200,,Not captured,Not captured,jared@cjclarklawgroup.com,Not captured,802052061,,Not captured,Not captured,Not captured,Not captured,Not captured,Not captured,
Not captured,Not captured,01/21/2021,02/03/2021,Not captured,Not captured,863949,020,00072,ARS-02-0058136,Beacon America,Not captured,Not captured,Not captured,Passport(23408524),,,cohen,menachem mendel,,08/18/2004,male,Not captured,Not captured,Not captured,Not captured,Not captured,Not captured,Not captured,Not captured,Not captured,Not captured,Not captured,Not captured,Not captured,menachem mendel cohen,,Not captured,Not captured,Not captured,Not captured,hashoshanim 4,,kriyat malachi,israel,83033,+972-0545459451,+972-088650971,Not captured,Not captured,770esther@gmail.com,Not captured,802052058,,Not captured,Not captured,Not captured,Not captured,Not captured,Not captured,
Not captured,Not captured,01/22/2021,02/20/2021,Not captured,Not captured,863949,020,00072,ARS-02-0058135,Beacon America,Not captured,Not captured,Not captured,Passport(T4539849),,,Agnihotri,Rekha Mahesh,,01/12/1962,female,Not captured,Not captured,Not captured,Not captured,Not captured,Not captured,Not captured,Not captured,Not captured,Not captured,Not captured,Not captured,Not captured,Sujit Agnihotri,,Not captured,Not captured,Not captured,Not captured,34 A Shri Ram Building 5th Cross Sanmathinagar,,Dharwad,KA,580008,+1-2702931641,,Not captured,Not captured,sujitma1903@gmail.com,Not captured,802052057,,Not captured,Not captured,Not captured,Not captured,Not captured,Not captured,
Not captured,Not captured,01/21/2021,02/20/2021,Not captured,Not captured,863949,020,00072,ARS-01-0058130,Beacon International,Not captured,Not captured,Not captured,Passport(FX403318),,,Paiva Silva,Carla Fernanda,,09/20/2000,female,Not captured,Not captured,Not captured,Not captured,Not captured,Not captured,Not captured,Not captured,Not captured,Not captured,Not captured,Not captured,Not captured,Anders Helms,,Not captured,Not captured,Not captured,Not captured,Bonsucesso Travessa Lineu Machado 289.,,Fortaleza,Ceara,60520514,+55-85981155795,,Not captured,Not captured,desrouleaux@live.dk,Not captured,802052052,,Not captured,Not captured,Not captured,Not captured,Not captured,Not captured,
Not captured,Not captured,01/20/2021,01/25/2021,Not captured,Not captured,863949,020,00072,ARS-01-0058127,Beacon International,Not captured,Not captured,Not captured,,,,SCHWEITZER,Abraham,,05/20/1990,male,Not captured,Not captured,Not captured,Not captured,Not captured,Not captured,Not captured,Not captured,Not captured,Not captured,Not captured,Not captured,Not captured,malky SCHWEITZER,Wife ,Not captured,Not captured,Not captured,Not captured,4319 13th Ave,,BROOKLYN,New York,11219,3477440188,,Not captured,Not captured,avischwei@gmail.com,Not captured,802052049,,Not captured,Not captured,Not captured,Not captured,Not captured,Not captured,
Not captured,Not captured,01/20/2021,01/18/2022,Not captured,Not captured,863949,020,00072,ARS-03-0058117,Essential America,Not captured,Not captured,Not captured,Passport(529877318),,,Selby,Gabriela,St Clair,10/10/1995,female,Not captured,Not captured,Not captured,Not captured,Not captured,Not captured,Not captured,Not captured,Not captured,Not captured,Not captured,Not captured,Not captured,,,Not captured,Not captured,Not captured,Not captured,2921 Beechwood St,,Grand Junction,Colorado,81506,970-779-1654,,Not captured,Not captured,gabriela.selby@gmail.com,Not captured,802052039,,Not captured,Not captured,Not captured,Not captured,Not captured,Not captured,
Not captured,Not captured,01/20/2021,01/31/2021,Not captured,Not captured,863949,020,00072,ARS-02-0058124,Beacon America,Not captured,Not captured,Not captured,,,,Barroeta,Ana Cecilia,,03/27/1962,female,Not captured,Not captured,Not captured,Not captured,Not captured,Not captured,Not captured,Not captured,Not captured,Not captured,Not captured,Not captured,Not captured,Tulio Rafael Diaz Barroeta,Spouse,Not captured,Not captured,Not captured,Not captured,Urb. El Parque Calle 1A,,Barquisimeto,Lara,3001,+1-4693540327,+1-4696017363,Not captured,Not captured,t.diaz.max@gmail.com,Not captured,802052046,,Not captured,Not captured,Not captured,Not captured,Not captured,Not captured,
Not captured,Not captured,01/20/2021,01/31/2021,Not captured,Not captured,863949,020,00072,ARS-02-0058123,Beacon America,Not captured,Not captured,Not captured,Passport(135500190),,,Diaz,Tulio Rafael,,01/17/1965,male,Not captured,Not captured,Not captured,Not captured,Not captured,Not captured,Not captured,Not captured,Not captured,Not captured,Not captured,Not captured,Not captured,Tulio Rafael Diaz Barroeta,,Not captured,Not captured,Not captured,Not captured,Urb. El Parque Calle 1A,,Barquisimeto,Lara,3001,+1-4693540327,+1-4696017363,Not captured,Not captured,t.diaz.max@gmail.com,Not captured,802052045,,Not captured,Not captured,Not captured,Not captured,Not captured,Not captured,
Not captured,Not captured,01/20/2021,01/27/2021,Not captured,Not captured,863949,020,00072,ARS-02-0058122,Beacon America,Not captured,Not captured,Not captured,Passport(L9662419),,,Adangum Purath,Velayudhan,,01/02/1951,male,Not captured,Not captured,Not captured,Not captured,Not captured,Not captured,Not captured,Not captured,Not captured,Not captured,Not captured,Not captured,Not captured,Sujith Nair,,Not captured,Not captured,Not captured,Not captured,SreeNivas,,Malappuram,KL,676519,+1-9785484863,,Not captured,Not captured,offers4svn@gmail.com,Not captured,802052044,,Not captured,Not captured,Not captured,Not captured,Not captured,Not captured,
Not captured,Not captured,01/20/2021,01/27/2021,Not captured,Not captured,863949,020,00072,ARS-02-0058121,Beacon America,Not captured,Not captured,Not captured,Passport(M6986618),,,Nair,Sujatha,,10/10/1959,female,Not captured,Not captured,Not captured,Not captured,Not captured,Not captured,Not captured,Not captured,Not captured,Not captured,Not captured,Not captured,Not captured,Sujith Nair,,Not captured,Not captured,Not captured,Not captured,SreeNivas,,Malappuram,KL,676519,+1-9785484863,,Not captured,Not captured,offers4svn@gmail.com,Not captured,802052043,,Not captured,Not captured,Not captured,Not captured,Not captured,Not captured,
Not captured,Not captured,01/19/2021,01/31/2021,Not captured,Not captured,863949,020,00072,ARS-01-0058120,Beacon International,Not captured,Not captured,Not captured,,,,Andelman,Philip,,04/26/1977,male,Not captured,Not captured,Not captured,Not captured,Not captured,Not captured,Not captured,Not captured,Not captured,Not captured,Not captured,Not captured,Not captured,,,Not captured,Not captured,Not captured,Not captured,229 Rue St. Honore,,Paris,,75001,,,Not captured,Not captured,ce@bullittbranded.com,Not captured,802052042,,Not captured,Not captured,Not captured,Not captured,Not captured,Not captured,
Not captured,Not captured,01/19/2021,01/26/2021,Not captured,Not captured,863949,020,00072,ARS-02-0058119,Beacon America,Not captured,Not captured,Not captured,,,,zilberman,yosef,s,07/02/1980,male,Not captured,Not captured,Not captured,Not captured,Not captured,Not captured,Not captured,Not captured,Not captured,Not captured,Not captured,Not captured,Not captured,,,Not captured,Not captured,Not captured,Not captured,reb shimon bar yochai 22,,modeein ilit,,424449,,,Not captured,Not captured,a0573104527@gmail.com,Not captured,802052041,,Not captured,Not captured,Not captured,Not captured,Not captured,Not captured,
Not captured,Not captured,01/19/2021,02/03/2021,Not captured,Not captured,863949,020,00072,ARS-01-0058115,Beacon International,Not captured,Not captured,Not captured,Passport(NTLJ1PK26),,,Adjmiel,Mohammad,,03/21/1987,male,Not captured,Not captured,Not captured,Not captured,Not captured,Not captured,Not captured,Not captured,Not captured,Not captured,Not captured,Not captured,Not captured,Freshta sedieqie,,Not captured,Not captured,Not captured,Not captured,Veststraat 32,,Dordrecht,Zuid Holland,3311sv,+31-0658983322,,Not captured,Not captured,anoniemg2016@gmail.com,Not captured,802052037,,Not captured,Not captured,Not captured,Not captured,Not captured,Not captured,
Not captured,Not captured,01/19/2021,01/21/2021,Not captured,Not captured,863949,020,00072,ARS-01-0058114,Beacon International,Not captured,Not captured,Not captured,,,,singer,natalie,,06/14/1978,female,Not captured,Not captured,Not captured,Not captured,Not captured,Not captured,Not captured,Not captured,Not captured,Not captured,Not captured,Not captured,Not captured,,,Not captured,Not captured,Not captured,Not captured,292 Edgewood Ave,,Teaneck,New Jersey,07666,,,Not captured,Not captured,natrube@gmail.com,Not captured,802052034,,Not captured,Not captured,Not captured,Not captured,Not captured,Not captured,
Not captured,Not captured,01/20/2021,02/02/2021,Not captured,Not captured,863949,020,00072,ARS-02-0058113,Beacon America,Not captured,Not captured,Not captured,,,,Zicherman,Rivkah,,07/09/1981,female,Not captured,Not captured,Not captured,Not captured,Not captured,Not captured,Not captured,Not captured,Not captured,Not captured,Not captured,Not captured,Not captured,,,Not captured,Not captured,Not captured,Not captured,2 Valenstein,,Jerusalem,,97290,,,Not captured,Not captured,rivkazicherman@gmail.com,Not captured,802052033,,Not captured,Not captured,Not captured,Not captured,Not captured,Not captured,
Not captured,Not captured,01/20/2021,01/24/2021,Not captured,Not captured,863949,020,00072,ARS-01-0058112,Beacon International,Not captured,Not captured,Not captured,Passport(556846253),,,Sprouse,Cole,,02/02/2000,male,Not captured,Not captured,Not captured,Not captured,Not captured,Not captured,Not captured,Not captured,Not captured,Not captured,Not captured,Not captured,Not captured,Cole Sprouse,Self,Not captured,Not captured,Not captured,Not captured,1601 N. Sepulveda Blvd.,,MANHATTAN BEACH,California,90266,3109060275,,Not captured,Not captured,colesprouse38@gmail.com,Not captured,802052032,,Not captured,Not captured,Not captured,Not captured,Not captured,Not captured,
Not captured,Not captured,01/19/2021,02/12/2021,Not captured,Not captured,863949,020,00072,ARS-02-0058111,Beacon America,Not captured,Not captured,Not captured,Passport(P7329518),,,Hari,Madhuri,,06/05/1966,female,Not captured,Not captured,Not captured,Not captured,Not captured,Not captured,Not captured,Not captured,Not captured,Not captured,Not captured,Not captured,Not captured,Priyatham Sagar Kandral Hari,,Not captured,Not captured,Not captured,Not captured,209 Eden blossoms,,Bangalore,KA,560062,+1-3127219788,,Not captured,Not captured,priyathamsagar@gmail.com,Not captured,802052031,,Not captured,Not captured,Not captured,Not captured,Not captured,Not captured,
Not captured,Not captured,01/19/2021,04/18/2021,Not captured,Not captured,863949,020,00072,ARS-02-0058110,Beacon America,Not captured,Not captured,Not captured,,,,Bhat,Ganesh,Vishweshwar,04/29/1959,male,Not captured,Not captured,Not captured,Not captured,Not captured,Not captured,Not captured,Not captured,Not captured,Not captured,Not captured,Not captured,Not captured,,,Not captured,Not captured,Not captured,Not captured,125 Patterson St,,San Jose,CA,95112,,,Not captured,Not captured,bhatganesh59@gmail.com,Not captured,802052030,,Not captured,Not captured,Not captured,Not captured,Not captured,Not captured,
Not captured,Not captured,01/23/2021,01/31/2021,Not captured,Not captured,863949,020,00072,ARS-01-0058109,Beacon International,Not captured,Not captured,Not captured,Passport(529264444),,,McMahan,Phaedra Jonnel,,06/01/1969,female,Not captured,Not captured,Not captured,Not captured,Not captured,Not captured,Not captured,Not captured,Not captured,Not captured,Not captured,Not captured,Not captured,Troy McMahan,,Not captured,Not captured,Not captured,Not captured,2121 Madiera Drive,,Oceanside,CA,92056,+1-9494361942,,Not captured,Not captured,tcm@byu.net,Not captured,802052029,,Not captured,Not captured,Not captured,Not captured,Not captured,Not captured,