EE Transaction Type,Dependent Transaction Type,Effective Date,Expiry Date,EE Signature,EE Signature Date,Control,Suffix,Account,Plan Number,Plan Name,Claim Office,Network ID Number,Customer Code,EE SSN,Dependent SSN,Dependent Relationship,Last Name,First Name,Middle Initial,DOB,Gender,Ethnicity,PCP/PCD,PCP/PCD Current Patient,Provider Cap Office Number,COB,Dep Student Indicator,Dep OOA Indicator,EE Prior Coverage Indicator,EE Late Entrant,EE Language Indicator,Hire Date,Earnings,Earnings Frequency,Beneficiary (Last Name First Name MI),Beneficiary Relationship,Continuation of Coverage Expiration Date,Continuation of Coverage Event Date,Continuation of Coverage Length of Coverage,Work Location Zip Code,Street Address Line 1,Street Address Line 2,City,State,Zip Code,Home Phone Number,Work Phone Number,Accept Code,Evidence Code,EE Email Address,Communication Disability Code,EE Alternate ID,Dep Alternate ID,Old Control,Old Suffix,Old Account,New Control,New Suffix,New Account,
Not captured,Not captured,01/26/2021,02/07/2021,Not captured,Not captured,863949,020,00072,ARS-02-0058184,Beacon America,Not captured,Not captured,Not captured,Passport(EJ3641702),,,Xu,Tian,,05/29/1973,male,Not captured,Not captured,Not captured,Not captured,Not captured,Not captured,Not captured,Not captured,Not captured,Not captured,Not captured,Not captured,Not captured,Changna,,Not captured,Not captured,Not captured,Not captured,8 Bajiao East Street Shijingshan District,,Beijing,Beijing,100060,+1-4699684149,+1-2148361968,Not captured,Not captured,changnaxu@gmail.com,Not captured,802052118,,Not captured,Not captured,Not captured,Not captured,Not captured,Not captured,
Not captured,Not captured,01/25/2021,01/23/2022,Not captured,Not captured,863949,020,00072,ARS-04-0057782,Enhanced America,Not captured,Not captured,Not captured,Passport(533927852),,,Wilkes,Samantha,Jayne,07/26/1971,female,Not captured,Not captured,Not captured,Not captured,Not captured,Not captured,Not captured,Not captured,Not captured,Not captured,Not captured,Not captured,Not captured,,,Not captured,Not captured,Not captured,Not captured,2233 Crofton Ave,,Davenport,Florida,33837,407-460-5787,,Not captured,Not captured,sammiwilkes@gmail.com,Not captured,802051463,,Not captured,Not captured,Not captured,Not captured,Not captured,Not captured,
Not captured,Not captured,01/25/2021,01/23/2022,Not captured,Not captured,863949,020,00072,ARS-04-0057782,Enhanced America,Not captured,Not captured,Not captured,,Passport(560485800),Spouse,Wilkes,Andrew,Michael Derek,07/10/1973,male,Not captured,Not captured,Not captured,Not captured,Not captured,Not captured,Not captured,Not captured,Not captured,Not captured,Not captured,Not captured,Not captured,,,Not captured,Not captured,Not captured,Not captured,2233 Crofton Ave,,Davenport,Florida,33837,407-460-5787,,Not captured,Not captured,sammiwilkes@gmail.com,Not captured,,802052100,Not captured,Not captured,Not captured,Not captured,Not captured,Not captured,
Not captured,Not captured,01/25/2021,01/23/2022,Not captured,Not captured,863949,020,00072,ARS-04-0057782,Enhanced America,Not captured,Not captured,Not captured,,Passport(557899895),Dependant,Wilkes,Charlotte,Louise,07/25/2004,female,Not captured,Not captured,Not captured,Not captured,Not captured,Not captured,Not captured,Not captured,Not captured,Not captured,Not captured,Not captured,Not captured,,,Not captured,Not captured,Not captured,Not captured,2233 Crofton Ave,,Davenport,Florida,33837,407-460-5787,,Not captured,Not captured,sammiwilkes@gmail.com,Not captured,,802052101,Not captured,Not captured,Not captured,Not captured,Not captured,Not captured,
Not captured,Not captured,01/24/2021,02/24/2021,Not captured,Not captured,863949,020,00072,ARS-01-0058170,Beacon International,Not captured,Not captured,Not captured,Passport(659479746),,,Gross,Roy,A;,10/04/1960,male,Not captured,Not captured,Not captured,Not captured,Not captured,Not captured,Not captured,Not captured,Not captured,Not captured,Not captured,Not captured,Not captured,Anne Olieba,Wife,Not captured,Not captured,Not captured,Not captured,551 N. Loma Drive,,lodi,California,95242,+12099929342,,Not captured,Not captured,pastorroygross@gmail.com,Not captured,802052099,,Not captured,Not captured,Not captured,Not captured,Not captured,Not captured,
Not captured,Not captured,01/25/2021,01/29/2021,Not captured,Not captured,863949,020,00072,ARS-01-0058169,Beacon International,Not captured,Not captured,Not captured,Passport(598176611),,,Tessler,Yechiel,,07/26/1982,male,Not captured,Not captured,Not captured,Not captured,Not captured,Not captured,Not captured,Not captured,Not captured,Not captured,Not captured,Not captured,Not captured,Heshy Gottdiener,,Not captured,Not captured,Not captured,Not captured,1239 49,,Brooklyn,NY,11219,+1-(718) 809-2970,,Not captured,Not captured,sprinttessler@gmail.com,Not captured,802052098,,Not captured,Not captured,Not captured,Not captured,Not captured,Not captured,
Not captured,Not captured,01/24/2021,02/08/2021,Not captured,Not captured,863949,020,00072,ARS-02-0058166,Beacon America,Not captured,Not captured,Not captured,Passport(34431447),,,Cohen,Adiel,,01/28/1998,male,Not captured,Not captured,Not captured,Not captured,Not captured,Not captured,Not captured,Not captured,Not captured,Not captured,Not captured,Not captured,Not captured,Itamar Cohen,,Not captured,Not captured,Not captured,Not captured,Menachem 7,,Ramat Gan,Tel Aviv,52324,+972-545814700,,Not captured,Not captured,adi.cohen105@gmail.com,Not captured,802052095,,Not captured,Not captured,Not captured,Not captured,Not captured,Not captured,
Not captured,Not captured,01/24/2021,02/03/2021,Not captured,Not captured,863949,020,00072,ARS-01-0058165,Beacon International,Not captured,Not captured,Not captured,Passport(584604412),,,Ruiz,Pedro Daniel,,06/29/1984,male,Not captured,Not captured,Not captured,Not captured,Not captured,Not captured,Not captured,Not captured,Not captured,Not captured,Not captured,Not captured,Not captured,Rosmary Ruiz,,Not captured,Not captured,Not captured,Not captured,41-60 Bowne St,,Flushing,NY,11355,+1-7187220078,,Not captured,Not captured,alarconrosmary@yahoo.com,Not captured,802052094,,Not captured,Not captured,Not captured,Not captured,Not captured,Not captured,
Not captured,Not captured,01/24/2021,02/07/2021,Not captured,Not captured,863949,020,00072,ARS-02-0058162,Beacon America,Not captured,Not captured,Not captured,,,,Rosenfeld,Susan,T,08/06/1964,female,Not captured,Not captured,Not captured,Not captured,Not captured,Not captured,Not captured,Not captured,Not captured,Not captured,Not captured,Not captured,Not captured,,,Not captured,Not captured,Not captured,Not captured,77 Hamelech David,,Efrat,,9045122,,,Not captured,Not captured,trosenfeld@gmail.com,Not captured,802052091,,Not captured,Not captured,Not captured,Not captured,Not captured,Not captured,
Not captured,Not captured,01/24/2021,02/23/2021,Not captured,Not captured,863949,020,00072,ARS-02-0058161,Beacon America,Not captured,Not captured,Not captured,,,,Samsonowitz,Maureen,,08/16/1955,female,Not captured,Not captured,Not captured,Not captured,Not captured,Not captured,Not captured,Not captured,Not captured,Not captured,Not captured,Not captured,Not captured,,,Not captured,Not captured,Not captured,Not captured,5 Shtruk,,Jerusalem,,9729824,,,Not captured,Not captured,msamson2010@gmail.com,Not captured,802052090,,Not captured,Not captured,Not captured,Not captured,Not captured,Not captured,
Not captured,Not captured,01/24/2021,02/25/2021,Not captured,Not captured,863949,020,00072,ARS-01-0058160,Beacon International,Not captured,Not captured,Not captured,,,,DeWolfe,David,,05/08/1977,male,Not captured,Not captured,Not captured,Not captured,Not captured,Not captured,Not captured,Not captured,Not captured,Not captured,Not captured,Not captured,Not captured,Ergi Saraci,Spouse,Not captured,Not captured,Not captured,Not captured,3773 Woodridge place,,Palm Harbor,FL,34684,+1-3104398824,,Not captured,Not captured,charliekwilde@gmail.com,Not captured,802052089,,Not captured,Not captured,Not captured,Not captured,Not captured,Not captured,
Not captured,Not captured,01/24/2021,02/25/2021,Not captured,Not captured,863949,020,00072,ARS-01-0058159,Beacon International,Not captured,Not captured,Not captured,Passport(555826517),,,Wilde,Charlie,,04/05/1984,female,Not captured,Not captured,Not captured,Not captured,Not captured,Not captured,Not captured,Not captured,Not captured,Not captured,Not captured,Not captured,Not captured,Ergi Saraci,,Not captured,Not captured,Not captured,Not captured,3773 Woodridge place,,Palm Harbor,FL,34684,+1-3104398824,,Not captured,Not captured,charliekwilde@gmail.com,Not captured,802052088,,Not captured,Not captured,Not captured,Not captured,Not captured,Not captured,
Not captured,Not captured,01/23/2021,01/27/2021,Not captured,Not captured,863949,020,00072,ARS-02-0058158,Beacon America,Not captured,Not captured,Not captured,Passport(96461327),,,Litzman,Avraham Osher,,03/06/1982,male,Not captured,Not captured,Not captured,Not captured,Not captured,Not captured,Not captured,Not captured,Not captured,Not captured,Not captured,Not captured,Not captured,Miriam musia Litzman,,Not captured,Not captured,Not captured,Not captured,744-17 Hannam-Dong,,Yongsan-Gu,Seoul,04348,+1-6467199022,,Not captured,Not captured,olitzman@gmail.com,Not captured,802052087,,Not captured,Not captured,Not captured,Not captured,Not captured,Not captured,
Not captured,Not captured,01/23/2021,05/31/2021,Not captured,Not captured,863949,020,00072,ARS-01-0058156,Beacon International,Not captured,Not captured,Not captured,,,,Kennedy,Erin,,10/21/2002,female,Not captured,Not captured,Not captured,Not captured,Not captured,Not captured,Not captured,Not captured,Not captured,Not captured,Not captured,Not captured,Not captured,,,Not captured,Not captured,Not captured,Not captured,31 NW Landing Road,,East Hampton,New York,11937,,,Not captured,Not captured,1859charlesdarwin@gmail.com,Not captured,802052085,,Not captured,Not captured,Not captured,Not captured,Not captured,Not captured,
Not captured,Not captured,01/23/2021,02/22/2021,Not captured,Not captured,863949,020,00072,ARS-02-0058155,Beacon America,Not captured,Not captured,Not captured,Passport(G7846092),,,Liao,Longbiao,,06/19/1974,male,Not captured,Not captured,Not captured,Not captured,Not captured,Not captured,Not captured,Not captured,Not captured,Not captured,Not captured,Not captured,Not captured,yan ma,,Not captured,Not captured,Not captured,Not captured,Baimiaocun W St Changping District Beijing ,,beijing,beijing,130665,+1-8323530686,,Not captured,Not captured,lbliao@gmail.com,Not captured,802052084,,Not captured,Not captured,Not captured,Not captured,Not captured,Not captured,
Not captured,Not captured,01/22/2021,03/05/2021,Not captured,Not captured,863949,020,00072,ARS-01-0058152,Beacon International,Not captured,Not captured,Not captured,Passport(541183895),,,Berguno,Cesar,,01/06/1963,male,Not captured,Not captured,Not captured,Not captured,Not captured,Not captured,Not captured,Not captured,Not captured,Not captured,Not captured,Not captured,Not captured,Peter Ohaie,,Not captured,Not captured,Not captured,Not captured,24101 hartland street,,West hills,CA,91307,+1-8185717409,,Not captured,Not captured,cesarberguno@yahoo.com,Not captured,802052081,,Not captured,Not captured,Not captured,Not captured,Not captured,Not captured,
Not captured,Not captured,01/23/2021,03/06/2021,Not captured,Not captured,863949,020,00072,ARS-02-0058151,Beacon America,Not captured,Not captured,Not captured,,,,Tafaj,Merita,,11/28/1959,female,Not captured,Not captured,Not captured,Not captured,Not captured,Not captured,Not captured,Not captured,Not captured,Not captured,Not captured,Not captured,Not captured,Olta Tafaj Reddy,Spouse,Not captured,Not captured,Not captured,Not captured,Rr Musa Maci pll 25 hyrja 4 apt 13,,Tirana,Tirana,1001,+1-6083350936,,Not captured,Not captured,yrakeshreddy@gmail.com,Not captured,802052080,,Not captured,Not captured,Not captured,Not captured,Not captured,Not captured,
Not captured,Not captured,01/23/2021,03/06/2021,Not captured,Not captured,863949,020,00072,ARS-02-0058150,Beacon America,Not captured,Not captured,Not captured,Passport(BI9437800),,,Tafaj,Astrit,,10/10/1953,male,Not captured,Not captured,Not captured,Not captured,Not captured,Not captured,Not captured,Not captured,Not captured,Not captured,Not captured,Not captured,Not captured,Olta Tafaj Reddy,,Not captured,Not captured,Not captured,Not captured,Rr Musa Maci pll 25 hyrja 4 apt 13,,Tirana,Tirana,1001,+1-6083350936,,Not captured,Not captured,yrakeshreddy@gmail.com,Not captured,802052079,,Not captured,Not captured,Not captured,Not captured,Not captured,Not captured,
Not captured,Not captured,01/23/2021,01/28/2021,Not captured,Not captured,863949,020,00072,ARS-01-0058149,Beacon International,Not captured,Not captured,Not captured,Passport(539444524),,,Azhar,Azaan,,04/30/2000,male,Not captured,Not captured,Not captured,Not captured,Not captured,Not captured,Not captured,Not captured,Not captured,Not captured,Not captured,Not captured,Not captured,Rehana Azhar,,Not captured,Not captured,Not captured,Not captured,146 Gladstone Park Gardens,,London,England,Nw2 6rl,+44-7806705736,,Not captured,Not captured,azaanazhar146@gmail.com,Not captured,802052078,,Not captured,Not captured,Not captured,Not captured,Not captured,Not captured,
Not captured,Not captured,01/22/2021,01/20/2022,Not captured,Not captured,863949,020,00072,ARS-03-0058137,Essential International,Not captured,Not captured,Not captured,Passport(C4G5Z2MF5),,,Summerlin,Nicholas,Maximilian,11/14/1984,male,Not captured,Not captured,Not captured,Not captured,Not captured,Not captured,Not captured,Not captured,Not captured,Not captured,Not captured,Not captured,Not captured,,,Not captured,Not captured,Not captured,Not captured,Erlenbacher Strasse 34,,Kaiserslautern,Rheinland-Pfalz,67659,+491726698817,,Not captured,Not captured,nicholas.summerlin@gmail.com,Not captured,802052059,,Not captured,Not captured,Not captured,Not captured,Not captured,Not captured,
Not captured,Not captured,01/22/2021,01/20/2022,Not captured,Not captured,863949,020,00072,ARS-03-0058137,Essential International,Not captured,Not captured,Not captured,,Passport(531247435),Spouse,Fox,Navvab,Palacios,07/24/1985,female,Not captured,Not captured,Not captured,Not captured,Not captured,Not captured,Not captured,Not captured,Not captured,Not captured,Not captured,Not captured,Not captured,,,Not captured,Not captured,Not captured,Not captured,Erlenbacher Strasse 34,,Kaiserslautern,Rheinland-Pfalz,67659,+491726698817,,Not captured,Not captured,nicholas.summerlin@gmail.com,Not captured,,802052071,Not captured,Not captured,Not captured,Not captured,Not captured,Not captured,
Not captured,Not captured,01/22/2021,01/20/2022,Not captured,Not captured,863949,020,00072,ARS-03-0058137,Essential International,Not captured,Not captured,Not captured,,Passport(C4VRP0V5H),Dependant,Summerlin,Leonardo,Antonio,05/14/2011,male,Not captured,Not captured,Not captured,Not captured,Not captured,Not captured,Not captured,Not captured,Not captured,Not captured,Not captured,Not captured,Not captured,,,Not captured,Not captured,Not captured,Not captured,Erlenbacher Strasse 34,,Kaiserslautern,Rheinland-Pfalz,67659,+491726698817,,Not captured,Not captured,nicholas.summerlin@gmail.com,Not captured,,802052072,Not captured,Not captured,Not captured,Not captured,Not captured,Not captured,
Not captured,Not captured,01/22/2021,01/20/2022,Not captured,Not captured,863949,020,00072,ARS-03-0058137,Essential International,Not captured,Not captured,Not captured,,Passport(C4VRK6519),Dependant,Summerlin,Maximilian,,06/09/2020,male,Not captured,Not captured,Not captured,Not captured,Not captured,Not captured,Not captured,Not captured,Not captured,Not captured,Not captured,Not captured,Not captured,,,Not captured,Not captured,Not captured,Not captured,Erlenbacher Strasse 34,,Kaiserslautern,Rheinland-Pfalz,67659,+491726698817,,Not captured,Not captured,nicholas.summerlin@gmail.com,Not captured,,802052073,Not captured,Not captured,Not captured,Not captured,Not captured,Not captured,
Not captured,Not captured,01/25/2021,04/14/2021,Not captured,Not captured,863949,020,00072,ARS-01-0058148,Beacon International,Not captured,Not captured,Not captured,,,,TARANTINO,SILVANA,,10/12/1960,female,Not captured,Not captured,Not captured,Not captured,Not captured,Not captured,Not captured,Not captured,Not captured,Not captured,Not captured,Not captured,Not captured,robert tarantino,brother,Not captured,Not captured,Not captured,Not captured,2351 WOODFIELD RD,,OAKVILLE,Ontario,L6H6Y6,9052572177,,Not captured,Not captured,zsimo@cogeco.ca,Not captured,802052070,,Not captured,Not captured,Not captured,Not captured,Not captured,Not captured,
Not captured,Not captured,01/25/2021,04/14/2021,Not captured,Not captured,863949,020,00072,ARS-01-0058147,Beacon International,Not captured,Not captured,Not captured,Passport(NA),,,SIMO,ZOLTAN,,09/22/1961,male,Not captured,Not captured,Not captured,Not captured,Not captured,Not captured,Not captured,Not captured,Not captured,Not captured,Not captured,Not captured,Not captured,robert tarantino,brother,Not captured,Not captured,Not captured,Not captured,2351 WOODFIELD RD,,OAKVILLE,Ontario,L6H6Y6,9052572177,,Not captured,Not captured,zsimo@cogeco.ca,Not captured,802052069,,Not captured,Not captured,Not captured,Not captured,Not captured,Not captured,
Not captured,Not captured,01/23/2021,01/26/2021,Not captured,Not captured,863949,020,00072,ARS-01-0058144,Beacon International,Not captured,Not captured,Not captured,,,,Dugas,Kayla,R,12/31/1981,female,Not captured,Not captured,Not captured,Not captured,Not captured,Not captured,Not captured,Not captured,Not captured,Not captured,Not captured,Not captured,Not captured,,,Not captured,Not captured,Not captured,Not captured,12302 Providence Circle,,Lithonia,Georgia,30038,,,Not captured,Not captured,Kayla.Dugas81@gmail.com,Not captured,802052066,,Not captured,Not captured,Not captured,Not captured,Not captured,Not captured,
Not captured,Not captured,01/22/2021,01/25/2021,Not captured,Not captured,863949,020,00072,ARS-01-0058143,Beacon International,Not captured,Not captured,Not captured,,,,Varia,Neelam,,04/28/1994,female,Not captured,Not captured,Not captured,Not captured,Not captured,Not captured,Not captured,Not captured,Not captured,Not captured,Not captured,Not captured,Not captured,,,Not captured,Not captured,Not captured,Not captured,198 E 7th St,,New York,New York,10009,,,Not captured,Not captured,alex.varia90@gmail.com,Not captured,802052065,,Not captured,Not captured,Not captured,Not captured,Not captured,Not captured,
Not captured,Not captured,01/22/2021,01/25/2021,Not captured,Not captured,863949,020,00072,ARS-01-0058142,Beacon International,Not captured,Not captured,Not captured,,,,Whitehead,Alexander,S,07/22/1990,male,Not captured,Not captured,Not captured,Not captured,Not captured,Not captured,Not captured,Not captured,Not captured,Not captured,Not captured,Not captured,Not captured,,,Not captured,Not captured,Not captured,Not captured,198 E 7th St,,New York,New York,10009,,,Not captured,Not captured,alex.varia90@gmail.com,Not captured,802052064,,Not captured,Not captured,Not captured,Not captured,Not captured,Not captured,
Not captured,Not captured,01/23/2021,01/29/2021,Not captured,Not captured,863949,020,00072,ARS-01-0058141,Beacon International,Not captured,Not captured,Not captured,Passport(nm6b8939),,,mansour,mohamed fouad kazem,,02/06/1996,male,Not captured,Not captured,Not captured,Not captured,Not captured,Not captured,Not captured,Not captured,Not captured,Not captured,Not captured,Not captured,Not captured,fouad,,Not captured,Not captured,Not captured,Not captured,18 redhill drive,,edgware,England,ha85jn,+44-07462942265,,Not captured,Not captured,modw_16@hotmail.com,Not captured,802052063,,Not captured,Not captured,Not captured,Not captured,Not captured,Not captured,
Not captured,Not captured,01/21/2021,02/05/2021,Not captured,Not captured,863949,020,00072,ARS-01-0058139,Beacon International,Not captured,Not captured,Not captured,Passport(641873255),,,Clark,Clifton,,08/01/1988,male,Not captured,Not captured,Not captured,Not captured,Not captured,Not captured,Not captured,Not captured,Not captured,Not captured,Not captured,Not captured,Not captured,Kimberly Clark,,Not captured,Not captured,Not captured,Not captured,9255 west russel road,,Las Vegas,NV,89148,+1-4048387200,,Not captured,Not captured,jared@cjclarklawgroup.com,Not captured,802052061,,Not captured,Not captured,Not captured,Not captured,Not captured,Not captured,
Not captured,Not captured,01/21/2021,02/03/2021,Not captured,Not captured,863949,020,00072,ARS-02-0058136,Beacon America,Not captured,Not captured,Not captured,Passport(23408524),,,cohen,menachem mendel,,08/18/2004,male,Not captured,Not captured,Not captured,Not captured,Not captured,Not captured,Not captured,Not captured,Not captured,Not captured,Not captured,Not captured,Not captured,menachem mendel cohen,,Not captured,Not captured,Not captured,Not captured,hashoshanim 4,,kriyat malachi,israel,83033,+972-0545459451,+972-088650971,Not captured,Not captured,770esther@gmail.com,Not captured,802052058,,Not captured,Not captured,Not captured,Not captured,Not captured,Not captured,
Not captured,Not captured,01/22/2021,02/20/2021,Not captured,Not captured,863949,020,00072,ARS-02-0058135,Beacon America,Not captured,Not captured,Not captured,Passport(T4539849),,,Agnihotri,Rekha Mahesh,,01/12/1962,female,Not captured,Not captured,Not captured,Not captured,Not captured,Not captured,Not captured,Not captured,Not captured,Not captured,Not captured,Not captured,Not captured,Sujit Agnihotri,,Not captured,Not captured,Not captured,Not captured,34 A Shri Ram Building 5th Cross Sanmathinagar,,Dharwad,KA,580008,+1-2702931641,,Not captured,Not captured,sujitma1903@gmail.com,Not captured,802052057,,Not captured,Not captured,Not captured,Not captured,Not captured,Not captured,
Not captured,Not captured,01/26/2021,06/10/2021,Not captured,Not captured,863949,020,00072,ARS-01-0058133,Beacon International,Not captured,Not captured,Not captured,Passport(645483679),,,Gabrielli,Patrick Yamada,,07/31/1992,male,Not captured,Not captured,Not captured,Not captured,Not captured,Not captured,Not captured,Not captured,Not captured,Not captured,Not captured,Not captured,Not captured,Ellen Robley,,Not captured,Not captured,Not captured,Not captured,733 Cole st,,San Francisco,CA,94117,+44-07842929368,,Not captured,Not captured,gabrielli.patrick@gmail.com,Not captured,802052055,,Not captured,Not captured,Not captured,Not captured,Not captured,Not captured,
Not captured,Not captured,01/21/2021,02/20/2021,Not captured,Not captured,863949,020,00072,ARS-01-0058130,Beacon International,Not captured,Not captured,Not captured,Passport(FX403318),,,Paiva Silva,Carla Fernanda,,09/20/2000,female,Not captured,Not captured,Not captured,Not captured,Not captured,Not captured,Not captured,Not captured,Not captured,Not captured,Not captured,Not captured,Not captured,Anders Helms,,Not captured,Not captured,Not captured,Not captured,Bonsucesso Travessa Lineu Machado 289.,,Fortaleza,Ceara,60520514,+55-85981155795,,Not captured,Not captured,desrouleaux@live.dk,Not captured,802052052,,Not captured,Not captured,Not captured,Not captured,Not captured,Not captured,