EE Transaction Type,Dependent Transaction Type,Effective Date,Expiry Date,EE Signature,EE Signature Date,Control,Suffix,Account,Plan Number,Plan Name,Claim Office,Network ID Number,Customer Code,EE SSN,Dependent SSN,Dependent Relationship,Last Name,First Name,Middle Initial,DOB,Gender,Ethnicity,PCP/PCD,PCP/PCD Current Patient,Provider Cap Office Number,COB,Dep Student Indicator,Dep OOA Indicator,EE Prior Coverage Indicator,EE Late Entrant,EE Language Indicator,Hire Date,Earnings,Earnings Frequency,Beneficiary (Last Name First Name MI),Beneficiary Relationship,Continuation of Coverage Expiration Date,Continuation of Coverage Event Date,Continuation of Coverage Length of Coverage,Work Location Zip Code,Street Address Line 1,Street Address Line 2,City,State,Zip Code,Home Phone Number,Work Phone Number,Accept Code,Evidence Code,EE Email Address,Communication Disability Code,EE Alternate ID,Dep Alternate ID,Old Control,Old Suffix,Old Account,New Control,New Suffix,New Account,
Not captured,Not captured,01/16/2021,01/14/2022,Not captured,Not captured,863949,020,00072,ARS-03-0056429,Essential America,Not captured,Not captured,Not captured,SSN(244-43-8152),,,Burke,Robert,Garrett,06/29/1974,male,Not captured,Not captured,Not captured,Not captured,Not captured,Not captured,Not captured,Not captured,Not captured,Not captured,Not captured,Not captured,Not captured,,,Not captured,Not captured,Not captured,Not captured,Al Rahab 113.9.2,,Cairo,,11865,828-549-8538,,Not captured,Not captured,nogreaterjoythantohear@gmail.com,Not captured,802049165,,Not captured,Not captured,Not captured,Not captured,Not captured,Not captured,
Not captured,Not captured,01/16/2021,01/14/2022,Not captured,Not captured,863949,020,00072,ARS-03-0056429,Essential America,Not captured,Not captured,Not captured,,SSN(528-55-5873),Spouse,Burke,Stacy,May,11/13/1975,female,Not captured,Not captured,Not captured,Not captured,Not captured,Not captured,Not captured,Not captured,Not captured,Not captured,Not captured,Not captured,Not captured,,,Not captured,Not captured,Not captured,Not captured,Al Rahab 113.9.2,,Cairo,,11865,828-549-8538,,Not captured,Not captured,nogreaterjoythantohear@gmail.com,Not captured,,802052035,Not captured,Not captured,Not captured,Not captured,Not captured,Not captured,
Not captured,Not captured,01/16/2021,01/14/2022,Not captured,Not captured,863949,020,00072,ARS-03-0056429,Essential America,Not captured,Not captured,Not captured,,SSN(684-03-8213),Dependant,Burke,Paul,Garrett,09/28/2003,male,Not captured,Not captured,Not captured,Not captured,Not captured,Not captured,Not captured,Not captured,Not captured,Not captured,Not captured,Not captured,Not captured,,,Not captured,Not captured,Not captured,Not captured,Al Rahab 113.9.2,,Cairo,,11865,828-549-8538,,Not captured,Not captured,nogreaterjoythantohear@gmail.com,Not captured,,802052036,Not captured,Not captured,Not captured,Not captured,Not captured,Not captured,
Not captured,Not captured,01/16/2021,01/30/2021,Not captured,Not captured,863949,020,00072,ARS-01-0058086,Beacon International,Not captured,Not captured,Not captured,,,,Landau,Goldy,,12/09/1991,female,Not captured,Not captured,Not captured,Not captured,Not captured,Not captured,Not captured,Not captured,Not captured,Not captured,Not captured,Not captured,Not captured,,,Not captured,Not captured,Not captured,Not captured,2021 Ave O,,Brooklyn,New York,11210,,,Not captured,Not captured,rochellesheri@gmail.com,Not captured,802052006,,Not captured,Not captured,Not captured,Not captured,Not captured,Not captured,
Not captured,Not captured,01/16/2021,01/30/2021,Not captured,Not captured,863949,020,00072,ARS-01-0058085,Beacon International,Not captured,Not captured,Not captured,,,,Baraka,Rochelle,S,07/02/1997,female,Not captured,Not captured,Not captured,Not captured,Not captured,Not captured,Not captured,Not captured,Not captured,Not captured,Not captured,Not captured,Not captured,,,Not captured,Not captured,Not captured,Not captured,2021 Ave O,,Brooklyn,New York,11210,,,Not captured,Not captured,rochellesheri@gmail.com,Not captured,802052005,,Not captured,Not captured,Not captured,Not captured,Not captured,Not captured,
Not captured,Not captured,01/16/2021,07/14/2021,Not captured,Not captured,863949,020,00072,OVI-28-0058082,OverseasCare Visitors Insurance Plan,Not captured,Not captured,Not captured,Passport(K3163490),,,Naidu,Lakshmi,,12/07/1953,male,Not captured,Not captured,Not captured,Not captured,Not captured,Not captured,Not captured,Not captured,Not captured,Not captured,Not captured,Not captured,Not captured,Durga Naidu,Son,Not captured,Not captured,Not captured,Not captured,3375 Spring Hill Parkway SE,,Smyrna,Georgia,30080,3186078766,,Not captured,Not captured,nayudumanikanta@gmail.com,Not captured,802052002,,Not captured,Not captured,Not captured,Not captured,Not captured,Not captured,
Not captured,Not captured,01/16/2021,07/14/2021,Not captured,Not captured,863949,020,00072,OVI-28-0058081,OverseasCare Visitors Insurance Plan,Not captured,Not captured,Not captured,Passport(K3163490),,,Naidu,Satyanarayana,,10/20/1952,male,Not captured,Not captured,Not captured,Not captured,Not captured,Not captured,Not captured,Not captured,Not captured,Not captured,Not captured,Not captured,Not captured,Durga Naidu,Son,Not captured,Not captured,Not captured,Not captured,3375 Spring Hill Parkway SE,,Smyrna,Georgia,30080,3186078766,,Not captured,Not captured,nayudumanikanta@gmail.com,Not captured,802052001,,Not captured,Not captured,Not captured,Not captured,Not captured,Not captured,
Not captured,Not captured,01/16/2021,06/10/2021,Not captured,Not captured,863949,020,00072,ARS-02-0058080,Beacon America,Not captured,Not captured,Not captured,,,,MANJAIAH,SAVITHRAMMA,,03/18/1960,female,Not captured,Not captured,Not captured,Not captured,Not captured,Not captured,Not captured,Not captured,Not captured,Not captured,Not captured,Not captured,Not captured,AKSHITH VASANTH,Spouse,Not captured,Not captured,Not captured,Not captured,#29 VASU LAYOUT I BLOCK RAMAKRISHNA NAGAR,,MYSORE,KA,570022,+1-9167182966,,Not captured,Not captured,aksh.nie@gmail.com,Not captured,802052000,,Not captured,Not captured,Not captured,Not captured,Not captured,Not captured,
Not captured,Not captured,01/16/2021,06/10/2021,Not captured,Not captured,863949,020,00072,ARS-02-0058079,Beacon America,Not captured,Not captured,Not captured,Passport(R0319076),,,HOSAKOTE NINGA,VASANTHA,,01/04/1956,male,Not captured,Not captured,Not captured,Not captured,Not captured,Not captured,Not captured,Not captured,Not captured,Not captured,Not captured,Not captured,Not captured,AKSHITH VASANTH,,Not captured,Not captured,Not captured,Not captured,#29 VASU LAYOUT I BLOCK RAMAKRISHNA NAGAR,,MYSORE,KA,570022,+1-9167182966,,Not captured,Not captured,aksh.nie@gmail.com,Not captured,802051999,,Not captured,Not captured,Not captured,Not captured,Not captured,Not captured,
Not captured,Not captured,01/15/2021,01/19/2021,Not captured,Not captured,863949,020,00072,ARS-02-0058077,Beacon America,Not captured,Not captured,Not captured,,,,Goetgheluck,Edouard,,06/04/2012,male,Not captured,Not captured,Not captured,Not captured,Not captured,Not captured,Not captured,Not captured,Not captured,Not captured,Not captured,Not captured,Not captured,Marisela guedez,Dependent,Not captured,Not captured,Not captured,Not captured,Castello 30,,Madrid,Madrid,28001,+1-3056106011,,Not captured,Not captured,antoinegoet@gmail.com,Not captured,802051997,,Not captured,Not captured,Not captured,Not captured,Not captured,Not captured,
Not captured,Not captured,01/15/2021,01/19/2021,Not captured,Not captured,863949,020,00072,ARS-02-0058076,Beacon America,Not captured,Not captured,Not captured,,,,Guedez,Marisela,,08/23/1974,female,Not captured,Not captured,Not captured,Not captured,Not captured,Not captured,Not captured,Not captured,Not captured,Not captured,Not captured,Not captured,Not captured,Marisela guedez,Spouse,Not captured,Not captured,Not captured,Not captured,Castello 30,,Madrid,Madrid,28001,+1-3056106011,,Not captured,Not captured,antoinegoet@gmail.com,Not captured,802051996,,Not captured,Not captured,Not captured,Not captured,Not captured,Not captured,
Not captured,Not captured,01/15/2021,01/19/2021,Not captured,Not captured,863949,020,00072,ARS-02-0058075,Beacon America,Not captured,Not captured,Not captured,Passport(20edd11017),,,Goetgheluck,Antoine,,12/03/1971,male,Not captured,Not captured,Not captured,Not captured,Not captured,Not captured,Not captured,Not captured,Not captured,Not captured,Not captured,Not captured,Not captured,Marisela guedez,,Not captured,Not captured,Not captured,Not captured,Castello 30,,Madrid,Madrid,28001,+1-3056106011,,Not captured,Not captured,antoinegoet@gmail.com,Not captured,802051995,,Not captured,Not captured,Not captured,Not captured,Not captured,Not captured,
Not captured,Not captured,01/14/2021,07/01/2021,Not captured,Not captured,863949,020,00072,ARS-02-0058071,Beacon America,Not captured,Not captured,Not captured,,,,Bhatt,Yaksh,Michael,10/18/1993,male,Not captured,Not captured,Not captured,Not captured,Not captured,Not captured,Not captured,Not captured,Not captured,Not captured,Not captured,Not captured,Not captured,,,Not captured,Not captured,Not captured,Not captured,10992 Chandler Drive,,Cooper City,Florida,33026,954-673-3993,,Not captured,Not captured,yakshbhatt@hotmail.com,Not captured,802051991,,Not captured,Not captured,Not captured,Not captured,Not captured,Not captured,
Not captured,Not captured,01/16/2021,01/20/2021,Not captured,Not captured,863949,020,00072,ARS-01-0058070,Beacon International,Not captured,Not captured,Not captured,Passport(EN8903687),,,Wisniewski,Michal,,07/15/1985,male,Not captured,Not captured,Not captured,Not captured,Not captured,Not captured,Not captured,Not captured,Not captured,Not captured,Not captured,Not captured,Not captured,Ewa Wisniewska,,Not captured,Not captured,Not captured,Not captured,Zachodnia 3,,Zlotkowo,Wielkopolska,62002,+48-728811651,,Not captured,Not captured,michal.wisniewski@dimark.eu,Not captured,802051990,,Not captured,Not captured,Not captured,Not captured,Not captured,Not captured,
Not captured,Not captured,01/15/2021,01/28/2021,Not captured,Not captured,863949,020,00072,ARS-01-0058067,Beacon International,Not captured,Not captured,Not captured,Passport(H217982),,,Kouki,Khouloud abdelkhalek,,01/21/1994,female,Not captured,Not captured,Not captured,Not captured,Not captured,Not captured,Not captured,Not captured,Not captured,Not captured,Not captured,Not captured,Not captured,Eyad Hamdallah,,Not captured,Not captured,Not captured,Not captured,Hamam sousse,,Sousse,Sousse,4000,+216-21311133,+216-21311133,Not captured,Not captured,kouki.khouloud311@gmail.com,Not captured,802051987,,Not captured,Not captured,Not captured,Not captured,Not captured,Not captured,
Not captured,Not captured,01/16/2021,01/27/2021,Not captured,Not captured,863949,020,00072,ARS-01-0058066,Beacon International,Not captured,Not captured,Not captured,Passport(658379278),,,Hamdallah,Eyad mohammed,,08/21/1997,male,Not captured,Not captured,Not captured,Not captured,Not captured,Not captured,Not captured,Not captured,Not captured,Not captured,Not captured,Not captured,Not captured,Micheal,,Not captured,Not captured,Not captured,Not captured,665 saint Francis blvd,,Dely city,CA,94015,+1-4154305392,+1-4154305392,Not captured,Not captured,eddyhamdall415@gmail.com,Not captured,802051986,,Not captured,Not captured,Not captured,Not captured,Not captured,Not captured,
Not captured,Not captured,01/14/2021,01/25/2021,Not captured,Not captured,863949,020,00072,ARS-01-0058065,Beacon International,Not captured,Not captured,Not captured,Passport(H217982),,,Kouki,Khouloud abdelkhalek,,01/21/1994,female,Not captured,Not captured,Not captured,Not captured,Not captured,Not captured,Not captured,Not captured,Not captured,Not captured,Not captured,Not captured,Not captured,Khouloud,,Not captured,Not captured,Not captured,Not captured,Hamam sousse,,Sousse,Sousse,4000,+216-21311133,+216-21311133,Not captured,Not captured,kouki.khouloud311@gmail.com,Not captured,802051985,,Not captured,Not captured,Not captured,Not captured,Not captured,Not captured,
Not captured,Not captured,01/14/2021,03/31/2021,Not captured,Not captured,863949,020,00072,ARS-02-0058064,Beacon America,Not captured,Not captured,Not captured,Passport(LV4270719),,,Pancenko,Olga,,05/18/1985,female,Not captured,Not captured,Not captured,Not captured,Not captured,Not captured,Not captured,Not captured,Not captured,Not captured,Not captured,Not captured,Not captured,Olga Pancenko,,Not captured,Not captured,Not captured,Not captured,Olga Pancenko B. Anninmuizas 43,,Riga,Latvia,LV-1067,+1-4243626340,+1-4243626340,Not captured,Not captured,pancenkoo@gmail.com,Not captured,802051984,,Not captured,Not captured,Not captured,Not captured,Not captured,Not captured,
Not captured,Not captured,01/14/2021,01/18/2021,Not captured,Not captured,863949,020,00072,ARS-02-0058063,Beacon America,Not captured,Not captured,Not captured,Passport(U0256098),,,Iyer,Purnima,,06/06/1982,female,Not captured,Not captured,Not captured,Not captured,Not captured,Not captured,Not captured,Not captured,Not captured,Not captured,Not captured,Not captured,Not captured,Carleton Naylor Cole,,Not captured,Not captured,Not captured,Not captured,338/247 Lad Phrao 87 Mu Ban Suk Sabai Villa Soi 4,,Bangkok,Bangkok,10310,+1-7026259163,+66-951763141,Not captured,Not captured,purnimaiyer@gmail.com,Not captured,802051983,,Not captured,Not captured,Not captured,Not captured,Not captured,Not captured,
Not captured,Not captured,01/16/2021,02/20/2021,Not captured,Not captured,863949,020,00072,ARS-02-0058062,Beacon America,Not captured,Not captured,Not captured,Passport(Z3696461),,,Chodisetti,Sri Jyothsna,,02/18/1996,female,Not captured,Not captured,Not captured,Not captured,Not captured,Not captured,Not captured,Not captured,Not captured,Not captured,Not captured,Not captured,Not captured,Prithvi Raju Kanumuri,,Not captured,Not captured,Not captured,Not captured,303 cook road North York,,Toronto,ON,M3J 3T2,+1-6477871802,,Not captured,Not captured,chsrijyothsna@gmail.com,Not captured,802051982,,Not captured,Not captured,Not captured,Not captured,Not captured,Not captured,
Not captured,Not captured,01/13/2021,01/18/2021,Not captured,Not captured,863949,020,00072,ARS-01-0058061,Beacon International,Not captured,Not captured,Not captured,,,,Leibovitz,Israel,,11/08/1988,male,Not captured,Not captured,Not captured,Not captured,Not captured,Not captured,Not captured,Not captured,Not captured,Not captured,Not captured,Not captured,Not captured,,,Not captured,Not captured,Not captured,Not captured,1433 42nd st,,Brooklyn,New York,11219,,,Not captured,Not captured,srulikny@gmail.com,Not captured,802051981,,Not captured,Not captured,Not captured,Not captured,Not captured,Not captured,
Not captured,Not captured,01/14/2021,02/28/2021,Not captured,Not captured,863949,020,00072,ARS-02-0058059,Beacon America,Not captured,Not captured,Not captured,,,,Chincholi Lakshmanarao,Nalina,,11/29/1960,female,Not captured,Not captured,Not captured,Not captured,Not captured,Not captured,Not captured,Not captured,Not captured,Not captured,Not captured,Not captured,Not captured,Sushma Hosakote Mohan Kumar,Spouse,Not captured,Not captured,Not captured,Not captured,No 81 11th Cross Nagarabhavi 2nd stage,,Bangalore,KA,560072,+1-4083063180,+1-6692349508,Not captured,Not captured,prashanth.beerur@gmail.com,Not captured,802051979,,Not captured,Not captured,Not captured,Not captured,Not captured,Not captured,
Not captured,Not captured,01/14/2021,02/28/2021,Not captured,Not captured,863949,020,00072,ARS-02-0058058,Beacon America,Not captured,Not captured,Not captured,Passport(K2779001),,,Hosakote Purohit,Mohan kumar,,06/23/1956,male,Not captured,Not captured,Not captured,Not captured,Not captured,Not captured,Not captured,Not captured,Not captured,Not captured,Not captured,Not captured,Not captured,Sushma Hosakote Mohan Kumar,,Not captured,Not captured,Not captured,Not captured,No 81 11th Cross Nagarabhavi 2nd stage,,Bangalore,KA,560072,+1-4083063180,+1-6692349508,Not captured,Not captured,prashanth.beerur@gmail.com,Not captured,802051978,,Not captured,Not captured,Not captured,Not captured,Not captured,Not captured,
Not captured,Not captured,01/13/2021,01/22/2021,Not captured,Not captured,863949,020,00072,ARS-01-0058057,Beacon International,Not captured,Not captured,Not captured,,,,Rebel,Johan,,11/14/1959,male,Not captured,Not captured,Not captured,Not captured,Not captured,Not captured,Not captured,Not captured,Not captured,Not captured,Not captured,Not captured,Not captured,,,Not captured,Not captured,Not captured,Not captured,Krokvägen 52,,Drottningskar,,37364,,,Not captured,Not captured,johanrebel@gmail.com,Not captured,802051977,,Not captured,Not captured,Not captured,Not captured,Not captured,Not captured,
Not captured,Not captured,01/13/2021,04/09/2021,Not captured,Not captured,863949,020,00072,ARS-02-0058056,Beacon America,Not captured,Not captured,Not captured,Passport(G54140250),,,Yuwen,Liping,,08/24/1964,female,Not captured,Not captured,Not captured,Not captured,Not captured,Not captured,Not captured,Not captured,Not captured,Not captured,Not captured,Not captured,Not captured,Yuqing,,Not captured,Not captured,Not captured,Not captured,xinhejie#1,,Taiyuan,Shanxi,030002,+1-2136286148,,Not captured,Not captured,maryz6174@gmail.com,Not captured,802051976,,Not captured,Not captured,Not captured,Not captured,Not captured,Not captured,
Not captured,Not captured,01/16/2021,01/24/2021,Not captured,Not captured,863949,020,00072,ARS-01-0058054,Beacon International,Not captured,Not captured,Not captured,Passport(656046837),,,Zhugralin,Adil,,12/20/1981,male,Not captured,Not captured,Not captured,Not captured,Not captured,Not captured,Not captured,Not captured,Not captured,Not captured,Not captured,Not captured,Not captured,Marzhan,,Not captured,Not captured,Not captured,Not captured,11 Eliot Street,,Boston,MA,02130,+1-6176996113,+1-6176996113,Not captured,Not captured,azm411@gmail.com,Not captured,802051974,,Not captured,Not captured,Not captured,Not captured,Not captured,Not captured,
Not captured,Not captured,01/11/2021,01/09/2022,Not captured,Not captured,863949,020,00072,ARS-03-0057916,Essential America,Not captured,Not captured,Not captured,Passport(567801224),,,Smith,Ronald,James,03/05/1976,male,Not captured,Not captured,Not captured,Not captured,Not captured,Not captured,Not captured,Not captured,Not captured,Not captured,Not captured,Not captured,Not captured,,,Not captured,Not captured,Not captured,Not captured,737 Old Hollow Rd,,Winston Salem,North Carolina,27105,3364629204,,Not captured,Not captured,suathach@gmail.com,Not captured,802051730,,Not captured,Not captured,Not captured,Not captured,Not captured,Not captured,
Not captured,Not captured,01/11/2021,01/09/2022,Not captured,Not captured,863949,020,00072,ARS-03-0057916,Essential America,Not captured,Not captured,Not captured,,Passport(480083564),Spouse,Smith,Sua,Thach,05/10/1982,female,Not captured,Not captured,Not captured,Not captured,Not captured,Not captured,Not captured,Not captured,Not captured,Not captured,Not captured,Not captured,Not captured,,,Not captured,Not captured,Not captured,Not captured,737 Old Hollow Rd,,Winston Salem,North Carolina,27105,3364629204,,Not captured,Not captured,suathach@gmail.com,Not captured,,802051965,Not captured,Not captured,Not captured,Not captured,Not captured,Not captured,
Not captured,Not captured,01/11/2021,01/09/2022,Not captured,Not captured,863949,020,00072,ARS-03-0057916,Essential America,Not captured,Not captured,Not captured,,Passport(567803538),Dependant,Smith,Jasmine,Thach,03/02/2004,female,Not captured,Not captured,Not captured,Not captured,Not captured,Not captured,Not captured,Not captured,Not captured,Not captured,Not captured,Not captured,Not captured,,,Not captured,Not captured,Not captured,Not captured,737 Old Hollow Rd,,Winston Salem,North Carolina,27105,3364629204,,Not captured,Not captured,suathach@gmail.com,Not captured,,802051966,Not captured,Not captured,Not captured,Not captured,Not captured,Not captured,
Not captured,Not captured,01/11/2021,01/09/2022,Not captured,Not captured,863949,020,00072,ARS-03-0057916,Essential America,Not captured,Not captured,Not captured,,Passport(579049008),Dependant,Smith,Jessica,Thach,04/03/2012,female,Not captured,Not captured,Not captured,Not captured,Not captured,Not captured,Not captured,Not captured,Not captured,Not captured,Not captured,Not captured,Not captured,,,Not captured,Not captured,Not captured,Not captured,737 Old Hollow Rd,,Winston Salem,North Carolina,27105,3364629204,,Not captured,Not captured,suathach@gmail.com,Not captured,,802051968,Not captured,Not captured,Not captured,Not captured,Not captured,Not captured,
Not captured,Not captured,01/11/2021,01/09/2022,Not captured,Not captured,863949,020,00072,ARS-03-0057916,Essential America,Not captured,Not captured,Not captured,,Passport(567813190),Dependant,Smith,Joanna,Thach,01/22/2020,female,Not captured,Not captured,Not captured,Not captured,Not captured,Not captured,Not captured,Not captured,Not captured,Not captured,Not captured,Not captured,Not captured,,,Not captured,Not captured,Not captured,Not captured,737 Old Hollow Rd,,Winston Salem,North Carolina,27105,3364629204,,Not captured,Not captured,suathach@gmail.com,Not captured,,802051969,Not captured,Not captured,Not captured,Not captured,Not captured,Not captured,
Not captured,Not captured,01/12/2021,01/10/2022,Not captured,Not captured,863949,020,00072,ARS-03-0057969,Essential America,Not captured,Not captured,Not captured,SSN(352825653),,,Phillips,Jena,,03/08/1985,female,Not captured,Not captured,Not captured,Not captured,Not captured,Not captured,Not captured,Not captured,Not captured,Not captured,Not captured,Not captured,Not captured,,,Not captured,Not captured,Not captured,Not captured,Flat 21 Building 242,,Hidd,,112,+97336760819,,Not captured,Not captured,jnhlms@gmail.com,Not captured,802051784,,Not captured,Not captured,Not captured,Not captured,Not captured,Not captured,
Not captured,Not captured,01/12/2021,01/31/2021,Not captured,Not captured,863949,020,00072,ARS-02-0058051,Beacon America,Not captured,Not captured,Not captured,,,,Shahab,FNU,,08/25/1975,male,Not captured,Not captured,Not captured,Not captured,Not captured,Not captured,Not captured,Not captured,Not captured,Not captured,Not captured,Not captured,Not captured,Ram Madiraju,Spouse,Not captured,Not captured,Not captured,Not captured,11-3-848 Flat Number 303 Shaheen Heights,,Hyderabad,TG,500001,+1-7324192539,+1-8608053255,Not captured,Not captured,samia@techprojects.us,Not captured,802051964,,Not captured,Not captured,Not captured,Not captured,Not captured,Not captured,
Not captured,Not captured,01/12/2021,01/31/2021,Not captured,Not captured,863949,020,00072,ARS-02-0058050,Beacon America,Not captured,Not captured,Not captured,Passport(S9685952),,,Farheen,FNU,,07/02/1982,female,Not captured,Not captured,Not captured,Not captured,Not captured,Not captured,Not captured,Not captured,Not captured,Not captured,Not captured,Not captured,Not captured,Ram Madiraju,,Not captured,Not captured,Not captured,Not captured,11-3-848 Flat Number 303 Shaheen Heights,,Hyderabad,TG,500001,+1-7324192539,+1-8608053255,Not captured,Not captured,samia@techprojects.us,Not captured,802051963,,Not captured,Not captured,Not captured,Not captured,Not captured,Not captured,