EE Transaction Type,Dependent Transaction Type,Effective Date,Expiry Date,EE Signature,EE Signature Date,Control,Suffix,Account,Plan Number,Plan Name,Claim Office,Network ID Number,Customer Code,EE SSN,Dependent SSN,Dependent Relationship,Last Name,First Name,Middle Initial,DOB,Gender,Ethnicity,PCP/PCD,PCP/PCD Current Patient,Provider Cap Office Number,COB,Dep Student Indicator,Dep OOA Indicator,EE Prior Coverage Indicator,EE Late Entrant,EE Language Indicator,Hire Date,Earnings,Earnings Frequency,Beneficiary (Last Name First Name MI),Beneficiary Relationship,Continuation of Coverage Expiration Date,Continuation of Coverage Event Date,Continuation of Coverage Length of Coverage,Work Location Zip Code,Street Address Line 1,Street Address Line 2,City,State,Zip Code,Home Phone Number,Work Phone Number,Accept Code,Evidence Code,EE Email Address,Communication Disability Code,EE Alternate ID,Dep Alternate ID,Old Control,Old Suffix,Old Account,New Control,New Suffix,New Account,
Not captured,Not captured,01/09/2021,01/31/2021,Not captured,Not captured,863949,020,00072,ARS-02-0058031,Beacon America,Not captured,Not captured,Not captured,Passport(EA0115215),,,Nesa,Sirazone,,05/10/1945,female,Not captured,Not captured,Not captured,Not captured,Not captured,Not captured,Not captured,Not captured,Not captured,Not captured,Not captured,Not captured,Not captured,Sabara Rahman,,Not captured,Not captured,Not captured,Not captured,Section12 Block-E Road-7 House-19,,Pallabi,Mirpur,1216,+1-7035892466,,Not captured,Not captured,sabara.rahman1@gmail.com,Not captured,802051944,,Not captured,Not captured,Not captured,Not captured,Not captured,Not captured,
Not captured,Not captured,01/09/2021,01/30/2021,Not captured,Not captured,863949,020,00072,ARS-01-0058030,Beacon International,Not captured,Not captured,Not captured,,,,Abailat,Hamza,,06/25/1989,male,Not captured,Not captured,Not captured,Not captured,Not captured,Not captured,Not captured,Not captured,Not captured,Not captured,Not captured,Not captured,Not captured,,,Not captured,Not captured,Not captured,Not captured,2321 Hinsdale dr,,Kissimmee,Florida,34741,,,Not captured,Not captured,Jellian_aponte1994@hotmail.com,Not captured,802051943,,Not captured,Not captured,Not captured,Not captured,Not captured,Not captured,
Not captured,Not captured,01/09/2021,01/30/2021,Not captured,Not captured,863949,020,00072,ARS-01-0058029,Beacon International,Not captured,Not captured,Not captured,,,,Aponte,Jellian,,12/05/1994,female,Not captured,Not captured,Not captured,Not captured,Not captured,Not captured,Not captured,Not captured,Not captured,Not captured,Not captured,Not captured,Not captured,,,Not captured,Not captured,Not captured,Not captured,2321 Hinsdale dr,,Kissimmee,Florida,34741,,,Not captured,Not captured,Jellian_aponte1994@hotmail.com,Not captured,802051942,,Not captured,Not captured,Not captured,Not captured,Not captured,Not captured,
Not captured,Not captured,01/09/2021,01/15/2021,Not captured,Not captured,863949,020,00072,ARS-01-0058026,Beacon International,Not captured,Not captured,Not captured,Passport(594051934),,,Niesen,Bernard,,05/07/1962,male,Not captured,Not captured,Not captured,Not captured,Not captured,Not captured,Not captured,Not captured,Not captured,Not captured,Not captured,Not captured,Not captured,Bernabe Tima,,Not captured,Not captured,Not captured,Not captured,8503 W Ave A8,,Lancaster,CA,93536,+1-3237742003,+1-3237742003,Not captured,Not captured,fromk3@gmail.com,Not captured,802051939,,Not captured,Not captured,Not captured,Not captured,Not captured,Not captured,
Not captured,Not captured,01/08/2021,01/13/2021,Not captured,Not captured,863949,020,00072,ARS-02-0058019,Beacon America,Not captured,Not captured,Not captured,,,,Fooks,Albina,,11/27/1984,female,Not captured,Not captured,Not captured,Not captured,Not captured,Not captured,Not captured,Not captured,Not captured,Not captured,Not captured,Not captured,Not captured,,,Not captured,Not captured,Not captured,Not captured,2540 Batcheld,,Brooklyn,,11235,646-812-7327,,Not captured,Not captured,gregorfoux@gmail.com,Not captured,802051930,,Not captured,Not captured,Not captured,Not captured,Not captured,Not captured,
Not captured,Not captured,01/08/2021,03/27/2021,Not captured,Not captured,863949,020,00072,ARS-01-0058018,Beacon International,Not captured,Not captured,Not captured,,,,Valencia Cerna,Rocio Marilu,A,07/04/1976,female,Not captured,Not captured,Not captured,Not captured,Not captured,Not captured,Not captured,Not captured,Not captured,Not captured,Not captured,Not captured,Not captured,,,Not captured,Not captured,Not captured,Not captured,Faustino Sarmiento 790 Urb. Las Quintanas,,Trujillo,,13001,,,Not captured,Not captured,rociovalcer@gmail.com,Not captured,802051914,,Not captured,Not captured,Not captured,Not captured,Not captured,Not captured,
Not captured,Not captured,01/08/2021,01/21/2021,Not captured,Not captured,863949,020,00072,ARS-01-0058017,Beacon International,Not captured,Not captured,Not captured,Passport(567320771),,,Diaz,Julian David,,12/30/2001,male,Not captured,Not captured,Not captured,Not captured,Not captured,Not captured,Not captured,Not captured,Not captured,Not captured,Not captured,Not captured,Not captured,Roxane Gallant,,Not captured,Not captured,Not captured,Not captured,19 Lyman St.,,Lynn,MA,01902,+1-9786488313,,Not captured,Not captured,jddiaz1230@gmail.com,Not captured,802051913,,Not captured,Not captured,Not captured,Not captured,Not captured,Not captured,
Not captured,Not captured,01/07/2021,03/04/2021,Not captured,Not captured,863949,020,00072,ARS-02-0058014,Beacon America,Not captured,Not captured,Not captured,Passport(L5141294),,,Saxena,Asha,,02/04/1957,female,Not captured,Not captured,Not captured,Not captured,Not captured,Not captured,Not captured,Not captured,Not captured,Not captured,Not captured,Not captured,Not captured,Tanya Saxena Shukla,,Not captured,Not captured,Not captured,Not captured,15 Shikshak Colony Naka Number 3,,Rajgarh Biaora,MP,465661,+1-9857143059,+1-8326530439,Not captured,Not captured,crusheyesabhi@gmail.com,Not captured,802051859,,Not captured,Not captured,Not captured,Not captured,Not captured,Not captured,
Not captured,Not captured,01/07/2021,02/07/2021,Not captured,Not captured,863949,020,00072,ARS-02-0058007,Beacon America,Not captured,Not captured,Not captured,Passport(L3180667),,,Mohammed,Salman,,04/14/1992,male,Not captured,Not captured,Not captured,Not captured,Not captured,Not captured,Not captured,Not captured,Not captured,Not captured,Not captured,Not captured,Not captured,Aneesa Banu,,Not captured,Not captured,Not captured,Not captured,19-4-279/a/86,,Hyderabad,TG,500053,+1-8455810178,,Not captured,Not captured,glamonzcom@gmail.com,Not captured,802051842,,Not captured,Not captured,Not captured,Not captured,Not captured,Not captured,
Not captured,Not captured,01/06/2021,01/11/2021,Not captured,Not captured,863949,020,00072,ARS-01-0058005,Beacon International,Not captured,Not captured,Not captured,,,,Gurkov,Menucha,,10/15/1998,female,Not captured,Not captured,Not captured,Not captured,Not captured,Not captured,Not captured,Not captured,Not captured,Not captured,Not captured,Not captured,Not captured,,,Not captured,Not captured,Not captured,Not captured,1469 President St,,Brooklyn,New York,11213,,,Not captured,Not captured,Menucha122@gmail.com,Not captured,802051840,,Not captured,Not captured,Not captured,Not captured,Not captured,Not captured,
Not captured,Not captured,01/06/2021,04/16/2021,Not captured,Not captured,863949,020,00072,ARS-01-0058004,Beacon International,Not captured,Not captured,Not captured,,,,Reynolds,Charlotte,,09/15/1999,female,Not captured,Not captured,Not captured,Not captured,Not captured,Not captured,Not captured,Not captured,Not captured,Not captured,Not captured,Not captured,Not captured,,,Not captured,Not captured,Not captured,Not captured,70 High St,,Southampton,Massachusetts,01073,,,Not captured,Not captured,charlottenreynolds@gmail.com,Not captured,802051839,,Not captured,Not captured,Not captured,Not captured,Not captured,Not captured,
Not captured,Not captured,01/06/2021,01/16/2021,Not captured,Not captured,863949,020,00072,ARS-01-0058003,Beacon International,Not captured,Not captured,Not captured,Passport(Nld9210099),,,Ibrahim,Saeed,,10/09/1992,male,Not captured,Not captured,Not captured,Not captured,Not captured,Not captured,Not captured,Not captured,Not captured,Not captured,Not captured,Not captured,Not captured,Gada,,Not captured,Not captured,Not captured,Not captured,Breedweerlaan 124,,Heemskerk,Noord holland,1963bp,+31-640073164,+31-640073164,Not captured,Not captured,saeedq994@gmail.com,Not captured,802051838,,Not captured,Not captured,Not captured,Not captured,Not captured,Not captured,
Not captured,Not captured,01/06/2021,01/16/2021,Not captured,Not captured,863949,020,00072,ARS-01-0058002,Beacon International,Not captured,Not captured,Not captured,Passport(NT2HH83P4),,,Sbinati,Hamza,,04/12/2001,male,Not captured,Not captured,Not captured,Not captured,Not captured,Not captured,Not captured,Not captured,Not captured,Not captured,Not captured,Not captured,Not captured,Nariman,,Not captured,Not captured,Not captured,Not captured,Van Lennepstraat 24,,Heemskerk,Noord holland,1962sc,+31-624598511,,Not captured,Not captured,hamza.sbinati@gmail.com,Not captured,802051837,,Not captured,Not captured,Not captured,Not captured,Not captured,Not captured,
Not captured,Not captured,01/06/2021,01/16/2021,Not captured,Not captured,863949,020,00072,ARS-01-0058001,Beacon International,Not captured,Not captured,Not captured,Passport(NTRP21B20),,,Hallak,Wael,,01/18/1992,male,Not captured,Not captured,Not captured,Not captured,Not captured,Not captured,Not captured,Not captured,Not captured,Not captured,Not captured,Not captured,Not captured,Nahla,,Not captured,Not captured,Not captured,Not captured,Struszerstraat 139,,Heemskerk,Noord-Holland,1962er,+31-631916965,,Not captured,Not captured,w.hallak27@gmail.com,Not captured,802051836,,Not captured,Not captured,Not captured,Not captured,Not captured,Not captured,
Not captured,Not captured,01/06/2021,01/11/2021,Not captured,Not captured,863949,020,00072,ARS-01-0058000,Beacon International,Not captured,Not captured,Not captured,Passport(Nto8rlk64),,,Pashtoun,Ahmad sameer,,04/03/2005,male,Not captured,Not captured,Not captured,Not captured,Not captured,Not captured,Not captured,Not captured,Not captured,Not captured,Not captured,Not captured,Not captured,Aziz,,Not captured,Not captured,Not captured,Not captured,Adriaanbanckertstraat 114,,Zwijndrecht,Zuid Holland,3333TB,+31-685521913,,Not captured,Not captured,sameer0088@outlook.com,Not captured,802051835,,Not captured,Not captured,Not captured,Not captured,Not captured,Not captured,
Not captured,Not captured,01/07/2021,01/31/2021,Not captured,Not captured,863949,020,00072,ARS-01-0057999,Beacon International,Not captured,Not captured,Not captured,Passport(N4874449),,,Sahoo,Ramchandra,,01/06/1990,male,Not captured,Not captured,Not captured,Not captured,Not captured,Not captured,Not captured,Not captured,Not captured,Not captured,Not captured,Not captured,Not captured,Proloy Taran,,Not captured,Not captured,Not captured,Not captured,Bilamria,,Kolkata,WB,721428,+91-7044023619,+1-2402529683,Not captured,Not captured,ram611990@gmail.com,Not captured,802051834,,Not captured,Not captured,Not captured,Not captured,Not captured,Not captured,
Not captured,Not captured,01/05/2021,04/05/2021,Not captured,Not captured,863949,020,00072,ARS-02-0057998,Beacon America,Not captured,Not captured,Not captured,Passport(PP0053756),,,Terry,Alvin F,,06/09/1990,male,Not captured,Not captured,Not captured,Not captured,Not captured,Not captured,Not captured,Not captured,Not captured,Not captured,Not captured,Not captured,Not captured,ERIC,,Not captured,Not captured,Not captured,Not captured,Bushrod Island,,Monrovia,Montesrrado,1000,+231-775521478,+1-9108821423,Not captured,Not captured,eotwum@gmail.com,Not captured,802051833,,Not captured,Not captured,Not captured,Not captured,Not captured,Not captured,
Not captured,Not captured,01/07/2021,01/11/2021,Not captured,Not captured,863949,020,00072,ARS-01-0057997,Beacon International,Not captured,Not captured,Not captured,Passport(593957436),,,Nguyen,Lily Bich,,07/14/2000,female,Not captured,Not captured,Not captured,Not captured,Not captured,Not captured,Not captured,Not captured,Not captured,Not captured,Not captured,Not captured,Not captured,Julia Trahan,,Not captured,Not captured,Not captured,Not captured,40295 hwy 32,,Buras,LA,70041,+1-5044074502,,Not captured,Not captured,lilybnguyen@aol.com,Not captured,802051832,,Not captured,Not captured,Not captured,Not captured,Not captured,Not captured,
Not captured,Not captured,01/06/2021,06/10/2021,Not captured,Not captured,863949,020,00072,ARS-02-0057996,Beacon America,Not captured,Not captured,Not captured,Passport(N7198062),,,Chaladi,VenkataRamana,,01/01/1966,female,Not captured,Not captured,Not captured,Not captured,Not captured,Not captured,Not captured,Not captured,Not captured,Not captured,Not captured,Not captured,Not captured,Anusha Chaladi,,Not captured,Not captured,Not captured,Not captured,D No 18-414-6 BapuNagar,,Nuzvid,AP,521201,+1-6207197214,+1-6207049677,Not captured,Not captured,anushajay2013@gmail.com,Not captured,802051831,,Not captured,Not captured,Not captured,Not captured,Not captured,Not captured,
Not captured,Not captured,01/05/2021,03/15/2021,Not captured,Not captured,863949,020,00072,ARS-01-0057994,Beacon International,Not captured,Not captured,Not captured,,,,Kane,Noah,T,03/10/1999,male,Not captured,Not captured,Not captured,Not captured,Not captured,Not captured,Not captured,Not captured,Not captured,Not captured,Not captured,Not captured,Not captured,,,Not captured,Not captured,Not captured,Not captured,4 stoney hill road,,bondville,Vermont,05340,,,Not captured,Not captured,noahkane3@gmail.com,Not captured,802051824,,Not captured,Not captured,Not captured,Not captured,Not captured,Not captured,
Not captured,Not captured,01/05/2021,01/21/2021,Not captured,Not captured,863949,020,00072,ARS-01-0057991,Beacon International,Not captured,Not captured,Not captured,,,,Emajuwa,Oghenevwogaga,,02/26/1993,female,Not captured,Not captured,Not captured,Not captured,Not captured,Not captured,Not captured,Not captured,Not captured,Not captured,Not captured,Not captured,Not captured,Frank Onwuegbuzie,Spouse,Not captured,Not captured,Not captured,Not captured,11453 Ellerslie road SW,,Edmonton,AB,T6W 1T3,+1-5879741761,+1-5875680213,Not captured,Not captured,chukwuma.onwuegbuzie@yahoo.com,Not captured,802051821,,Not captured,Not captured,Not captured,Not captured,Not captured,Not captured,
Not captured,Not captured,01/05/2021,01/21/2021,Not captured,Not captured,863949,020,00072,ARS-01-0057990,Beacon International,Not captured,Not captured,Not captured,Passport(A07346176),,,Onwuegbuzie,Chukwuma,,11/25/1987,male,Not captured,Not captured,Not captured,Not captured,Not captured,Not captured,Not captured,Not captured,Not captured,Not captured,Not captured,Not captured,Not captured,Frank Onwuegbuzie,,Not captured,Not captured,Not captured,Not captured,11453 Ellerslie road SW,,Edmonton,AB,T6W 1T3,+1-5879741761,+1-5875680213,Not captured,Not captured,chukwuma.onwuegbuzie@yahoo.com,Not captured,802051820,,Not captured,Not captured,Not captured,Not captured,Not captured,Not captured,
Not captured,Not captured,01/05/2021,06/04/2021,Not captured,Not captured,863949,020,00072,ARS-02-0057987,Beacon America,Not captured,Not captured,Not captured,Passport(FY258483),,,Pereira,Romulo Iglesias,,10/03/1983,male,Not captured,Not captured,Not captured,Not captured,Not captured,Not captured,Not captured,Not captured,Not captured,Not captured,Not captured,Not captured,Not captured,Royce Tiffany Alioto,,Not captured,Not captured,Not captured,Not captured,Av das Americas 17100,,Rio de Janeiro,Rio de Janeiro,22790-704,+1-4156085935,,Not captured,Not captured,romulorip@gmail.com,Not captured,802051817,,Not captured,Not captured,Not captured,Not captured,Not captured,Not captured,
Not captured,Not captured,01/05/2021,01/31/2021,Not captured,Not captured,863949,020,00072,ARS-01-0057986,Beacon International,Not captured,Not captured,Not captured,Passport(530318507),,,zeis,tony,,11/16/1964,male,Not captured,Not captured,Not captured,Not captured,Not captured,Not captured,Not captured,Not captured,Not captured,Not captured,Not captured,Not captured,Not captured,Kyle SprogoeZeis,son,Not captured,Not captured,Not captured,Not captured,68 w pines drive,,montgomery,Texas,77356,3145178200,,Not captured,Not captured,flippy98@sbcglobal.net,Not captured,802051803,,Not captured,Not captured,Not captured,Not captured,Not captured,Not captured,
Not captured,Not captured,01/05/2021,01/24/2021,Not captured,Not captured,863949,020,00072,ARS-01-0057985,Beacon International,Not captured,Not captured,Not captured,Passport(513905874),,,SprogoeZeis,sonja,,07/20/1964,female,Not captured,Not captured,Not captured,Not captured,Not captured,Not captured,Not captured,Not captured,Not captured,Not captured,Not captured,Not captured,Not captured,Kyle SprogoeZeis,son,Not captured,Not captured,Not captured,Not captured,68 w pines drive,,montgomery,Texas,77356,3143241534,,Not captured,Not captured,flippy98@sbcglobal.net,Not captured,802051802,,Not captured,Not captured,Not captured,Not captured,Not captured,Not captured,
Not captured,Not captured,01/04/2021,04/13/2021,Not captured,Not captured,863949,020,00072,ARS-02-0057984,Beacon America,Not captured,Not captured,Not captured,Passport(AK336197),,,Bastow,Amy Pauline,,08/01/1983,female,Not captured,Not captured,Not captured,Not captured,Not captured,Not captured,Not captured,Not captured,Not captured,Not captured,Not captured,Not captured,Not captured,John Hamer,,Not captured,Not captured,Not captured,Not captured,1860 Nelson St,,Vancouver,BC,V6G1N1,+1-778-998-9226,,Not captured,Not captured,apbastow@gmail.com,Not captured,802051800,,Not captured,Not captured,Not captured,Not captured,Not captured,Not captured,
Not captured,Not captured,01/04/2021,01/02/2022,Not captured,Not captured,863949,020,00072,ARS-03-0057929,Essential International,Not captured,Not captured,Not captured,Passport(512260463),,,Reed,Matthew,R,08/07/1974,male,Not captured,Not captured,Not captured,Not captured,Not captured,Not captured,Not captured,Not captured,Not captured,Not captured,Not captured,Not captured,Not captured,,,Not captured,Not captured,Not captured,Not captured,Camino al Ahuehuete 122,,Tenancingo,Mexico,52420,7224004685,,Not captured,Not captured,mateoreed@gmail.com,Not captured,802051744,,Not captured,Not captured,Not captured,Not captured,Not captured,Not captured,
Not captured,Not captured,01/01/2021,12/30/2021,Not captured,Not captured,863949,020,00072,ARS-03-0057792,Essential America,Not captured,Not captured,Not captured,SSN(460617725),,,Haynes,Matthew,,08/22/1980,male,Not captured,Not captured,Not captured,Not captured,Not captured,Not captured,Not captured,Not captured,Not captured,Not captured,Not captured,Not captured,Not captured,,,Not captured,Not captured,Not captured,Not captured,2800 N Divis,,Bethany,Oklahoma,73008,4054686500,,Not captured,Not captured,mattaprylhaynes@protonmail.com,Not captured,802051477,,Not captured,Not captured,Not captured,Not captured,Not captured,Not captured,
Not captured,Not captured,01/01/2021,12/30/2021,Not captured,Not captured,863949,020,00072,ARS-03-0057792,Essential America,Not captured,Not captured,Not captured,,SSN(632038138),Spouse,Haynes,Apryl,,03/22/1983,female,Not captured,Not captured,Not captured,Not captured,Not captured,Not captured,Not captured,Not captured,Not captured,Not captured,Not captured,Not captured,Not captured,,,Not captured,Not captured,Not captured,Not captured,2800 N Divis,,Bethany,Oklahoma,73008,4054686500,,Not captured,Not captured,mattaprylhaynes@protonmail.com,Not captured,,802051799,Not captured,Not captured,Not captured,Not captured,Not captured,Not captured,
Not captured,Not captured,01/01/2021,12/30/2021,Not captured,Not captured,863949,020,00072,ARS-04-0057793,Enhanced America,Not captured,Not captured,Not captured,Passport(561937868),,,Neville,Michael ,Patrick ,10/14/1978,male,Not captured,Not captured,Not captured,Not captured,Not captured,Not captured,Not captured,Not captured,Not captured,Not captured,Not captured,Not captured,Not captured,,,Not captured,Not captured,Not captured,Not captured,860 Wolverine Lane,,Fraser,Colorado,80442,4043108364,,Not captured,Not captured,mpneville@gmail.com,Not captured,802051502,,Not captured,Not captured,Not captured,Not captured,Not captured,Not captured,
Not captured,Not captured,01/05/2021,05/31/2021,Not captured,Not captured,863949,020,00072,ARS-01-0057982,Beacon International,Not captured,Not captured,Not captured,Passport(641174033),,,Peart,Jeffrey Ronald,,07/07/1996,male,Not captured,Not captured,Not captured,Not captured,Not captured,Not captured,Not captured,Not captured,Not captured,Not captured,Not captured,Not captured,Not captured,Donna Peart,,Not captured,Not captured,Not captured,Not captured,612 17th ave,,Lake Como,NJ,07719,+351-966878775,,Not captured,Not captured,jeffpeart777@gmail.com,Not captured,802051797,,Not captured,Not captured,Not captured,Not captured,Not captured,Not captured,
Not captured,Not captured,01/04/2021,02/02/2021,Not captured,Not captured,863949,020,00072,ARS-01-0057981,Beacon International,Not captured,Not captured,Not captured,,,,Coradeschi,Gabriele,,10/17/1985,male,Not captured,Not captured,Not captured,Not captured,Not captured,Not captured,Not captured,Not captured,Not captured,Not captured,Not captured,Not captured,Not captured,,,Not captured,Not captured,Not captured,Not captured,Loc. Il Doccio 1,,Pergine Valdarno,,52020,,,Not captured,Not captured,coradeschigabriele@gmail.com,Not captured,802051796,,Not captured,Not captured,Not captured,Not captured,Not captured,Not captured,
Not captured,Not captured,01/04/2021,01/15/2021,Not captured,Not captured,863949,020,00072,ARS-02-0057980,Beacon America,Not captured,Not captured,Not captured,Passport(Fr579676),,,Rocha trindade da Silva,Daniel,,10/24/1999,male,Not captured,Not captured,Not captured,Not captured,Not captured,Not captured,Not captured,Not captured,Not captured,Not captured,Not captured,Not captured,Not captured,Jose SILVA,,Not captured,Not captured,Not captured,Not captured,QUADRA 07 LOTE 09 RECREIO DA BARRAGEM,,AGUAS LINDAS DE GOIAS,Goias,72920849,+1-7863125024,,Not captured,Not captured,modleonar@gmail.com,Not captured,802051795,,Not captured,Not captured,Not captured,Not captured,Not captured,Not captured,
Not captured,Not captured,01/04/2021,06/03/2021,Not captured,Not captured,863949,020,00072,ARS-02-0057978,Beacon America,Not captured,Not captured,Not captured,Passport(065660485),,,Fereira de Watts,Glenys Victoria,,10/14/1951,female,Not captured,Not captured,Not captured,Not captured,Not captured,Not captured,Not captured,Not captured,Not captured,Not captured,Not captured,Not captured,Not captured,Kassandra Watts,,Not captured,Not captured,Not captured,Not captured,Street 80 Avenue 74 Residence Las Tunas,,Maracaibo,Zulia,4005,+1-7138170700,,Not captured,Not captured,robertgrobinson@hotmail.com,Not captured,802051793,,Not captured,Not captured,Not captured,Not captured,Not captured,Not captured,