EE Transaction Type,Dependent Transaction Type,Effective Date,Expiry Date,EE Signature,EE Signature Date,Control,Suffix,Account,Plan Number,Plan Name,Claim Office,Network ID Number,Customer Code,EE SSN,Dependent SSN,Dependent Relationship,Last Name,First Name,Middle Initial,DOB,Gender,Ethnicity,PCP/PCD,PCP/PCD Current Patient,Provider Cap Office Number,COB,Dep Student Indicator,Dep OOA Indicator,EE Prior Coverage Indicator,EE Late Entrant,EE Language Indicator,Hire Date,Earnings,Earnings Frequency,Beneficiary (Last Name First Name MI),Beneficiary Relationship,Continuation of Coverage Expiration Date,Continuation of Coverage Event Date,Continuation of Coverage Length of Coverage,Work Location Zip Code,Street Address Line 1,Street Address Line 2,City,State,Zip Code,Home Phone Number,Work Phone Number,Accept Code,Evidence Code,EE Email Address,Communication Disability Code,EE Alternate ID,Dep Alternate ID,Old Control,Old Suffix,Old Account,New Control,New Suffix,New Account,
Not captured,Not captured,12/26/2020,01/12/2021,Not captured,Not captured,863949,020,00072,ARS-01-0057891,Beacon International,Not captured,Not captured,Not captured,Passport(552766940),,,Aquino Medina,Eugenia Andrea,,01/29/2005,female,Not captured,Not captured,Not captured,Not captured,Not captured,Not captured,Not captured,Not captured,Not captured,Not captured,Not captured,Not captured,Not captured,Maria Medina,,Not captured,Not captured,Not captured,Not captured,3704 Parsons Blvd,,Flushing,NY,11354,+1-9177414533,+1-9177414533,Not captured,Not captured,eumary302@hotmail.com,Not captured,802051694,,Not captured,Not captured,Not captured,Not captured,Not captured,Not captured,
Not captured,Not captured,12/26/2020,01/03/2021,Not captured,Not captured,863949,020,00072,ARS-01-0057890,Beacon International,Not captured,Not captured,Not captured,Passport(550956662),,,Bradley,Coranetta,W,01/13/1969,female,Not captured,Not captured,Not captured,Not captured,Not captured,Not captured,Not captured,Not captured,Not captured,Not captured,Not captured,Not captured,Not captured,Columbus Wheeler,Brother,Not captured,Not captured,Not captured,Not captured,3343 Tewson Dr,,Columbus,Georgia,31909,7065775838,,Not captured,Not captured,coranetta@gmail.com,Not captured,802051693,,Not captured,Not captured,Not captured,Not captured,Not captured,Not captured,
Not captured,Not captured,12/25/2020,03/24/2021,Not captured,Not captured,863949,020,00072,ARS-02-0057884,Beacon America,Not captured,Not captured,Not captured,,,,Nimishakavi,Vasundhara Devi,,10/06/1955,female,Not captured,Not captured,Not captured,Not captured,Not captured,Not captured,Not captured,Not captured,Not captured,Not captured,Not captured,Not captured,Not captured,Raghavendra Nimishakavi,Spouse,Not captured,Not captured,Not captured,Not captured,House No 12-16 Plot No.155 Road No.1 RK Puram,,Hyderabad,TG,500035,+1-3174782435,,Not captured,Not captured,raghavendra.nimish@gmail.com,Not captured,802051687,,Not captured,Not captured,Not captured,Not captured,Not captured,Not captured,
Not captured,Not captured,12/25/2020,03/24/2021,Not captured,Not captured,863949,020,00072,ARS-02-0057883,Beacon America,Not captured,Not captured,Not captured,Passport(R0137637),,,Nimishakavi,Bhavani Sankara Rao,,06/27/1952,male,Not captured,Not captured,Not captured,Not captured,Not captured,Not captured,Not captured,Not captured,Not captured,Not captured,Not captured,Not captured,Not captured,Raghavendra Nimishakavi,,Not captured,Not captured,Not captured,Not captured,House No 12-16 Plot No.155 Road No.1 RK Puram,,Hyderabad,TG,500035,+1-3174782435,,Not captured,Not captured,raghavendra.nimish@gmail.com,Not captured,802051686,,Not captured,Not captured,Not captured,Not captured,Not captured,Not captured,
Not captured,Not captured,12/26/2020,01/03/2021,Not captured,Not captured,863949,020,00072,ARS-01-0057882,Beacon International,Not captured,Not captured,Not captured,,,,RAKHAMIMOV,ARIEL,,07/25/2013,male,Not captured,Not captured,Not captured,Not captured,Not captured,Not captured,Not captured,Not captured,Not captured,Not captured,Not captured,Not captured,Not captured,JULIA ISAAKOVA,Dependent,Not captured,Not captured,Not captured,Not captured,195 KENSINGTON ST,,BROOKLYN,NY,11235,+1-3478039494,,Not captured,Not captured,elirnyc@gmail.com,Not captured,802051685,,Not captured,Not captured,Not captured,Not captured,Not captured,Not captured,
Not captured,Not captured,12/26/2020,01/03/2021,Not captured,Not captured,863949,020,00072,ARS-01-0057881,Beacon International,Not captured,Not captured,Not captured,,,,ISAAKOVA,JULIA,,11/24/1989,female,Not captured,Not captured,Not captured,Not captured,Not captured,Not captured,Not captured,Not captured,Not captured,Not captured,Not captured,Not captured,Not captured,JULIA ISAAKOVA,Spouse,Not captured,Not captured,Not captured,Not captured,195 KENSINGTON ST,,BROOKLYN,NY,11235,+1-3478039494,,Not captured,Not captured,elirnyc@gmail.com,Not captured,802051684,,Not captured,Not captured,Not captured,Not captured,Not captured,Not captured,
Not captured,Not captured,12/26/2020,01/03/2021,Not captured,Not captured,863949,020,00072,ARS-01-0057880,Beacon International,Not captured,Not captured,Not captured,Passport(493030720),,,RAKHAMIMOV,ELI,,05/14/1982,male,Not captured,Not captured,Not captured,Not captured,Not captured,Not captured,Not captured,Not captured,Not captured,Not captured,Not captured,Not captured,Not captured,JULIA ISAAKOVA,,Not captured,Not captured,Not captured,Not captured,195 KENSINGTON ST,,BROOKLYN,NY,11235,+1-3478039494,,Not captured,Not captured,elirnyc@gmail.com,Not captured,802051683,,Not captured,Not captured,Not captured,Not captured,Not captured,Not captured,
Not captured,Not captured,12/25/2020,12/28/2020,Not captured,Not captured,863949,020,00072,ARS-01-0057879,Beacon International,Not captured,Not captured,Not captured,,,,Shabtai,Thomas,,08/17/2019,male,Not captured,Not captured,Not captured,Not captured,Not captured,Not captured,Not captured,Not captured,Not captured,Not captured,Not captured,Not captured,Not captured,,,Not captured,Not captured,Not captured,Not captured,6044 Cartwright Ave,,Los Angeles,California,91606,,,Not captured,Not captured,mook2020@gmail.com,Not captured,802051682,,Not captured,Not captured,Not captured,Not captured,Not captured,Not captured,
Not captured,Not captured,12/25/2020,12/28/2020,Not captured,Not captured,863949,020,00072,ARS-01-0057878,Beacon International,Not captured,Not captured,Not captured,,,,Shabtai,Arnon,,01/15/1967,male,Not captured,Not captured,Not captured,Not captured,Not captured,Not captured,Not captured,Not captured,Not captured,Not captured,Not captured,Not captured,Not captured,,,Not captured,Not captured,Not captured,Not captured,6044 Cartwright Ave,,Los Angeles,California,91606,,,Not captured,Not captured,mook2020@gmail.com,Not captured,802051681,,Not captured,Not captured,Not captured,Not captured,Not captured,Not captured,
Not captured,Not captured,12/25/2020,01/31/2021,Not captured,Not captured,863949,020,00072,ARS-01-0057875,Beacon International,Not captured,Not captured,Not captured,,,,Sazonova,Eva,,09/04/1990,female,Not captured,Not captured,Not captured,Not captured,Not captured,Not captured,Not captured,Not captured,Not captured,Not captured,Not captured,Not captured,Not captured,,,Not captured,Not captured,Not captured,Not captured,29 gastello,,Adler,,354399,,,Not captured,Not captured,evasazanoff@gmail.com,Not captured,802051673,,Not captured,Not captured,Not captured,Not captured,Not captured,Not captured,
Not captured,Not captured,12/24/2020,12/30/2020,Not captured,Not captured,863949,020,00072,ARS-01-0057874,Beacon International,Not captured,Not captured,Not captured,,,,Stark,Holly,,05/30/1989,female,Not captured,Not captured,Not captured,Not captured,Not captured,Not captured,Not captured,Not captured,Not captured,Not captured,Not captured,Not captured,Not captured,,,Not captured,Not captured,Not captured,Not captured,688 110th Ave NE,,Bellevue,Washington,98034,,,Not captured,Not captured,holly.p.stark@gmail.com,Not captured,802051672,,Not captured,Not captured,Not captured,Not captured,Not captured,Not captured,
Not captured,Not captured,12/23/2020,12/30/2020,Not captured,Not captured,863949,020,00072,ARS-01-0057873,Beacon International,Not captured,Not captured,Not captured,Passport(522211327),,,Alcalay,Eliahu,,04/21/1992,male,Not captured,Not captured,Not captured,Not captured,Not captured,Not captured,Not captured,Not captured,Not captured,Not captured,Not captured,Not captured,Not captured,Benjamin Alcalay,,Not captured,Not captured,Not captured,Not captured,18161 Daybreak Drive,,Boca Raton,FL,33496,+1-5614143341,,Not captured,Not captured,elialcalay@gmail.com,Not captured,802051671,,Not captured,Not captured,Not captured,Not captured,Not captured,Not captured,
Not captured,Not captured,12/25/2020,12/30/2020,Not captured,Not captured,863949,020,00072,ARS-01-0057872,Beacon International,Not captured,Not captured,Not captured,Passport(522211327),,,Alcalay,Eliahu Futernick,,04/21/1992,male,Not captured,Not captured,Not captured,Not captured,Not captured,Not captured,Not captured,Not captured,Not captured,Not captured,Not captured,Not captured,Not captured,Benjamin Alcalay,,Not captured,Not captured,Not captured,Not captured,18161 Daybreak Drive,,Boca Raton,FL,33496,+1-5614143341,,Not captured,Not captured,elialcalay@gmail.com,Not captured,802051670,,Not captured,Not captured,Not captured,Not captured,Not captured,Not captured,
Not captured,Not captured,12/26/2020,12/30/2020,Not captured,Not captured,863949,020,00072,ARS-02-0057871,Beacon America,Not captured,Not captured,Not captured,Passport(34506591),,,Tahori,Maya,,07/22/1989,female,Not captured,Not captured,Not captured,Not captured,Not captured,Not captured,Not captured,Not captured,Not captured,Not captured,Not captured,Not captured,Not captured,Gabriel Arias,,Not captured,Not captured,Not captured,Not captured,26 Alumim street,,Tel Aviv,Israel,8150815,+1-7866098263,,Not captured,Not captured,mayatahori7@gmail.com,Not captured,802051669,,Not captured,Not captured,Not captured,Not captured,Not captured,Not captured,
Not captured,Not captured,12/23/2020,01/03/2021,Not captured,Not captured,863949,020,00072,ARS-01-0057869,Beacon International,Not captured,Not captured,Not captured,,,,Azzam,Maysoon,,01/06/2003,female,Not captured,Not captured,Not captured,Not captured,Not captured,Not captured,Not captured,Not captured,Not captured,Not captured,Not captured,Not captured,Not captured,maysoon azzam,Dependent,Not captured,Not captured,Not captured,Not captured,26 bolton road,,Wayne,NJ,07470,+1-8622487657,+1-8622487658,Not captured,Not captured,amaysoon5@gmail.com,Not captured,802051667,,Not captured,Not captured,Not captured,Not captured,Not captured,Not captured,
Not captured,Not captured,12/23/2020,01/03/2021,Not captured,Not captured,863949,020,00072,ARS-01-0057868,Beacon International,Not captured,Not captured,Not captured,,,,Azzam,Mariam,,07/11/2004,female,Not captured,Not captured,Not captured,Not captured,Not captured,Not captured,Not captured,Not captured,Not captured,Not captured,Not captured,Not captured,Not captured,maysoon azzam,Dependent,Not captured,Not captured,Not captured,Not captured,26 bolton road,,Wayne,NJ,07470,+1-8622487657,+1-8622487658,Not captured,Not captured,amaysoon5@gmail.com,Not captured,802051666,,Not captured,Not captured,Not captured,Not captured,Not captured,Not captured,
Not captured,Not captured,12/23/2020,01/03/2021,Not captured,Not captured,863949,020,00072,ARS-01-0057867,Beacon International,Not captured,Not captured,Not captured,Passport(564273525),,,Azzam,Rania,,02/01/1976,female,Not captured,Not captured,Not captured,Not captured,Not captured,Not captured,Not captured,Not captured,Not captured,Not captured,Not captured,Not captured,Not captured,maysoon azzam,,Not captured,Not captured,Not captured,Not captured,26 bolton road,,Wayne,NJ,07470,+1-8622487657,+1-8622487658,Not captured,Not captured,amaysoon5@gmail.com,Not captured,802051665,,Not captured,Not captured,Not captured,Not captured,Not captured,Not captured,
Not captured,Not captured,12/23/2020,01/23/2021,Not captured,Not captured,863949,020,00072,ARS-01-0057866,Beacon International,Not captured,Not captured,Not captured,Passport(488447614),,,Trachtenberg,Rebecca,,12/09/1993,female,Not captured,Not captured,Not captured,Not captured,Not captured,Not captured,Not captured,Not captured,Not captured,Not captured,Not captured,Not captured,Not captured,Raquel Trachtenberg,madre,Not captured,Not captured,Not captured,Not captured,7810 Lago del Mar Dr #107 Boca Ratón Florida 33433,,Boca Raton,Florida,33433,+1 917 705 0598,,Not captured,Not captured,raquelt18@gmail.com,Not captured,802051664,,Not captured,Not captured,Not captured,Not captured,Not captured,Not captured,
Not captured,Not captured,12/24/2020,02/24/2021,Not captured,Not captured,863949,020,00072,ARS-02-0057865,Beacon America,Not captured,Not captured,Not captured,Passport(BD5194983),,,Sohail,Sidra,,05/01/1991,female,Not captured,Not captured,Not captured,Not captured,Not captured,Not captured,Not captured,Not captured,Not captured,Not captured,Not captured,Not captured,Not captured,Khurram Sohail,,Not captured,Not captured,Not captured,Not captured,A7 Officers&apos; Colony,,Muzaffarabad,AJK,13100,+1-3392247883,,Not captured,Not captured,sidrasohail011@gmail.com,Not captured,802051663,,Not captured,Not captured,Not captured,Not captured,Not captured,Not captured,
Not captured,Not captured,12/23/2020,06/22/2021,Not captured,Not captured,863949,020,00072,ARS-02-0057864,Beacon America,Not captured,Not captured,Not captured,Passport(L9531172),,,PATEL,KAILAS A,,01/25/1987,female,Not captured,Not captured,Not captured,Not captured,Not captured,Not captured,Not captured,Not captured,Not captured,Not captured,Not captured,Not captured,Not captured,YOGESH J PATEL,,Not captured,Not captured,Not captured,Not captured,D 175 KHODIYAR NAGAR,,KADI MEHSANA,GJ,382705,+1-7739028055,,Not captured,Not captured,yogired.mango@gmail.com,Not captured,802051662,,Not captured,Not captured,Not captured,Not captured,Not captured,Not captured,
Not captured,Not captured,12/23/2020,01/02/2021,Not captured,Not captured,863949,020,00072,ARS-01-0057863,Beacon International,Not captured,Not captured,Not captured,,,,Macario Silva-Sepulveda,Renata,B,02/04/1997,female,Not captured,Not captured,Not captured,Not captured,Not captured,Not captured,Not captured,Not captured,Not captured,Not captured,Not captured,Not captured,Not captured,,,Not captured,Not captured,Not captured,Not captured,29 East Moriches Blvd,,East Moriches,New York,11940,,,Not captured,Not captured,phillip.b.sepulveda@gmail.com,Not captured,802051661,,Not captured,Not captured,Not captured,Not captured,Not captured,Not captured,
Not captured,Not captured,12/23/2020,01/02/2021,Not captured,Not captured,863949,020,00072,ARS-01-0057862,Beacon International,Not captured,Not captured,Not captured,,,,Sepulveda,Phillip,B,03/24/1992,male,Not captured,Not captured,Not captured,Not captured,Not captured,Not captured,Not captured,Not captured,Not captured,Not captured,Not captured,Not captured,Not captured,,,Not captured,Not captured,Not captured,Not captured,29 East Moriches Blvd,,East Moriches,New York,11940,,,Not captured,Not captured,phillip.b.sepulveda@gmail.com,Not captured,802051660,,Not captured,Not captured,Not captured,Not captured,Not captured,Not captured,
Not captured,Not captured,12/23/2020,01/04/2021,Not captured,Not captured,863949,020,00072,ARS-01-0057861,Beacon International,Not captured,Not captured,Not captured,,,,Caumon,Edouard,,04/11/1985,male,Not captured,Not captured,Not captured,Not captured,Not captured,Not captured,Not captured,Not captured,Not captured,Not captured,Not captured,Not captured,Not captured,,,Not captured,Not captured,Not captured,Not captured,36 Lispenard St,,New York,New York,10013,,,Not captured,Not captured,edouardcaumon@gmail.com,Not captured,802051659,,Not captured,Not captured,Not captured,Not captured,Not captured,Not captured,
Not captured,Not captured,12/23/2020,01/03/2021,Not captured,Not captured,863949,020,00072,ARS-01-0057860,Beacon International,Not captured,Not captured,Not captured,,,,Chichportiche,Pierre,,02/08/1987,male,Not captured,Not captured,Not captured,Not captured,Not captured,Not captured,Not captured,Not captured,Not captured,Not captured,Not captured,Not captured,Not captured,,,Not captured,Not captured,Not captured,Not captured,31 Oliver Street Apt 2E,,New York,New York,10038,,,Not captured,Not captured,pierre.chich@gmail.com,Not captured,802051658,,Not captured,Not captured,Not captured,Not captured,Not captured,Not captured,
Not captured,Not captured,12/23/2020,01/04/2021,Not captured,Not captured,863949,020,00072,ARS-01-0057859,Beacon International,Not captured,Not captured,Not captured,,,,EVEQUE,Adrien,,12/08/1986,male,Not captured,Not captured,Not captured,Not captured,Not captured,Not captured,Not captured,Not captured,Not captured,Not captured,Not captured,Not captured,Not captured,,,Not captured,Not captured,Not captured,Not captured,37 w 8th st,,New york,New York,10011,,,Not captured,Not captured,evequeadrien@gmail.com,Not captured,802051657,,Not captured,Not captured,Not captured,Not captured,Not captured,Not captured,
Not captured,Not captured,12/23/2020,12/21/2021,Not captured,Not captured,863949,020,00072,ARS-03-0057850,Essential America,Not captured,Not captured,Not captured,Passport(C6203768),,,Soda,Mike,,09/08/1977,female,Not captured,Not captured,Not captured,Not captured,Not captured,Not captured,Not captured,Not captured,Not captured,Not captured,Not captured,Not captured,Not captured,,,Not captured,Not captured,Not captured,Not captured,70 Wyland Way,,Basalt,Colorado,81621,7022771853,,Not captured,Not captured,joe@plethorallc.com,Not captured,802051630,,Not captured,Not captured,Not captured,Not captured,Not captured,Not captured,
Not captured,Not captured,12/23/2020,12/31/2020,Not captured,Not captured,863949,020,00072,ARS-01-0057856,Beacon International,Not captured,Not captured,Not captured,,,,Hike,Dylan,,10/13/2012,male,Not captured,Not captured,Not captured,Not captured,Not captured,Not captured,Not captured,Not captured,Not captured,Not captured,Not captured,Not captured,Not captured,,,Not captured,Not captured,Not captured,Not captured,33-04 Junction Blvd. 6W,,Jackson Heights,New York,11372,,,Not captured,Not captured,aya33325@hotmail.com,Not captured,802051654,,Not captured,Not captured,Not captured,Not captured,Not captured,Not captured,
Not captured,Not captured,12/23/2020,12/31/2020,Not captured,Not captured,863949,020,00072,ARS-01-0057855,Beacon International,Not captured,Not captured,Not captured,,,,Hike,Ayako,,11/25/1961,female,Not captured,Not captured,Not captured,Not captured,Not captured,Not captured,Not captured,Not captured,Not captured,Not captured,Not captured,Not captured,Not captured,,,Not captured,Not captured,Not captured,Not captured,33-04 Junction Blvd. 6W,,Jackson Heights,New York,11372,,,Not captured,Not captured,aya33325@hotmail.com,Not captured,802051653,,Not captured,Not captured,Not captured,Not captured,Not captured,Not captured,
Not captured,Not captured,12/23/2020,01/06/2021,Not captured,Not captured,863949,020,00072,ARS-01-0057854,Beacon International,Not captured,Not captured,Not captured,,,,Weidman,Samuel,E,05/20/1990,male,Not captured,Not captured,Not captured,Not captured,Not captured,Not captured,Not captured,Not captured,Not captured,Not captured,Not captured,Not captured,Not captured,,,Not captured,Not captured,Not captured,Not captured,5606 Jed Smith Road,,Hidden HIlls,California,91302,,,Not captured,Not captured,info@djsamfrench.com,Not captured,802051652,,Not captured,Not captured,Not captured,Not captured,Not captured,Not captured,
Not captured,Not captured,12/23/2020,03/31/2021,Not captured,Not captured,863949,020,00072,ARS-02-0057853,Beacon America,Not captured,Not captured,Not captured,Passport(U6961166),,,Chukka,Sarada,,07/01/1963,female,Not captured,Not captured,Not captured,Not captured,Not captured,Not captured,Not captured,Not captured,Not captured,Not captured,Not captured,Not captured,Not captured,Vinay Chukka,,Not captured,Not captured,Not captured,Not captured,9-17-26 CBM Compound,,Visakhapatnam,AP,530003,+1-7033098268,,Not captured,Not captured,vinaychukka@gmail.com,Not captured,802051651,,Not captured,Not captured,Not captured,Not captured,Not captured,Not captured,
Not captured,Not captured,12/22/2020,01/01/2021,Not captured,Not captured,863949,020,00072,ARS-01-0057851,Beacon International,Not captured,Not captured,Not captured,,,,Montes,Ricardo,,02/06/1973,male,Not captured,Not captured,Not captured,Not captured,Not captured,Not captured,Not captured,Not captured,Not captured,Not captured,Not captured,Not captured,Not captured,,,Not captured,Not captured,Not captured,Not captured,305 W Drew St,,Houston,Texas,77006,,,Not captured,Not captured,ricardomontes@hotmail.com,Not captured,802051631,,Not captured,Not captured,Not captured,Not captured,Not captured,Not captured,
Not captured,Not captured,12/22/2020,01/07/2021,Not captured,Not captured,863949,020,00072,ARS-02-0057848,Beacon America,Not captured,Not captured,Not captured,,,,Alcibar Hernadez,Maria de la Luz,,06/03/1958,female,Not captured,Not captured,Not captured,Not captured,Not captured,Not captured,Not captured,Not captured,Not captured,Not captured,Not captured,Not captured,Not captured,Ma del Pilar Diez Alcibar,Spouse,Not captured,Not captured,Not captured,Not captured,Paseo San Gerardo 119B 2a Seccion,,Metepec,Estado de Mexico,52140,+1-2019369060,,Not captured,Not captured,pili_diez@hotmail.com,Not captured,802051625,,Not captured,Not captured,Not captured,Not captured,Not captured,Not captured,
Not captured,Not captured,12/22/2020,01/07/2021,Not captured,Not captured,863949,020,00072,ARS-02-0057847,Beacon America,Not captured,Not captured,Not captured,Passport(g32553645),,,Diez Cueli,Jose Manuel,,11/07/1956,male,Not captured,Not captured,Not captured,Not captured,Not captured,Not captured,Not captured,Not captured,Not captured,Not captured,Not captured,Not captured,Not captured,Ma del Pilar Diez Alcibar,,Not captured,Not captured,Not captured,Not captured,Paseo San Gerardo 119B 2a Seccion,,Metepec,Estado de Mexico,52140,+1-2019369060,,Not captured,Not captured,pili_diez@hotmail.com,Not captured,802051624,,Not captured,Not captured,Not captured,Not captured,Not captured,Not captured,
Not captured,Not captured,12/22/2020,01/21/2021,Not captured,Not captured,863949,020,00072,ARS-01-0057846,Beacon International,Not captured,Not captured,Not captured,,,,Cajayon,Dainiel Brian,C,06/04/2000,male,Not captured,Not captured,Not captured,Not captured,Not captured,Not captured,Not captured,Not captured,Not captured,Not captured,Not captured,Not captured,Not captured,,,Not captured,Not captured,Not captured,Not captured,B12 L11 Coffee Grove,,Lipa,,4200,,,Not captured,Not captured,dennis@emi-bh.com,Not captured,802051623,,Not captured,Not captured,Not captured,Not captured,Not captured,Not captured,
Not captured,Not captured,12/23/2020,01/29/2021,Not captured,Not captured,863949,020,00072,ARS-01-0057845,Beacon International,Not captured,Not captured,Not captured,Passport(561841205),,,Hardin,Curtis,,12/14/1981,male,Not captured,Not captured,Not captured,Not captured,Not captured,Not captured,Not captured,Not captured,Not captured,Not captured,Not captured,Not captured,Not captured,Gabriela Gomes,,Not captured,Not captured,Not captured,Not captured,35 Rose Street,,Cape Town,Western Cape,8001,+1-8442109020,,Not captured,Not captured,curtis.hardin@gmail.com,Not captured,802051622,,Not captured,Not captured,Not captured,Not captured,Not captured,Not captured,