EE Transaction Type,Dependent Transaction Type,Effective Date,Expiry Date,EE Signature,EE Signature Date,Control,Suffix,Account,Plan Number,Plan Name,Claim Office,Network ID Number,Customer Code,EE SSN,Dependent SSN,Dependent Relationship,Last Name,First Name,Middle Initial,DOB,Gender,Ethnicity,PCP/PCD,PCP/PCD Current Patient,Provider Cap Office Number,COB,Dep Student Indicator,Dep OOA Indicator,EE Prior Coverage Indicator,EE Late Entrant,EE Language Indicator,Hire Date,Earnings,Earnings Frequency,Beneficiary (Last Name First Name MI),Beneficiary Relationship,Continuation of Coverage Expiration Date,Continuation of Coverage Event Date,Continuation of Coverage Length of Coverage,Work Location Zip Code,Street Address Line 1,Street Address Line 2,City,State,Zip Code,Home Phone Number,Work Phone Number,Accept Code,Evidence Code,EE Email Address,Communication Disability Code,EE Alternate ID,Dep Alternate ID,Old Control,Old Suffix,Old Account,New Control,New Suffix,New Account,
Not captured,Not captured,12/18/2020,12/23/2020,Not captured,Not captured,863949,020,00072,ARS-02-0057818,Beacon America,Not captured,Not captured,Not captured,,,,Cappelletti,Stefania,,05/09/1967,female,Not captured,Not captured,Not captured,Not captured,Not captured,Not captured,Not captured,Not captured,Not captured,Not captured,Not captured,Not captured,Not captured,,,Not captured,Not captured,Not captured,Not captured,Calle 10 Norte Mza 28 lote 7/8 entre 1 y 5 avenida,,PLAYA DEL CARMEN Q.ROO,,77710,,,Not captured,Not captured,jeeval7@hotmail.com,Not captured,802051550,,Not captured,Not captured,Not captured,Not captured,Not captured,Not captured,
Not captured,Not captured,12/17/2020,06/16/2021,Not captured,Not captured,863949,020,00072,ARS-02-0057812,Beacon America,Not captured,Not captured,Not captured,,,,Akula,Havish,,10/30/2010,male,Not captured,Not captured,Not captured,Not captured,Not captured,Not captured,Not captured,Not captured,Not captured,Not captured,Not captured,Not captured,Not captured,Neetha,Dependent,Not captured,Not captured,Not captured,Not captured,2-2-1074/9 Bagh Amberpet,,Hyderabad,TG,500013,+1-3199617955,,Not captured,Not captured,arunakula@gmail.com,Not captured,802051544,,Not captured,Not captured,Not captured,Not captured,Not captured,Not captured,
Not captured,Not captured,12/17/2020,06/16/2021,Not captured,Not captured,863949,020,00072,ARS-02-0057811,Beacon America,Not captured,Not captured,Not captured,Passport(S6441969),,,Yerrum,Neetha,,11/06/1983,female,Not captured,Not captured,Not captured,Not captured,Not captured,Not captured,Not captured,Not captured,Not captured,Not captured,Not captured,Not captured,Not captured,Neetha,,Not captured,Not captured,Not captured,Not captured,2-2-1074/9 Bagh Amberpet,,Hyderabad,TG,500013,+1-3199617955,,Not captured,Not captured,arunakula@gmail.com,Not captured,802051543,,Not captured,Not captured,Not captured,Not captured,Not captured,Not captured,
Not captured,Not captured,12/17/2020,01/11/2021,Not captured,Not captured,863949,020,00072,ARS-01-0057810,Beacon International,Not captured,Not captured,Not captured,Passport(561587523),,,Wisbauer,Brian James,,06/20/1976,male,Not captured,Not captured,Not captured,Not captured,Not captured,Not captured,Not captured,Not captured,Not captured,Not captured,Not captured,Not captured,Not captured,Patrick Wisbauer,,Not captured,Not captured,Not captured,Not captured,206 E. Center Avenue,,Maple Shade,NJ,08052,+1-340-227-7072,,Not captured,Not captured,brianwisbauer7@gmail.com,Not captured,802051542,,Not captured,Not captured,Not captured,Not captured,Not captured,Not captured,
Not captured,Not captured,12/17/2020,01/03/2021,Not captured,Not captured,863949,020,00072,ARS-01-0057808,Beacon International,Not captured,Not captured,Not captured,,,,Truong,Ellys,,09/03/1991,female,Not captured,Not captured,Not captured,Not captured,Not captured,Not captured,Not captured,Not captured,Not captured,Not captured,Not captured,Not captured,Not captured,,,Not captured,Not captured,Not captured,Not captured,144 Woodruff ave. 3A,,Brooklyn,New York,11226,,,Not captured,Not captured,ellys.truong@gmail.com,Not captured,802051540,,Not captured,Not captured,Not captured,Not captured,Not captured,Not captured,
Not captured,Not captured,12/18/2020,01/31/2021,Not captured,Not captured,863949,020,00072,ARS-01-0057807,Beacon International,Not captured,Not captured,Not captured,Passport(AO958533),,,Burbano Vargas,Virgina,,12/01/1970,female,Not captured,Not captured,Not captured,Not captured,Not captured,Not captured,Not captured,Not captured,Not captured,Not captured,Not captured,Not captured,Not captured,Fabricio Mercadal,,Not captured,Not captured,Not captured,Not captured,3951 Kirby Dr,,Fort Worth,TX,76155,+1-8177031752,,Not captured,Not captured,fabriciomercadal@gmail.com,Not captured,802051539,,Not captured,Not captured,Not captured,Not captured,Not captured,Not captured,
Not captured,Not captured,12/18/2020,01/03/2021,Not captured,Not captured,863949,020,00072,ARS-01-0057806,Beacon International,Not captured,Not captured,Not captured,Passport(647134524),,,Sandler,Ryan,,06/04/1992,male,Not captured,Not captured,Not captured,Not captured,Not captured,Not captured,Not captured,Not captured,Not captured,Not captured,Not captured,Not captured,Not captured,Helese sandler,,Not captured,Not captured,Not captured,Not captured,661 Broadway St,,Los Angeles,CA,90291,+1-9122578777,,Not captured,Not captured,sandlerryan@gmail.com,Not captured,802051538,,Not captured,Not captured,Not captured,Not captured,Not captured,Not captured,
Not captured,Not captured,12/17/2020,01/03/2021,Not captured,Not captured,863949,020,00072,ARS-01-0057805,Beacon International,Not captured,Not captured,Not captured,,,,Toñanez,Alvaro,J,12/18/1968,male,Not captured,Not captured,Not captured,Not captured,Not captured,Not captured,Not captured,Not captured,Not captured,Not captured,Not captured,Not captured,Not captured,,,Not captured,Not captured,Not captured,Not captured,8750 sw 125 terr,,Miami,Florida,33156,,,Not captured,Not captured,atonanez@yahoo.com,Not captured,802051537,,Not captured,Not captured,Not captured,Not captured,Not captured,Not captured,
Not captured,Not captured,12/16/2020,12/14/2021,Not captured,Not captured,863949,020,00072,ARS-05-0057711,Clear International,Not captured,Not captured,Not captured,Passport(541118300),,,Tafuri,Christopher,Marshall,07/10/1961,male,Not captured,Not captured,Not captured,Not captured,Not captured,Not captured,Not captured,Not captured,Not captured,Not captured,Not captured,Not captured,Not captured,,,Not captured,Not captured,Not captured,Not captured,Bahia Golf & Residences,,Akumal Tulum,Quintana Roo,77776,9842463900,,Not captured,Not captured,christafuri@gmail.com,Not captured,802051245,,Not captured,Not captured,Not captured,Not captured,Not captured,Not captured,
Not captured,Not captured,12/17/2020,01/18/2021,Not captured,Not captured,863949,020,00072,ARS-02-0057803,Beacon America,Not captured,Not captured,Not captured,Passport(G35685683),,,Ayma Briones,Sandra Elisabet,,05/24/1963,female,Not captured,Not captured,Not captured,Not captured,Not captured,Not captured,Not captured,Not captured,Not captured,Not captured,Not captured,Not captured,Not captured,Nazario Danniel Garza Ayma,,Not captured,Not captured,Not captured,Not captured,Paseo del Mar 252 San Patricio,,Saltillo,Coahuila,25204,+1-2486350827,,Not captured,Not captured,ndga84@hotmail.com,Not captured,802051532,,Not captured,Not captured,Not captured,Not captured,Not captured,Not captured,
Not captured,Not captured,12/16/2020,04/30/2021,Not captured,Not captured,863949,020,00072,ARS-01-0057801,Beacon International,Not captured,Not captured,Not captured,,,,Handler,Boruch,D,03/25/1999,male,Not captured,Not captured,Not captured,Not captured,Not captured,Not captured,Not captured,Not captured,Not captured,Not captured,Not captured,Not captured,Not captured,,,Not captured,Not captured,Not captured,Not captured,240 Carey St,,Lakewood,New Jersey,08701,732-770-0014,,Not captured,Not captured,shaya@primeins.com,Not captured,802051530,,Not captured,Not captured,Not captured,Not captured,Not captured,Not captured,
Not captured,Not captured,12/17/2020,01/22/2021,Not captured,Not captured,863949,020,00072,ARS-01-0057800,Beacon International,Not captured,Not captured,Not captured,Passport(21567774),,,Segal,Amir,,02/12/1992,male,Not captured,Not captured,Not captured,Not captured,Not captured,Not captured,Not captured,Not captured,Not captured,Not captured,Not captured,Not captured,Not captured,Zeev segal,,Not captured,Not captured,Not captured,Not captured,Lotem39,,Kefar vradim,Isreal,25147,+505-58844899,,Not captured,Not captured,amirsegal1202@gmail.com,Not captured,802051529,,Not captured,Not captured,Not captured,Not captured,Not captured,Not captured,
Not captured,Not captured,12/16/2020,12/23/2020,Not captured,Not captured,863949,020,00072,ARS-01-0057799,Beacon International,Not captured,Not captured,Not captured,,,,August,Jordan,B,12/30/1991,male,Not captured,Not captured,Not captured,Not captured,Not captured,Not captured,Not captured,Not captured,Not captured,Not captured,Not captured,Not captured,Not captured,,,Not captured,Not captured,Not captured,Not captured,1250 MODELL DRIVE,,Colorado Springs,Colorado,80911,,,Not captured,Not captured,berenice.amezcua17@gmail.com,Not captured,802051528,,Not captured,Not captured,Not captured,Not captured,Not captured,Not captured,
Not captured,Not captured,12/16/2020,12/23/2020,Not captured,Not captured,863949,020,00072,ARS-01-0057798,Beacon International,Not captured,Not captured,Not captured,,,,Amezcua,Berenice,,09/16/1991,female,Not captured,Not captured,Not captured,Not captured,Not captured,Not captured,Not captured,Not captured,Not captured,Not captured,Not captured,Not captured,Not captured,,,Not captured,Not captured,Not captured,Not captured,1250 MODELL DRIVE,,Colorado Springs,Colorado,80911,,,Not captured,Not captured,berenice.amezcua17@gmail.com,Not captured,802051527,,Not captured,Not captured,Not captured,Not captured,Not captured,Not captured,
Not captured,Not captured,12/16/2020,01/15/2021,Not captured,Not captured,863949,020,00072,ARS-01-0057795,Beacon International,Not captured,Not captured,Not captured,Passport(P5561906),,,Balasubramanian,Annapurna,,04/05/1955,female,Not captured,Not captured,Not captured,Not captured,Not captured,Not captured,Not captured,Not captured,Not captured,Not captured,Not captured,Not captured,Not captured,Kartik Balasubramanian,,Not captured,Not captured,Not captured,Not captured,F-4 Wictory Castle Motinagar,,Hyderabad,TG,500018,+44-7376294211,,Not captured,Not captured,kartik.balasubramanian@gmail.com,Not captured,802051524,,Not captured,Not captured,Not captured,Not captured,Not captured,Not captured,
Not captured,Not captured,12/15/2020,01/11/2021,Not captured,Not captured,863949,020,00072,ARS-01-0057794,Beacon International,Not captured,Not captured,Not captured,Passport(584530455),,,Alqaraghuli,Hadeel,,11/17/1968,female,Not captured,Not captured,Not captured,Not captured,Not captured,Not captured,Not captured,Not captured,Not captured,Not captured,Not captured,Not captured,Not captured,Wad Aljader,,Not captured,Not captured,Not captured,Not captured,291 jamacha rd,,El cajon,CA,92019,+1-6192065432,,Not captured,Not captured,ahmed_aljuboury@yahoo.com,Not captured,802051522,,Not captured,Not captured,Not captured,Not captured,Not captured,Not captured,
Not captured,Not captured,12/15/2020,02/28/2021,Not captured,Not captured,863949,020,00072,ARS-02-0057791,Beacon America,Not captured,Not captured,Not captured,Passport(Z2126805),,,Tummala,Vamsi Krishna,,08/16/1981,male,Not captured,Not captured,Not captured,Not captured,Not captured,Not captured,Not captured,Not captured,Not captured,Not captured,Not captured,Not captured,Not captured,Bhargavi Koneru,Spouse,Not captured,Not captured,Not captured,Not captured,3354 Rogerdale Rd,,Houston,Texas,77042,720-469-0402,,Not captured,Not captured,bhargavi_koneru@yahoo.com,Not captured,802051476,,Not captured,Not captured,Not captured,Not captured,Not captured,Not captured,
Not captured,Not captured,12/17/2020,02/14/2021,Not captured,Not captured,863949,020,00072,ARS-01-0057787,Beacon International,Not captured,Not captured,Not captured,,,,Moncada Gonzalez,Jorge Andres,,08/26/1983,male,Not captured,Not captured,Not captured,Not captured,Not captured,Not captured,Not captured,Not captured,Not captured,Not captured,Not captured,Not captured,Not captured,Jorge Andres,Spouse,Not captured,Not captured,Not captured,Not captured,Calle la musica 3 B4,,Rivas Vaciamadrid,Madrid,28523,+1-2369922595,,Not captured,Not captured,lidiamora83@gmail.com,Not captured,802051472,,Not captured,Not captured,Not captured,Not captured,Not captured,Not captured,
Not captured,Not captured,12/17/2020,02/14/2021,Not captured,Not captured,863949,020,00072,ARS-01-0057786,Beacon International,Not captured,Not captured,Not captured,Passport(PAC942835),,,Mora Moreno,Lidia,,12/26/1983,female,Not captured,Not captured,Not captured,Not captured,Not captured,Not captured,Not captured,Not captured,Not captured,Not captured,Not captured,Not captured,Not captured,Jorge Andres,,Not captured,Not captured,Not captured,Not captured,Calle la musica 3 B4,,Rivas Vaciamadrid,Madrid,28523,+1-2369922595,,Not captured,Not captured,lidiamora83@gmail.com,Not captured,802051471,,Not captured,Not captured,Not captured,Not captured,Not captured,Not captured,
Not captured,Not captured,12/18/2020,01/01/2021,Not captured,Not captured,863949,020,00072,ARS-01-0057785,Beacon International,Not captured,Not captured,Not captured,Passport(439676701),,,leleux,andrew paul,,01/20/1986,male,Not captured,Not captured,Not captured,Not captured,Not captured,Not captured,Not captured,Not captured,Not captured,Not captured,Not captured,Not captured,Not captured,nanette leleux,,Not captured,Not captured,Not captured,Not captured,412 interlude rd.,,new iberia,LA,70563,+1-3373263337,+1-3373263337,Not captured,Not captured,andrewleleux@gmail.com,Not captured,802051466,,Not captured,Not captured,Not captured,Not captured,Not captured,Not captured,
Not captured,Not captured,12/15/2020,12/21/2020,Not captured,Not captured,863949,020,00072,ARS-01-0057784,Beacon International,Not captured,Not captured,Not captured,,,,Davis,Abigail,C,05/09/1996,female,Not captured,Not captured,Not captured,Not captured,Not captured,Not captured,Not captured,Not captured,Not captured,Not captured,Not captured,Not captured,Not captured,,,Not captured,Not captured,Not captured,Not captured,500 Noel Lane Apt. 2307,,Smyrna,Tennessee,37167,,,Not captured,Not captured,abbyandmarty@gmail.com,Not captured,802051465,,Not captured,Not captured,Not captured,Not captured,Not captured,Not captured,
Not captured,Not captured,12/15/2020,12/21/2020,Not captured,Not captured,863949,020,00072,ARS-01-0057783,Beacon International,Not captured,Not captured,Not captured,,,,Potts Jr,Marty,G,03/21/1989,male,Not captured,Not captured,Not captured,Not captured,Not captured,Not captured,Not captured,Not captured,Not captured,Not captured,Not captured,Not captured,Not captured,,,Not captured,Not captured,Not captured,Not captured,500 Noel Lane Apt. 2307,,Smyrna,Tennessee,37167,,,Not captured,Not captured,abbyandmarty@gmail.com,Not captured,802051464,,Not captured,Not captured,Not captured,Not captured,Not captured,Not captured,
Not captured,Not captured,12/17/2020,06/16/2021,Not captured,Not captured,863949,020,00072,ARS-02-0057764,Beacon America,Not captured,Not captured,Not captured,,,,Selvamuthiah,Vasanthiselva,,05/28/1959,female,Not captured,Not captured,Not captured,Not captured,Not captured,Not captured,Not captured,Not captured,Not captured,Not captured,Not captured,Not captured,Not captured,Swedha Selvamuthiah,Spouse,Not captured,Not captured,Not captured,Not captured,B-90 3RD CIRCULAR ROAD JAWAHAR NAGAR,,CHENNAI,TN,600082,+1-9172919975,,Not captured,Not captured,naren.fiero@gmail.com,Not captured,802051313,,Not captured,Not captured,Not captured,Not captured,Not captured,Not captured,
Not captured,Not captured,12/17/2020,06/16/2021,Not captured,Not captured,863949,020,00072,ARS-02-0057763,Beacon America,Not captured,Not captured,Not captured,Passport(K7891374),,,Kuttalingam,Selvamuthiah,,07/06/1957,male,Not captured,Not captured,Not captured,Not captured,Not captured,Not captured,Not captured,Not captured,Not captured,Not captured,Not captured,Not captured,Not captured,Swedha Selvamuthiah,,Not captured,Not captured,Not captured,Not captured,B-90 3RD CIRCULAR ROAD JAWAHAR NAGAR,,CHENNAI,TN,600082,+1-9172919975,,Not captured,Not captured,naren.fiero@gmail.com,Not captured,802051312,,Not captured,Not captured,Not captured,Not captured,Not captured,Not captured,
Not captured,Not captured,12/15/2020,11/25/2021,Not captured,Not captured,863949,020,00072,ARS-02-0057724,Beacon America,Not captured,Not captured,Not captured,Passport(G27389774),,,Olguin Torres,Juan,,01/30/1979,male,Not captured,Not captured,Not captured,Not captured,Not captured,Not captured,Not captured,Not captured,Not captured,Not captured,Not captured,Not captured,Not captured,Maria Olguin,,Not captured,Not captured,Not captured,Not captured,Calle Abasolo Norte #5,,Loma De La Esperanza,Municipio de Abasolo Guanajuato,36980,+1-4799578041,,Not captured,Not captured,olguin559@gmail.com,Not captured,802051267,,Not captured,Not captured,Not captured,Not captured,Not captured,Not captured,
Not captured,Not captured,12/15/2020,01/13/2021,Not captured,Not captured,863949,020,00072,ARS-01-0057718,Beacon International,Not captured,Not captured,Not captured,,,,Shenishn,Tasnem faisal Mostafa ,,11/21/1990,female,Not captured,Not captured,Not captured,Not captured,Not captured,Not captured,Not captured,Not captured,Not captured,Not captured,Not captured,Not captured,Not captured,,,Not captured,Not captured,Not captured,Not captured,alrahma complex,,djibouti,Djibouti,0192,591233714,,Not captured,Not captured,momowork99@gmail.com,Not captured,802051252,,Not captured,Not captured,Not captured,Not captured,Not captured,Not captured,
Not captured,Not captured,12/17/2020,12/30/2020,Not captured,Not captured,863949,020,00072,ARS-01-0057636,Beacon International,Not captured,Not captured,Not captured,,,,Coronel Diaz,Ender Jose,,11/11/1982,male,Not captured,Not captured,Not captured,Not captured,Not captured,Not captured,Not captured,Not captured,Not captured,Not captured,Not captured,Not captured,Not captured,Gregoria Diaz,Mother,Not captured,Not captured,Not captured,Not captured,pobox 15151,,PETION-VILLE,Ouest,6140,50937419009,22285966,Not captured,Not captured,globalfollowupmail@gmail.com,Not captured,802051143,,Not captured,Not captured,Not captured,Not captured,Not captured,Not captured,
Not captured,Not captured,12/18/2020,12/28/2020,Not captured,Not captured,863949,020,00072,ARS-01-0057566,Beacon International,Not captured,Not captured,Not captured,Passport(654921853),,,Bell,Generett Jamal,,04/12/1997,male,Not captured,Not captured,Not captured,Not captured,Not captured,Not captured,Not captured,Not captured,Not captured,Not captured,Not captured,Not captured,Not captured,Alice Juillard,,Not captured,Not captured,Not captured,Not captured,3253 Ivanhoe Street Unit 1,,Baton Rouge,LA,70802,+1-2253685384,,Not captured,Not captured,generett.bell@gmail.com,Not captured,802051063,,Not captured,Not captured,Not captured,Not captured,Not captured,Not captured,
Not captured,Not captured,12/15/2020,04/14/2021,Not captured,Not captured,863949,020,00072,ARS-01-0057136,Beacon International,Not captured,Not captured,Not captured,Passport(488193227),,,swanson,michael joseph,,01/09/1973,male,Not captured,Not captured,Not captured,Not captured,Not captured,Not captured,Not captured,Not captured,Not captured,Not captured,Not captured,Not captured,Not captured,jennifer drew,,Not captured,Not captured,Not captured,Not captured,po box 178,,truckee,CA,96160,+1-5303863994,,Not captured,Not captured,m.swanson@mac.com,Not captured,802050182,,Not captured,Not captured,Not captured,Not captured,Not captured,Not captured,
Not captured,Not captured,12/29/2020,12/30/2020,Not captured,Not captured,863949,020,00072,BG001030-23-47eda0b6,International Assurance,Not captured,Not captured,Not captured,-,-,,Hereid,Becky,,11/13/1960,female,Not captured,Not captured,Not captured,Not captured,Not captured,Not captured,Not captured,Not captured,Not captured,Not captured,Not captured,Not captured,Not captured,,,Not captured,Not captured,Not captured,Not captured,14407 Island Point Drive,,El Paso,Texas,79938,9152622884,,Not captured,Not captured,bdion@casasporcristo.org,Not captured,802051533,,Not captured,Not captured,Not captured,Not captured,Not captured,Not captured,
Not captured,Not captured,12/29/2020,12/30/2020,Not captured,Not captured,863949,020,00072,BG001030-23-47eda0b6,International Assurance,Not captured,Not captured,Not captured,-,-,,Douglas,Tera,,8/6/1992,female,Not captured,Not captured,Not captured,Not captured,Not captured,Not captured,Not captured,Not captured,Not captured,Not captured,Not captured,Not captured,Not captured,,,Not captured,Not captured,Not captured,Not captured,14407 Island Point Drive,,El Paso,Texas,79938,9152622884,,Not captured,Not captured,bdion@casasporcristo.org,Not captured,802051534,,Not captured,Not captured,Not captured,Not captured,Not captured,Not captured,
Not captured,Not captured,12/29/2020,12/30/2020,Not captured,Not captured,863949,020,00072,BG001030-23-47eda0b6,International Assurance,Not captured,Not captured,Not captured,-,-,,Douglas,John,,2/26/1993,male,Not captured,Not captured,Not captured,Not captured,Not captured,Not captured,Not captured,Not captured,Not captured,Not captured,Not captured,Not captured,Not captured,,,Not captured,Not captured,Not captured,Not captured,14407 Island Point Drive,,El Paso,Texas,79938,9152622884,,Not captured,Not captured,bdion@casasporcristo.org,Not captured,802051535,,Not captured,Not captured,Not captured,Not captured,Not captured,Not captured,
Not captured,Not captured,01/02/2021,01/05/2021,Not captured,Not captured,863949,020,00072,BG001030-23-45adb3b8,International Assurance,Not captured,Not captured,Not captured,-,-,,Henager,Cameron,A,01/19/1999,male,Not captured,Not captured,Not captured,Not captured,Not captured,Not captured,Not captured,Not captured,Not captured,Not captured,Not captured,Not captured,Not captured,,,Not captured,Not captured,Not captured,Not captured,3549 Carnes Avenue,,Memphis,Tennessee,38111,9016922800,,Not captured,Not captured,chenager@memphis.edu,Not captured,802051523,,Not captured,Not captured,Not captured,Not captured,Not captured,Not captured,
Not captured,Not captured,12/28/2020,12/29/2020,Not captured,Not captured,863949,020,00072,BG001030-23-117248d9,International Assurance,Not captured,Not captured,Not captured,-,-,,Richison,Mark,,7/28/1960,male,Not captured,Not captured,Not captured,Not captured,Not captured,Not captured,Not captured,Not captured,Not captured,Not captured,Not captured,Not captured,Not captured,,,Not captured,Not captured,Not captured,Not captured,PO Box 971070,,El Paso,Texas,79997,9157780046,,Not captured,Not captured,questions@casasporcristo.org,Not captured,802051520,,Not captured,Not captured,Not captured,Not captured,Not captured,Not captured,