EE Transaction Type,Dependent Transaction Type,Effective Date,Expiry Date,EE Signature,EE Signature Date,Control,Suffix,Account,Plan Number,Plan Name,Claim Office,Network ID Number,Customer Code,EE SSN,Dependent SSN,Dependent Relationship,Last Name,First Name,Middle Initial,DOB,Gender,Ethnicity,PCP/PCD,PCP/PCD Current Patient,Provider Cap Office Number,COB,Dep Student Indicator,Dep OOA Indicator,EE Prior Coverage Indicator,EE Late Entrant,EE Language Indicator,Hire Date,Earnings,Earnings Frequency,Beneficiary (Last Name First Name MI),Beneficiary Relationship,Continuation of Coverage Expiration Date,Continuation of Coverage Event Date,Continuation of Coverage Length of Coverage,Work Location Zip Code,Street Address Line 1,Street Address Line 2,City,State,Zip Code,Home Phone Number,Work Phone Number,Accept Code,Evidence Code,EE Email Address,Communication Disability Code,EE Alternate ID,Dep Alternate ID,Old Control,Old Suffix,Old Account,New Control,New Suffix,New Account,
Not captured,Not captured,12/22/2020,01/01/2021,Not captured,Not captured,863949,020,00072,ARS-01-0057851,Beacon International,Not captured,Not captured,Not captured,,,,Montes,Ricardo,,02/06/1973,male,Not captured,Not captured,Not captured,Not captured,Not captured,Not captured,Not captured,Not captured,Not captured,Not captured,Not captured,Not captured,Not captured,,,Not captured,Not captured,Not captured,Not captured,305 W Drew St,,Houston,Texas,77006,,,Not captured,Not captured,ricardomontes@hotmail.com,Not captured,802051631,,Not captured,Not captured,Not captured,Not captured,Not captured,Not captured,
Not captured,Not captured,12/22/2020,01/07/2021,Not captured,Not captured,863949,020,00072,ARS-02-0057848,Beacon America,Not captured,Not captured,Not captured,,,,Alcibar Hernadez,Maria de la Luz,,06/03/1958,female,Not captured,Not captured,Not captured,Not captured,Not captured,Not captured,Not captured,Not captured,Not captured,Not captured,Not captured,Not captured,Not captured,Ma del Pilar Diez Alcibar,Spouse,Not captured,Not captured,Not captured,Not captured,Paseo San Gerardo 119B 2a Seccion,,Metepec,Estado de Mexico,52140,+1-2019369060,,Not captured,Not captured,pili_diez@hotmail.com,Not captured,802051625,,Not captured,Not captured,Not captured,Not captured,Not captured,Not captured,
Not captured,Not captured,12/22/2020,01/07/2021,Not captured,Not captured,863949,020,00072,ARS-02-0057847,Beacon America,Not captured,Not captured,Not captured,Passport(g32553645),,,Diez Cueli,Jose Manuel,,11/07/1956,male,Not captured,Not captured,Not captured,Not captured,Not captured,Not captured,Not captured,Not captured,Not captured,Not captured,Not captured,Not captured,Not captured,Ma del Pilar Diez Alcibar,,Not captured,Not captured,Not captured,Not captured,Paseo San Gerardo 119B 2a Seccion,,Metepec,Estado de Mexico,52140,+1-2019369060,,Not captured,Not captured,pili_diez@hotmail.com,Not captured,802051624,,Not captured,Not captured,Not captured,Not captured,Not captured,Not captured,
Not captured,Not captured,12/22/2020,01/21/2021,Not captured,Not captured,863949,020,00072,ARS-01-0057846,Beacon International,Not captured,Not captured,Not captured,,,,Cajayon,Dainiel Brian,C,06/04/2000,male,Not captured,Not captured,Not captured,Not captured,Not captured,Not captured,Not captured,Not captured,Not captured,Not captured,Not captured,Not captured,Not captured,,,Not captured,Not captured,Not captured,Not captured,B12 L11 Coffee Grove,,Lipa,,4200,,,Not captured,Not captured,dennis@emi-bh.com,Not captured,802051623,,Not captured,Not captured,Not captured,Not captured,Not captured,Not captured,
Not captured,Not captured,12/22/2020,12/26/2020,Not captured,Not captured,863949,020,00072,ARS-01-0057843,Beacon International,Not captured,Not captured,Not captured,,,,Bodnar,Mariya,,06/12/1991,female,Not captured,Not captured,Not captured,Not captured,Not captured,Not captured,Not captured,Not captured,Not captured,Not captured,Not captured,Not captured,Not captured,,,Not captured,Not captured,Not captured,Not captured,1222 West Madison St,,CHICAGO,Illinois,60607,,,Not captured,Not captured,michael.schonberger@gmail.com,Not captured,802051620,,Not captured,Not captured,Not captured,Not captured,Not captured,Not captured,
Not captured,Not captured,12/22/2020,12/26/2020,Not captured,Not captured,863949,020,00072,ARS-01-0057842,Beacon International,Not captured,Not captured,Not captured,,,,Schonberger,Michael,,08/10/1990,male,Not captured,Not captured,Not captured,Not captured,Not captured,Not captured,Not captured,Not captured,Not captured,Not captured,Not captured,Not captured,Not captured,,,Not captured,Not captured,Not captured,Not captured,1222 West Madison St,,CHICAGO,Illinois,60607,,,Not captured,Not captured,michael.schonberger@gmail.com,Not captured,802051619,,Not captured,Not captured,Not captured,Not captured,Not captured,Not captured,
Not captured,Not captured,12/22/2020,06/22/2021,Not captured,Not captured,863949,020,00072,ARS-02-0057841,Beacon America,Not captured,Not captured,Not captured,,,,Tanneeru,Anantha Lakshmi,,06/15/1957,female,Not captured,Not captured,Not captured,Not captured,Not captured,Not captured,Not captured,Not captured,Not captured,Not captured,Not captured,Not captured,Not captured,Swathi Tanneeru,Spouse,Not captured,Not captured,Not captured,Not captured,5-114/1 Gollala Veedhi,,Vemagiri,AP,533125,+1-2019366117,+1-2019325025,Not captured,Not captured,msgpavan@live.com,Not captured,802051618,,Not captured,Not captured,Not captured,Not captured,Not captured,Not captured,
Not captured,Not captured,12/22/2020,06/22/2021,Not captured,Not captured,863949,020,00072,ARS-02-0057840,Beacon America,Not captured,Not captured,Not captured,Passport(N3781783),,,Tanneeru,Partha Sarathi,,08/29/1953,male,Not captured,Not captured,Not captured,Not captured,Not captured,Not captured,Not captured,Not captured,Not captured,Not captured,Not captured,Not captured,Not captured,Swathi Tanneeru,,Not captured,Not captured,Not captured,Not captured,5-114/1 Gollala Veedhi,,Vemagiri,AP,533125,+1-2019366117,+1-2019325025,Not captured,Not captured,msgpavan@live.com,Not captured,802051617,,Not captured,Not captured,Not captured,Not captured,Not captured,Not captured,
Not captured,Not captured,12/21/2020,02/03/2021,Not captured,Not captured,863949,020,00072,ARS-02-0057839,Beacon America,Not captured,Not captured,Not captured,,,,Ponnala,Manjula,,04/07/1975,female,Not captured,Not captured,Not captured,Not captured,Not captured,Not captured,Not captured,Not captured,Not captured,Not captured,Not captured,Not captured,Not captured,Pranoosha Ponnala,Spouse,Not captured,Not captured,Not captured,Not captured,H.No 3-6-217/A Near Check Post ,,Secunderabad,TG,500026,+1-4256289023,+1-4256289023,Not captured,Not captured,pranoosha.ponnala15@gmail.com,Not captured,802051616,,Not captured,Not captured,Not captured,Not captured,Not captured,Not captured,
Not captured,Not captured,12/21/2020,02/03/2021,Not captured,Not captured,863949,020,00072,ARS-02-0057838,Beacon America,Not captured,Not captured,Not captured,Passport(M5006349),,,Ponnala,Dayanand,,07/08/1967,male,Not captured,Not captured,Not captured,Not captured,Not captured,Not captured,Not captured,Not captured,Not captured,Not captured,Not captured,Not captured,Not captured,Pranoosha Ponnala,,Not captured,Not captured,Not captured,Not captured,H.No 3-6-217/A Near Check Post ,,Secunderabad,TG,500026,+1-4256289023,+1-4256289023,Not captured,Not captured,pranoosha.ponnala15@gmail.com,Not captured,802051615,,Not captured,Not captured,Not captured,Not captured,Not captured,Not captured,
Not captured,Not captured,12/21/2020,01/21/2021,Not captured,Not captured,863949,020,00072,ARS-02-0057837,Beacon America,Not captured,Not captured,Not captured,,,,Mandava,Lalitha,,09/01/1962,female,Not captured,Not captured,Not captured,Not captured,Not captured,Not captured,Not captured,Not captured,Not captured,Not captured,Not captured,Not captured,Not captured,Vineeta Mandava,Spouse,Not captured,Not captured,Not captured,Not captured,FLAT NO 4 1ST FLR DHARANI APTS,,VIJAYAWADA,AP,520008,+1-8603784495,,Not captured,Not captured,ashok.chadalavada@gmail.com,Not captured,802051591,,Not captured,Not captured,Not captured,Not captured,Not captured,Not captured,
Not captured,Not captured,12/21/2020,01/21/2021,Not captured,Not captured,863949,020,00072,ARS-02-0057836,Beacon America,Not captured,Not captured,Not captured,Passport(R7889201),,,Mandava,Ramesh babu,,08/05/1960,male,Not captured,Not captured,Not captured,Not captured,Not captured,Not captured,Not captured,Not captured,Not captured,Not captured,Not captured,Not captured,Not captured,Vineeta Mandava,,Not captured,Not captured,Not captured,Not captured,FLAT NO 4 1ST FLR DHARANI APTS,,VIJAYAWADA,AP,520008,+1-8603784495,,Not captured,Not captured,ashok.chadalavada@gmail.com,Not captured,802051590,,Not captured,Not captured,Not captured,Not captured,Not captured,Not captured,
Not captured,Not captured,12/21/2020,02/21/2021,Not captured,Not captured,863949,020,00072,ARS-01-0057835,Beacon International,Not captured,Not captured,Not captured,,,,Rath,Andrew,D,05/10/1991,male,Not captured,Not captured,Not captured,Not captured,Not captured,Not captured,Not captured,Not captured,Not captured,Not captured,Not captured,Not captured,Not captured,,,Not captured,Not captured,Not captured,Not captured,4018 drifting sand trail,,Desrin,Florida,32541,,,Not captured,Not captured,andrew.david.rath@gmail.com,Not captured,802051589,,Not captured,Not captured,Not captured,Not captured,Not captured,Not captured,
Not captured,Not captured,12/21/2020,01/06/2021,Not captured,Not captured,863949,020,00072,ARS-01-0057831,Beacon International,Not captured,Not captured,Not captured,Passport(U1870915),,,Berger,Michael,,07/30/1992,male,Not captured,Not captured,Not captured,Not captured,Not captured,Not captured,Not captured,Not captured,Not captured,Not captured,Not captured,Not captured,Not captured,Elena Berger,,Not captured,Not captured,Not captured,Not captured,Josefstrasse 98,,Sankt Poelten,Lower Austria,3100,+43-6702023600,,Not captured,Not captured,michael_berger2007@yahoo.de,Not captured,802051563,,Not captured,Not captured,Not captured,Not captured,Not captured,Not captured,
Not captured,Not captured,12/21/2020,02/10/2021,Not captured,Not captured,863949,020,00072,ARS-02-0057830,Beacon America,Not captured,Not captured,Not captured,Passport(J9857555),,,Natarajan,Ramachandran,,03/12/1949,male,Not captured,Not captured,Not captured,Not captured,Not captured,Not captured,Not captured,Not captured,Not captured,Not captured,Not captured,Not captured,Not captured,Visalakshi Ramachandran,Daughter,Not captured,Not captured,Not captured,Not captured,23691 NE 15th Pl,,Sammamish,WA,98074,4258984827,,Not captured,Not captured,madhuprakash@gmail.com,Not captured,802051562,,Not captured,Not captured,Not captured,Not captured,Not captured,Not captured,
Not captured,Not captured,12/21/2020,02/10/2021,Not captured,Not captured,863949,020,00072,ARS-02-0057829,Beacon America,Not captured,Not captured,Not captured,Passport(R9015314),,,Ramachandran,Saraswathy,,10/06/1954,female,Not captured,Not captured,Not captured,Not captured,Not captured,Not captured,Not captured,Not captured,Not captured,Not captured,Not captured,Not captured,Not captured,Visalakshi Ramachandran,Daughter,Not captured,Not captured,Not captured,Not captured,23691 NE 15th Pl,,Sammamish,WA,98074,4258984827,,Not captured,Not captured,madhuprakash@gmail.com,Not captured,802051561,,Not captured,Not captured,Not captured,Not captured,Not captured,Not captured,
Not captured,Not captured,12/20/2020,12/24/2020,Not captured,Not captured,863949,020,00072,ARS-01-0057828,Beacon International,Not captured,Not captured,Not captured,,,,rokeach,Yesucher,,06/17/1987,male,Not captured,Not captured,Not captured,Not captured,Not captured,Not captured,Not captured,Not captured,Not captured,Not captured,Not captured,Not captured,Not captured,,,Not captured,Not captured,Not captured,Not captured,5912 19 ave.,,Brooklyn,New York,11204,,,Not captured,Not captured,ybincr@gmail.com,Not captured,802051560,,Not captured,Not captured,Not captured,Not captured,Not captured,Not captured,
Not captured,Not captured,12/21/2020,01/30/2021,Not captured,Not captured,863949,020,00072,ARS-01-0057827,Beacon International,Not captured,Not captured,Not captured,Passport(563505959),,,Burke,Paul,E,07/02/1968,male,Not captured,Not captured,Not captured,Not captured,Not captured,Not captured,Not captured,Not captured,Not captured,Not captured,Not captured,Not captured,Not captured,Maria Carnevale,Wife,Not captured,Not captured,Not captured,Not captured,6414 Monteverde Ln,,Citrus Heights,California,95621,5106462096,5106462096,Not captured,Not captured,PaulBurkeworks@gmail.com,Not captured,802051559,,Not captured,Not captured,Not captured,Not captured,Not captured,Not captured,
Not captured,Not captured,12/20/2020,01/20/2021,Not captured,Not captured,863949,020,00072,ARS-02-0057826,Beacon America,Not captured,Not captured,Not captured,Passport(133007394),,,CUAHONTE,MARIA ANDREINA,,04/18/2001,female,Not captured,Not captured,Not captured,Not captured,Not captured,Not captured,Not captured,Not captured,Not captured,Not captured,Not captured,Not captured,Not captured,Roberto Cuahonte,Padre,Not captured,Not captured,Not captured,Not captured,Urb. Palma real Conj. Lomas del Sol Casa # 14 Sector tipuro,,MATURIN,Monagas,6201,584143942121,584143942121,Not captured,Not captured,rxcuahonte@hotmail.com,Not captured,802051558,,Not captured,Not captured,Not captured,Not captured,Not captured,Not captured,
Not captured,Not captured,12/19/2020,01/11/2021,Not captured,Not captured,863949,020,00072,ARS-01-0057825,Beacon International,Not captured,Not captured,Not captured,,,,Ruiz,Sophie,,03/03/2009,female,Not captured,Not captured,Not captured,Not captured,Not captured,Not captured,Not captured,Not captured,Not captured,Not captured,Not captured,Not captured,Not captured,Yonni Ruiz,Dependent,Not captured,Not captured,Not captured,Not captured,18 Beekman St,,Bloomfield,NJ,07003,+1-6462942931,+1-6462942396,Not captured,Not captured,javiericruiz@gmail.com,Not captured,802051557,,Not captured,Not captured,Not captured,Not captured,Not captured,Not captured,
Not captured,Not captured,12/19/2020,01/11/2021,Not captured,Not captured,863949,020,00072,ARS-01-0057824,Beacon International,Not captured,Not captured,Not captured,Passport(513652965),,,Ruiz,Luz,,10/30/1977,male,Not captured,Not captured,Not captured,Not captured,Not captured,Not captured,Not captured,Not captured,Not captured,Not captured,Not captured,Not captured,Not captured,Yonni Ruiz,,Not captured,Not captured,Not captured,Not captured,18 Beekman St,,Bloomfield,NJ,07003,+1-6462942931,+1-6462942396,Not captured,Not captured,javiericruiz@gmail.com,Not captured,802051556,,Not captured,Not captured,Not captured,Not captured,Not captured,Not captured,
Not captured,Not captured,12/22/2020,01/03/2021,Not captured,Not captured,863949,020,00072,OVI-28-0057823,OverseasCare Visitors Insurance Plan,Not captured,Not captured,Not captured,Passport(529146595),,,port,carly,h,06/09/1995,female,Not captured,Not captured,Not captured,Not captured,Not captured,Not captured,Not captured,Not captured,Not captured,Not captured,Not captured,Not captured,Not captured,,,Not captured,Not captured,Not captured,Not captured,723 Palisades Beach Rd,,santa monica,California,90402,8149315633,,Not captured,Not captured,portcarly@gmail.com,Not captured,802051555,,Not captured,Not captured,Not captured,Not captured,Not captured,Not captured,
Not captured,Not captured,12/20/2020,01/06/2021,Not captured,Not captured,863949,020,00072,ARS-01-0057822,Beacon International,Not captured,Not captured,Not captured,,,,Tonanez,Lucas,M,06/23/2004,male,Not captured,Not captured,Not captured,Not captured,Not captured,Not captured,Not captured,Not captured,Not captured,Not captured,Not captured,Not captured,Not captured,,,Not captured,Not captured,Not captured,Not captured,8650 sw 125 terr,,Miami,Florida,33156,,,Not captured,Not captured,atonanez@yahoo.com,Not captured,802051554,,Not captured,Not captured,Not captured,Not captured,Not captured,Not captured,
Not captured,Not captured,12/20/2020,01/06/2021,Not captured,Not captured,863949,020,00072,ARS-01-0057821,Beacon International,Not captured,Not captured,Not captured,,,,Toñanez,Estefania,M,01/10/2002,female,Not captured,Not captured,Not captured,Not captured,Not captured,Not captured,Not captured,Not captured,Not captured,Not captured,Not captured,Not captured,Not captured,,,Not captured,Not captured,Not captured,Not captured,8650 sw 125 terr,,Miami,Florida,33156,,,Not captured,Not captured,atonanez@yahoo.com,Not captured,802051553,,Not captured,Not captured,Not captured,Not captured,Not captured,Not captured,
Not captured,Not captured,12/20/2020,06/13/2021,Not captured,Not captured,863949,020,00072,OVI-41-0057820,Overseas Visitors Insurance Plan A,Not captured,Not captured,Not captured,,,,Jayaraman,Dhanalakshmi,,09/16/1953,female,Not captured,Not captured,Not captured,Not captured,Not captured,Not captured,Not captured,Not captured,Not captured,Not captured,Not captured,Not captured,Not captured,Udayashankar Jayaraman,Son,Not captured,Not captured,Not captured,Not captured,1806 Pummelo Dr,,Redlands,California,92374,9704020097,,Not captured,Not captured,ravishankar.jayaraman@gmail.com,Not captured,802051552,,Not captured,Not captured,Not captured,Not captured,Not captured,Not captured,
Not captured,Not captured,12/20/2020,06/13/2021,Not captured,Not captured,863949,020,00072,OVI-41-0057819,Overseas Visitors Insurance Plan A,Not captured,Not captured,Not captured,,,,Mandalappu Krishaswamy,Jayaraman,,03/09/1948,male,Not captured,Not captured,Not captured,Not captured,Not captured,Not captured,Not captured,Not captured,Not captured,Not captured,Not captured,Not captured,Not captured,Udayashankar Jayaraman,Son,Not captured,Not captured,Not captured,Not captured,1806 Pummelo Dr,,Redlands,California,92374,9704020097,,Not captured,Not captured,ravishankar.jayaraman@gmail.com,Not captured,802051551,,Not captured,Not captured,Not captured,Not captured,Not captured,Not captured,
Not captured,Not captured,12/18/2020,12/23/2020,Not captured,Not captured,863949,020,00072,ARS-02-0057818,Beacon America,Not captured,Not captured,Not captured,,,,Cappelletti,Stefania,,05/09/1967,female,Not captured,Not captured,Not captured,Not captured,Not captured,Not captured,Not captured,Not captured,Not captured,Not captured,Not captured,Not captured,Not captured,,,Not captured,Not captured,Not captured,Not captured,Calle 10 Norte Mza 28 lote 7/8 entre 1 y 5 avenida,,PLAYA DEL CARMEN Q.ROO,,77710,,,Not captured,Not captured,jeeval7@hotmail.com,Not captured,802051550,,Not captured,Not captured,Not captured,Not captured,Not captured,Not captured,
Not captured,Not captured,12/19/2020,01/09/2021,Not captured,Not captured,863949,020,00072,ARS-01-0057817,Beacon International,Not captured,Not captured,Not captured,Passport(641490721),,,Hamada Minar,Kai,,08/21/2001,male,Not captured,Not captured,Not captured,Not captured,Not captured,Not captured,Not captured,Not captured,Not captured,Not captured,Not captured,Not captured,Not captured,Miwa Hamada,Mother,Not captured,Not captured,Not captured,Not captured,2115 Aulii st.,,Honolulu,Hawaii,96817,8084892865,,Not captured,Not captured,kailukahamada@hotmail.co.jp,Not captured,802051549,,Not captured,Not captured,Not captured,Not captured,Not captured,Not captured,
Not captured,Not captured,12/21/2020,12/29/2020,Not captured,Not captured,863949,020,00072,ARS-02-0057816,Beacon America,Not captured,Not captured,Not captured,,,,Langner,Reuven,M,04/14/1971,male,Not captured,Not captured,Not captured,Not captured,Not captured,Not captured,Not captured,Not captured,Not captured,Not captured,Not captured,Not captured,Not captured,,,Not captured,Not captured,Not captured,Not captured,Tcheles Mordechai 19a/1,,Jerusalem,,9439649,,,Not captured,Not captured,rllangner@gmail.com,Not captured,802051548,,Not captured,Not captured,Not captured,Not captured,Not captured,Not captured,
Not captured,Not captured,12/22/2020,01/17/2021,Not captured,Not captured,863949,020,00072,ARS-01-0057815,Beacon International,Not captured,Not captured,Not captured,Passport(B0700009),,,Hessou,Comlan Martin Berthelot,,12/16/1982,male,Not captured,Not captured,Not captured,Not captured,Not captured,Not captured,Not captured,Not captured,Not captured,Not captured,Not captured,Not captured,Not captured,Michael Katzen,,Not captured,Not captured,Not captured,Not captured,Fidrjrosse C/1710,,Cotonou,Cotonou,1710,+90-5349822987,+90-5350404480,Not captured,Not captured,alpaykubra23@gmail.com,Not captured,802051547,,Not captured,Not captured,Not captured,Not captured,Not captured,Not captured,
Not captured,Not captured,12/22/2020,01/17/2021,Not captured,Not captured,863949,020,00072,ARS-01-0057814,Beacon International,Not captured,Not captured,Not captured,Passport(B0751637),,,Ahoulou,Severin,,10/10/1988,male,Not captured,Not captured,Not captured,Not captured,Not captured,Not captured,Not captured,Not captured,Not captured,Not captured,Not captured,Not captured,Not captured,Michael Katzen,,Not captured,Not captured,Not captured,Not captured,C/sb Agla M Gantin,,Cotonou,Cotonou,10235,+90-5349822987,+90-5350404480,Not captured,Not captured,alpaykubra23@gmail.com,Not captured,802051546,,Not captured,Not captured,Not captured,Not captured,Not captured,Not captured,
Not captured,Not captured,12/17/2020,06/16/2021,Not captured,Not captured,863949,020,00072,ARS-02-0057812,Beacon America,Not captured,Not captured,Not captured,,,,Akula,Havish,,10/30/2010,male,Not captured,Not captured,Not captured,Not captured,Not captured,Not captured,Not captured,Not captured,Not captured,Not captured,Not captured,Not captured,Not captured,Neetha,Dependent,Not captured,Not captured,Not captured,Not captured,2-2-1074/9 Bagh Amberpet,,Hyderabad,TG,500013,+1-3199617955,,Not captured,Not captured,arunakula@gmail.com,Not captured,802051544,,Not captured,Not captured,Not captured,Not captured,Not captured,Not captured,
Not captured,Not captured,12/17/2020,06/16/2021,Not captured,Not captured,863949,020,00072,ARS-02-0057811,Beacon America,Not captured,Not captured,Not captured,Passport(S6441969),,,Yerrum,Neetha,,11/06/1983,female,Not captured,Not captured,Not captured,Not captured,Not captured,Not captured,Not captured,Not captured,Not captured,Not captured,Not captured,Not captured,Not captured,Neetha,,Not captured,Not captured,Not captured,Not captured,2-2-1074/9 Bagh Amberpet,,Hyderabad,TG,500013,+1-3199617955,,Not captured,Not captured,arunakula@gmail.com,Not captured,802051543,,Not captured,Not captured,Not captured,Not captured,Not captured,Not captured,
Not captured,Not captured,12/17/2020,01/11/2021,Not captured,Not captured,863949,020,00072,ARS-01-0057810,Beacon International,Not captured,Not captured,Not captured,Passport(561587523),,,Wisbauer,Brian James,,06/20/1976,male,Not captured,Not captured,Not captured,Not captured,Not captured,Not captured,Not captured,Not captured,Not captured,Not captured,Not captured,Not captured,Not captured,Patrick Wisbauer,,Not captured,Not captured,Not captured,Not captured,206 E. Center Avenue,,Maple Shade,NJ,08052,+1-340-227-7072,,Not captured,Not captured,brianwisbauer7@gmail.com,Not captured,802051542,,Not captured,Not captured,Not captured,Not captured,Not captured,Not captured,