EE Transaction Type,Dependent Transaction Type,Effective Date,Expiry Date,EE Signature,EE Signature Date,Control,Suffix,Account,Plan Number,Plan Name,Claim Office,Network ID Number,Customer Code,EE SSN,Dependent SSN,Dependent Relationship,Last Name,First Name,Middle Initial,DOB,Gender,Ethnicity,PCP/PCD,PCP/PCD Current Patient,Provider Cap Office Number,COB,Dep Student Indicator,Dep OOA Indicator,EE Prior Coverage Indicator,EE Late Entrant,EE Language Indicator,Hire Date,Earnings,Earnings Frequency,Beneficiary (Last Name First Name MI),Beneficiary Relationship,Continuation of Coverage Expiration Date,Continuation of Coverage Event Date,Continuation of Coverage Length of Coverage,Work Location Zip Code,Street Address Line 1,Street Address Line 2,City,State,Zip Code,Home Phone Number,Work Phone Number,Accept Code,Evidence Code,EE Email Address,Communication Disability Code,EE Alternate ID,Dep Alternate ID,Old Control,Old Suffix,Old Account,New Control,New Suffix,New Account,
Not captured,Not captured,12/14/2020,04/14/2021,Not captured,Not captured,863949,020,00072,ARS-02-0057779,Beacon America,Not captured,Not captured,Not captured,Passport(AL570608),,,Markoulakis,Thalia,,02/23/1994,female,Not captured,Not captured,Not captured,Not captured,Not captured,Not captured,Not captured,Not captured,Not captured,Not captured,Not captured,Not captured,Not captured,Eugenia Polychronopoulos,,Not captured,Not captured,Not captured,Not captured,4128 Notre-Dame blvd,,Laval,QC,H7W1T1,+1-2246225773,+1-2246225773,Not captured,Not captured,markoulakis.t@gmail.com,Not captured,802051460,,Not captured,Not captured,Not captured,Not captured,Not captured,Not captured,
Not captured,Not captured,12/14/2020,12/18/2020,Not captured,Not captured,863949,020,00072,ARS-02-0057777,Beacon America,Not captured,Not captured,Not captured,,,,Anil,Anila,,09/01/1958,female,Not captured,Not captured,Not captured,Not captured,Not captured,Not captured,Not captured,Not captured,Not captured,Not captured,Not captured,Not captured,Not captured,Amrutha Anil,Spouse,Not captured,Not captured,Not captured,Not captured,Sushamalayam,,Kottayam,KL,686017,+1-9714705172,,Not captured,Not captured,amruthaanil@hotmail.com,Not captured,802051458,,Not captured,Not captured,Not captured,Not captured,Not captured,Not captured,
Not captured,Not captured,12/14/2020,12/18/2020,Not captured,Not captured,863949,020,00072,ARS-02-0057776,Beacon America,Not captured,Not captured,Not captured,Passport(K7231675),,,Damodharan,Anil Kumar,,11/24/1957,male,Not captured,Not captured,Not captured,Not captured,Not captured,Not captured,Not captured,Not captured,Not captured,Not captured,Not captured,Not captured,Not captured,Amrutha Anil,,Not captured,Not captured,Not captured,Not captured,Sushamalayam,,Kottayam,KL,686017,+1-9714705172,,Not captured,Not captured,amruthaanil@hotmail.com,Not captured,802051457,,Not captured,Not captured,Not captured,Not captured,Not captured,Not captured,
Not captured,Not captured,12/14/2020,12/12/2021,Not captured,Not captured,863949,020,00072,ARS-38-0057775,Beacon Student Choice,Not captured,Not captured,Not captured,Passport(141142069),,,Rivas Molina,Maria,Gabriela,12/30/2001,female,Not captured,Not captured,Not captured,Not captured,Not captured,Not captured,Not captured,Not captured,Not captured,Not captured,Not captured,Not captured,Not captured,Maria Andreina Molina,Mother,Not captured,Not captured,Not captured,Not captured,Conjunto Residencial Paraiso Villas #. 3,,Barinas,Barinas,0000,7865541076,,Not captured,Not captured,gaby10rivas@gmail.com,Not captured,802051456,,Not captured,Not captured,Not captured,Not captured,Not captured,Not captured,
Not captured,Not captured,12/14/2020,12/27/2020,Not captured,Not captured,863949,020,00072,ARS-02-0057774,Beacon America,Not captured,Not captured,Not captured,Passport(L3744684),,,Narendra Menon,Rema,,05/20/1960,female,Not captured,Not captured,Not captured,Not captured,Not captured,Not captured,Not captured,Not captured,Not captured,Not captured,Not captured,Not captured,Not captured,Megha N Menon,,Not captured,Not captured,Not captured,Not captured,Manas Nivas Puthenkottakkakom,,Mavelikkara,KL,690105,+1-6177759429,,Not captured,Not captured,remamenon11@gmail.com,Not captured,802051455,,Not captured,Not captured,Not captured,Not captured,Not captured,Not captured,
Not captured,Not captured,12/14/2020,12/19/2020,Not captured,Not captured,863949,020,00072,ARS-01-0057773,Beacon International,Not captured,Not captured,Not captured,,,,Toomer,Tyneiqua,L,12/15/1991,female,Not captured,Not captured,Not captured,Not captured,Not captured,Not captured,Not captured,Not captured,Not captured,Not captured,Not captured,Not captured,Not captured,,,Not captured,Not captured,Not captured,Not captured,17102 Plaistow Ct,,Houston,Texas,77084,,,Not captured,Not captured,toomer.tyneiqua@gmail.com,Not captured,802051454,,Not captured,Not captured,Not captured,Not captured,Not captured,Not captured,
Not captured,Not captured,12/14/2020,01/03/2021,Not captured,Not captured,863949,020,00072,ARS-01-0057772,Beacon International,Not captured,Not captured,Not captured,,,,Dadayan,Karine,,01/02/1975,female,Not captured,Not captured,Not captured,Not captured,Not captured,Not captured,Not captured,Not captured,Not captured,Not captured,Not captured,Not captured,Not captured,,,Not captured,Not captured,Not captured,Not captured,36725 Greenspring St,,Farmington Hills,,48331,,,Not captured,Not captured,vadim74@gmail.com,Not captured,802051453,,Not captured,Not captured,Not captured,Not captured,Not captured,Not captured,
Not captured,Not captured,12/14/2020,01/03/2021,Not captured,Not captured,863949,020,00072,ARS-01-0057771,Beacon International,Not captured,Not captured,Not captured,,,,Bagdasaryan,Vadim,,12/09/1974,male,Not captured,Not captured,Not captured,Not captured,Not captured,Not captured,Not captured,Not captured,Not captured,Not captured,Not captured,Not captured,Not captured,,,Not captured,Not captured,Not captured,Not captured,36725 Greenspring St,,Farmington Hills,,48331,,,Not captured,Not captured,vadim74@gmail.com,Not captured,802051452,,Not captured,Not captured,Not captured,Not captured,Not captured,Not captured,
Not captured,Not captured,12/14/2020,12/18/2020,Not captured,Not captured,863949,020,00072,ARS-01-0057768,Beacon International,Not captured,Not captured,Not captured,,,,Farris,Derrick,,04/17/1990,male,Not captured,Not captured,Not captured,Not captured,Not captured,Not captured,Not captured,Not captured,Not captured,Not captured,Not captured,Not captured,Not captured,,,Not captured,Not captured,Not captured,Not captured,15 evergreen drive,,Middleboro,Massachusetts,02346,,,Not captured,Not captured,fresende917@aol.com,Not captured,802051318,,Not captured,Not captured,Not captured,Not captured,Not captured,Not captured,
Not captured,Not captured,12/14/2020,12/18/2020,Not captured,Not captured,863949,020,00072,ARS-01-0057767,Beacon International,Not captured,Not captured,Not captured,,,,Resende,Francelina,,12/16/1990,female,Not captured,Not captured,Not captured,Not captured,Not captured,Not captured,Not captured,Not captured,Not captured,Not captured,Not captured,Not captured,Not captured,,,Not captured,Not captured,Not captured,Not captured,15 evergreen drive,,Middleboro,Massachusetts,02346,,,Not captured,Not captured,fresende917@aol.com,Not captured,802051317,,Not captured,Not captured,Not captured,Not captured,Not captured,Not captured,
Not captured,Not captured,12/13/2020,01/31/2021,Not captured,Not captured,863949,020,00072,ARS-01-0057766,Beacon International,Not captured,Not captured,Not captured,,,,Connors,Cheryl,K,03/08/1966,male,Not captured,Not captured,Not captured,Not captured,Not captured,Not captured,Not captured,Not captured,Not captured,Not captured,Not captured,Not captured,Not captured,,,Not captured,Not captured,Not captured,Not captured,1575 Standing Eagle Dr,,Prescott,Arizona,86301,4086915100,,Not captured,Not captured,voodoobaja@gmail.com,Not captured,802051315,,Not captured,Not captured,Not captured,Not captured,Not captured,Not captured,
Not captured,Not captured,12/13/2020,01/31/2021,Not captured,Not captured,863949,020,00072,ARS-01-0057765,Beacon International,Not captured,Not captured,Not captured,Passport(532371030),,,Connors,Brian,T,08/02/1954,male,Not captured,Not captured,Not captured,Not captured,Not captured,Not captured,Not captured,Not captured,Not captured,Not captured,Not captured,Not captured,Not captured,,,Not captured,Not captured,Not captured,Not captured,1575 Standing Eagle Dr,,Prescott,Arizona,86301,4086915100,,Not captured,Not captured,voodoobaja@gmail.com,Not captured,802051314,,Not captured,Not captured,Not captured,Not captured,Not captured,Not captured,
Not captured,Not captured,12/14/2020,01/15/2021,Not captured,Not captured,863949,020,00072,ARS-01-0057762,Beacon International,Not captured,Not captured,Not captured,Passport(T9688941),,,joseph,janvi amardeep,,12/28/2000,female,Not captured,Not captured,Not captured,Not captured,Not captured,Not captured,Not captured,Not captured,Not captured,Not captured,Not captured,Not captured,Not captured,deena nari mirchandani,,Not captured,Not captured,Not captured,Not captured,south mission bungalow,,jaipur,RJ,302001,+1-6478036868,,Not captured,Not captured,janvi2800@gmail.com,Not captured,802051311,,Not captured,Not captured,Not captured,Not captured,Not captured,Not captured,
Not captured,Not captured,12/13/2020,12/27/2020,Not captured,Not captured,863949,020,00072,ARS-01-0057759,Beacon International,Not captured,Not captured,Not captured,,,,salehi,nikita,,09/10/2014,male,Not captured,Not captured,Not captured,Not captured,Not captured,Not captured,Not captured,Not captured,Not captured,Not captured,Not captured,Not captured,Not captured,olga,Dependent,Not captured,Not captured,Not captured,Not captured,3020 NE 32nd ave #110,,fort lauderdale,FL,33308,+1-9542322500,+1-9542322500,Not captured,Not captured,jellis@edi.cc,Not captured,802051308,,Not captured,Not captured,Not captured,Not captured,Not captured,Not captured,
Not captured,Not captured,12/13/2020,12/27/2020,Not captured,Not captured,863949,020,00072,ARS-01-0057758,Beacon International,Not captured,Not captured,Not captured,,,,salehi,olga,,01/28/1984,female,Not captured,Not captured,Not captured,Not captured,Not captured,Not captured,Not captured,Not captured,Not captured,Not captured,Not captured,Not captured,Not captured,olga,Spouse,Not captured,Not captured,Not captured,Not captured,3020 NE 32nd ave #110,,fort lauderdale,FL,33308,+1-9542322500,+1-9542322500,Not captured,Not captured,jellis@edi.cc,Not captured,802051307,,Not captured,Not captured,Not captured,Not captured,Not captured,Not captured,
Not captured,Not captured,12/13/2020,12/27/2020,Not captured,Not captured,863949,020,00072,ARS-01-0057757,Beacon International,Not captured,Not captured,Not captured,Passport(563875422),,,ellis,James,,12/17/1956,male,Not captured,Not captured,Not captured,Not captured,Not captured,Not captured,Not captured,Not captured,Not captured,Not captured,Not captured,Not captured,Not captured,olga,,Not captured,Not captured,Not captured,Not captured,3020 NE 32nd ave #110,,fort lauderdale,FL,33308,+1-9542322500,+1-9542322500,Not captured,Not captured,jellis@edi.cc,Not captured,802051306,,Not captured,Not captured,Not captured,Not captured,Not captured,Not captured,
Not captured,Not captured,12/12/2020,12/28/2020,Not captured,Not captured,863949,020,00072,ARS-01-0057755,Beacon International,Not captured,Not captured,Not captured,Passport(530949773),,,Hess,Conrad,,01/18/1989,male,Not captured,Not captured,Not captured,Not captured,Not captured,Not captured,Not captured,Not captured,Not captured,Not captured,Not captured,Not captured,Not captured,David Alex Hess,,Not captured,Not captured,Not captured,Not captured,196 w 10th,,New york,NY,10014,+1-206 354 5747,+1-206 354 5747,Not captured,Not captured,conradhess321@gmail.com,Not captured,802051304,,Not captured,Not captured,Not captured,Not captured,Not captured,Not captured,
Not captured,Not captured,12/12/2020,12/23/2020,Not captured,Not captured,863949,020,00072,ARS-01-0057753,Beacon International,Not captured,Not captured,Not captured,,,,Kennemann,Benjamin,,01/18/2001,male,Not captured,Not captured,Not captured,Not captured,Not captured,Not captured,Not captured,Not captured,Not captured,Not captured,Not captured,Not captured,Not captured,,,Not captured,Not captured,Not captured,Not captured,3400 San Benito ct,,Austin,Texas,78738,,,Not captured,Not captured,bkennemann@yahoo.com,Not captured,802051302,,Not captured,Not captured,Not captured,Not captured,Not captured,Not captured,
Not captured,Not captured,12/12/2020,12/14/2020,Not captured,Not captured,863949,020,00072,ARS-01-0057752,Beacon International,Not captured,Not captured,Not captured,,,,Harmatz,Eric,L,05/25/1992,male,Not captured,Not captured,Not captured,Not captured,Not captured,Not captured,Not captured,Not captured,Not captured,Not captured,Not captured,Not captured,Not captured,,,Not captured,Not captured,Not captured,Not captured,960 E Paces Ferry Rd NE,,Atlanta,Georgia,30326,,,Not captured,Not captured,eric@ericharmatz.com,Not captured,802051301,,Not captured,Not captured,Not captured,Not captured,Not captured,Not captured,
Not captured,Not captured,12/11/2020,03/11/2021,Not captured,Not captured,863949,020,00072,ARS-01-0057751,Beacon International,Not captured,Not captured,Not captured,Passport(Z3054374),,,Rebello,Avillo,J,10/15/1985,male,Not captured,Not captured,Not captured,Not captured,Not captured,Not captured,Not captured,Not captured,Not captured,Not captured,Not captured,Not captured,Not captured,Yvette Tsz Wai Tam,Wife,Not captured,Not captured,Not captured,Not captured,10480 Lassam Rd,,Richmond,British Columbia,V7E 2C3,7783235583,,Not captured,Not captured,yvette_tam@hotmail.com,Not captured,802051300,,Not captured,Not captured,Not captured,Not captured,Not captured,Not captured,
Not captured,Not captured,12/11/2020,01/07/2021,Not captured,Not captured,863949,020,00072,ARS-02-0057750,Beacon America,Not captured,Not captured,Not captured,,,,Lakhani,Gulzar Saleem,,03/31/1966,female,Not captured,Not captured,Not captured,Not captured,Not captured,Not captured,Not captured,Not captured,Not captured,Not captured,Not captured,Not captured,Not captured,,,Not captured,Not captured,Not captured,Not captured,1605 Church St,,Decatur,,30033,,,Not captured,Not captured,huzairmumtaz@gmail.com,Not captured,802051299,,Not captured,Not captured,Not captured,Not captured,Not captured,Not captured,
Not captured,Not captured,12/11/2020,12/15/2020,Not captured,Not captured,863949,020,00072,ARS-02-0057749,Beacon America,Not captured,Not captured,Not captured,Passport(U0256098),,,Iyer,Purnima,,06/06/1982,female,Not captured,Not captured,Not captured,Not captured,Not captured,Not captured,Not captured,Not captured,Not captured,Not captured,Not captured,Not captured,Not captured,Carleton Naylor Cole,,Not captured,Not captured,Not captured,Not captured,338/247 Lad Phrao 87 Mu Ban Suk Sabai Villa Soi 4,,Bangkok,Bangkok,10310,+1-7026259163,+66-951763141,Not captured,Not captured,purnimaiyer@gmail.com,Not captured,802051298,,Not captured,Not captured,Not captured,Not captured,Not captured,Not captured,
Not captured,Not captured,12/11/2020,02/26/2021,Not captured,Not captured,863949,020,00072,ARS-01-0057746,Beacon International,Not captured,Not captured,Not captured,Passport(545786977),,,bell,stacy,l,12/16/1983,female,Not captured,Not captured,Not captured,Not captured,Not captured,Not captured,Not captured,Not captured,Not captured,Not captured,Not captured,Not captured,Not captured,,,Not captured,Not captured,Not captured,Not captured,10 delancey,,new york,New York,10002,10002,,Not captured,Not captured,stacyleebell66@gmail.com,Not captured,802051295,,Not captured,Not captured,Not captured,Not captured,Not captured,Not captured,
Not captured,Not captured,12/11/2020,12/22/2020,Not captured,Not captured,863949,020,00072,ARS-02-0057745,Beacon America,Not captured,Not captured,Not captured,,,,Hampton,Emily Jane,,04/25/1999,female,Not captured,Not captured,Not captured,Not captured,Not captured,Not captured,Not captured,Not captured,Not captured,Not captured,Not captured,Not captured,Not captured,Michelle Hampton,Spouse,Not captured,Not captured,Not captured,Not captured,23-25 Jacana Close,,Bayview Heights,QLD,4868,+1-0762522602,+1-7122520002,Not captured,Not captured,ehampton99@hotmail.com,Not captured,802051294,,Not captured,Not captured,Not captured,Not captured,Not captured,Not captured,
Not captured,Not captured,12/11/2020,12/22/2020,Not captured,Not captured,863949,020,00072,ARS-02-0057744,Beacon America,Not captured,Not captured,Not captured,Passport(PA6052246),,,Wilson,Joshua Russell,,09/20/1996,male,Not captured,Not captured,Not captured,Not captured,Not captured,Not captured,Not captured,Not captured,Not captured,Not captured,Not captured,Not captured,Not captured,Michelle Hampton,,Not captured,Not captured,Not captured,Not captured,23-25 Jacana Close,,Bayview Heights,QLD,4868,+1-0762522602,+1-7122520002,Not captured,Not captured,ehampton99@hotmail.com,Not captured,802051293,,Not captured,Not captured,Not captured,Not captured,Not captured,Not captured,
Not captured,Not captured,12/10/2020,12/11/2020,Not captured,Not captured,863949,020,00072,ARS-01-0057742,Beacon International,Not captured,Not captured,Not captured,,,,Arellano,Marcos,,01/09/1982,male,Not captured,Not captured,Not captured,Not captured,Not captured,Not captured,Not captured,Not captured,Not captured,Not captured,Not captured,Not captured,Not captured,,,Not captured,Not captured,Not captured,Not captured,420 W Park Ave,,Charlotte,North Carolina,28203,,,Not captured,Not captured,marcos.arellano@yahoo.com,Not captured,802051289,,Not captured,Not captured,Not captured,Not captured,Not captured,Not captured,
Not captured,Not captured,12/11/2020,06/06/2021,Not captured,Not captured,863949,020,00072,ARS-02-0057741,Beacon America,Not captured,Not captured,Not captured,Passport(T4288492),,,Chandramohan,Karpagavalli,,02/15/1962,female,Not captured,Not captured,Not captured,Not captured,Not captured,Not captured,Not captured,Not captured,Not captured,Not captured,Not captured,Not captured,Not captured,Deepak Chandramohan,,Not captured,Not captured,Not captured,Not captured,Flat no 14 3rd floor Shyams Shreyas apts,,Chennai,TN,600017,+1-3128823876,,Not captured,Not captured,dcdeepakdk@gmail.com,Not captured,802051284,,Not captured,Not captured,Not captured,Not captured,Not captured,Not captured,
Not captured,Not captured,12/10/2020,12/17/2020,Not captured,Not captured,863949,020,00072,ARS-01-0057739,Beacon International,Not captured,Not captured,Not captured,Passport(0103093985),,,Chunchi Orellana,Leoncio Elias,,12/28/1969,male,Not captured,Not captured,Not captured,Not captured,Not captured,Not captured,Not captured,Not captured,Not captured,Not captured,Not captured,Not captured,Not captured,Grace Labrador,,Not captured,Not captured,Not captured,Not captured,141 Morning Side Dr,,Croton On Hudson,NY,10520,+1-9144411272,,Not captured,Not captured,leochun@icloud.com,Not captured,802051282,,Not captured,Not captured,Not captured,Not captured,Not captured,Not captured,
Not captured,Not captured,12/10/2020,01/04/2021,Not captured,Not captured,863949,020,00072,ARS-02-0057738,Beacon America,Not captured,Not captured,Not captured,Passport(U14272515),,,Tilov,Sevim,,03/01/1952,female,Not captured,Not captured,Not captured,Not captured,Not captured,Not captured,Not captured,Not captured,Not captured,Not captured,Not captured,Not captured,Not captured,Sevda Gulu,,Not captured,Not captured,Not captured,Not captured,11 Hunkar Sokak,,Istanbul,NA,33009,+1-9174359694,,Not captured,Not captured,edagulux@gmail.com,Not captured,802051281,,Not captured,Not captured,Not captured,Not captured,Not captured,Not captured,
Not captured,Not captured,12/10/2020,12/17/2020,Not captured,Not captured,863949,020,00072,ARS-01-0057736,Beacon International,Not captured,Not captured,Not captured,Passport(580036340),,,Lima,Jose Santigo,,11/02/1984,male,Not captured,Not captured,Not captured,Not captured,Not captured,Not captured,Not captured,Not captured,Not captured,Not captured,Not captured,Not captured,Not captured,Carlos Gustavo,,Not captured,Not captured,Not captured,Not captured,148 Kings Ferry Rd,,Montrose,NY,10548,+1-9145648736,,Not captured,Not captured,santylima_24@hotmail.com,Not captured,802051279,,Not captured,Not captured,Not captured,Not captured,Not captured,Not captured,
Not captured,Not captured,12/10/2020,02/02/2021,Not captured,Not captured,863949,020,00072,ARS-01-0057735,Beacon International,Not captured,Not captured,Not captured,,,,Urrutia Gatica,Josefina Aurora,,06/12/2018,female,Not captured,Not captured,Not captured,Not captured,Not captured,Not captured,Not captured,Not captured,Not captured,Not captured,Not captured,Not captured,Not captured,Carlos Alberto Urrutia Reyes,Dependent,Not captured,Not captured,Not captured,Not captured,422 5th Street,,Wilmette,IL,60091-2862,+1-7736913193,,Not captured,Not captured,antoniourrutia@gmail.com,Not captured,802051278,,Not captured,Not captured,Not captured,Not captured,Not captured,Not captured,
Not captured,Not captured,12/10/2020,02/02/2021,Not captured,Not captured,863949,020,00072,ARS-01-0057734,Beacon International,Not captured,Not captured,Not captured,,,,Gatica Mihalicka,Javiera Luna,,02/28/1987,female,Not captured,Not captured,Not captured,Not captured,Not captured,Not captured,Not captured,Not captured,Not captured,Not captured,Not captured,Not captured,Not captured,Carlos Alberto Urrutia Reyes,Spouse,Not captured,Not captured,Not captured,Not captured,422 5th Street,,Wilmette,IL,60091-2862,+1-7736913193,,Not captured,Not captured,antoniourrutia@gmail.com,Not captured,802051277,,Not captured,Not captured,Not captured,Not captured,Not captured,Not captured,
Not captured,Not captured,12/10/2020,02/02/2021,Not captured,Not captured,863949,020,00072,ARS-01-0057733,Beacon International,Not captured,Not captured,Not captured,Passport(543740976),,,Urrutia,Antonio Esteban,,02/18/1973,male,Not captured,Not captured,Not captured,Not captured,Not captured,Not captured,Not captured,Not captured,Not captured,Not captured,Not captured,Not captured,Not captured,Carlos Alberto Urrutia Reyes,,Not captured,Not captured,Not captured,Not captured,422 5th Street,,Wilmette,IL,60091-2862,+1-7736913193,,Not captured,Not captured,antoniourrutia@gmail.com,Not captured,802051276,,Not captured,Not captured,Not captured,Not captured,Not captured,Not captured,
Not captured,Not captured,12/10/2020,12/17/2020,Not captured,Not captured,863949,020,00072,ARS-01-0057732,Beacon International,Not captured,Not captured,Not captured,Passport(5555585074),,,Picon Lima,Carlos Gustavo,,04/11/1980,male,Not captured,Not captured,Not captured,Not captured,Not captured,Not captured,Not captured,Not captured,Not captured,Not captured,Not captured,Not captured,Not captured,Jose S Lima,,Not captured,Not captured,Not captured,Not captured,27 Hawkes Ave,,Ossining,NY,10562,+1-9144798157,,Not captured,Not captured,cpcarlosg85@aol.com,Not captured,802051275,,Not captured,Not captured,Not captured,Not captured,Not captured,Not captured,