EE Transaction Type,Dependent Transaction Type,Effective Date,Expiry Date,EE Signature,EE Signature Date,Control,Suffix,Account,Plan Number,Plan Name,Claim Office,Network ID Number,Customer Code,EE SSN,Dependent SSN,Dependent Relationship,Last Name,First Name,Middle Initial,DOB,Gender,Ethnicity,PCP/PCD,PCP/PCD Current Patient,Provider Cap Office Number,COB,Dep Student Indicator,Dep OOA Indicator,EE Prior Coverage Indicator,EE Late Entrant,EE Language Indicator,Hire Date,Earnings,Earnings Frequency,Beneficiary (Last Name First Name MI),Beneficiary Relationship,Continuation of Coverage Expiration Date,Continuation of Coverage Event Date,Continuation of Coverage Length of Coverage,Work Location Zip Code,Street Address Line 1,Street Address Line 2,City,State,Zip Code,Home Phone Number,Work Phone Number,Accept Code,Evidence Code,EE Email Address,Communication Disability Code,EE Alternate ID,Dep Alternate ID,Old Control,Old Suffix,Old Account,New Control,New Suffix,New Account,
Not captured,Not captured,12/06/2020,01/26/2021,Not captured,Not captured,863949,020,00072,ARS-01-0057689,Beacon International,Not captured,Not captured,Not captured,,,,Levin,Daniel,,10/10/1976,male,Not captured,Not captured,Not captured,Not captured,Not captured,Not captured,Not captured,Not captured,Not captured,Not captured,Not captured,Not captured,Not captured,,,Not captured,Not captured,Not captured,Not captured,1731 Beacon St,,BROOKLINE,Massachusetts,02445,,,Not captured,Not captured,healersource@gmail.com,Not captured,802051208,,Not captured,Not captured,Not captured,Not captured,Not captured,Not captured,
Not captured,Not captured,12/06/2020,01/06/2021,Not captured,Not captured,863949,020,00072,ARS-01-0057686,Beacon International,Not captured,Not captured,Not captured,,,,Hasan,Naved,,11/09/1983,male,Not captured,Not captured,Not captured,Not captured,Not captured,Not captured,Not captured,Not captured,Not captured,Not captured,Not captured,Not captured,Not captured,,,Not captured,Not captured,Not captured,Not captured,11707,,Edmonton,Alberta,T5X3L5,,,Not captured,Not captured,Naved.hasan@hotmail.com,Not captured,802051205,,Not captured,Not captured,Not captured,Not captured,Not captured,Not captured,
Not captured,Not captured,12/06/2020,12/08/2020,Not captured,Not captured,863949,020,00072,ARS-02-0057684,Beacon America,Not captured,Not captured,Not captured,,,,Hilman,Henna,L,07/18/1985,female,Not captured,Not captured,Not captured,Not captured,Not captured,Not captured,Not captured,Not captured,Not captured,Not captured,Not captured,Not captured,Not captured,,,Not captured,Not captured,Not captured,Not captured,127 Governors rd,,Lakewood,New Jersey,08701,,,Not captured,Not captured,hennahilman@gmail.com,Not captured,802051203,,Not captured,Not captured,Not captured,Not captured,Not captured,Not captured,
Not captured,Not captured,12/06/2020,12/18/2020,Not captured,Not captured,863949,020,00072,ARS-02-0057683,Beacon America,Not captured,Not captured,Not captured,Passport(P3434768),,,Chafale,Nirmala Haridas,,03/17/1969,female,Not captured,Not captured,Not captured,Not captured,Not captured,Not captured,Not captured,Not captured,Not captured,Not captured,Not captured,Not captured,Not captured,Suraj Haridas Chafle,,Not captured,Not captured,Not captured,Not captured,192 Alankar Nagar Manewada Besa Road,,Nagpur,MH,440034,+1-3125617418,,Not captured,Not captured,surajchafale@gmail.com,Not captured,802051202,,Not captured,Not captured,Not captured,Not captured,Not captured,Not captured,
Not captured,Not captured,12/06/2020,01/05/2021,Not captured,Not captured,863949,020,00072,OVI-28-0057681,OverseasCare Visitors Insurance Plan,Not captured,Not captured,Not captured,Passport(E78039290),,,Zhou,Dongxian,,08/02/1965,female,Not captured,Not captured,Not captured,Not captured,Not captured,Not captured,Not captured,Not captured,Not captured,Not captured,Not captured,Not captured,Not captured,Feng Chen,Mother and Son,Not captured,Not captured,Not captured,Not captured,405 Spring Leaf Ct,,Allen,Texas,75002,6823604891,,Not captured,Not captured,fchen1024@gmail.com,Not captured,802051200,,Not captured,Not captured,Not captured,Not captured,Not captured,Not captured,
Not captured,Not captured,12/04/2020,12/14/2020,Not captured,Not captured,863949,020,00072,ARS-01-0057679,Beacon International,Not captured,Not captured,Not captured,,,,Wang,Sophia,N,09/04/1994,female,Not captured,Not captured,Not captured,Not captured,Not captured,Not captured,Not captured,Not captured,Not captured,Not captured,Not captured,Not captured,Not captured,,,Not captured,Not captured,Not captured,Not captured,180 Water St,,New york,New York,10038,,,Not captured,Not captured,sophiaa.wang@hotmail.com,Not captured,802051186,,Not captured,Not captured,Not captured,Not captured,Not captured,Not captured,
Not captured,Not captured,12/04/2020,01/31/2021,Not captured,Not captured,863949,020,00072,ARS-02-0057678,Beacon America,Not captured,Not captured,Not captured,Passport(AW802194),,,VARGAS URUETA,NATALIA,,10/30/1999,female,Not captured,Not captured,Not captured,Not captured,Not captured,Not captured,Not captured,Not captured,Not captured,Not captured,Not captured,Not captured,Not captured,MIRTA URUETA TORREALBA,,Not captured,Not captured,Not captured,Not captured,CALLE 94 No 51B 59 EDIFICIO BARILOCHE,,BARRANQUILLA,ATLANTICO,3,+1-7862231343,+1-7862231343,Not captured,Not captured,maylingdra@hotmail.com,Not captured,802051185,,Not captured,Not captured,Not captured,Not captured,Not captured,Not captured,
Not captured,Not captured,12/05/2020,12/13/2020,Not captured,Not captured,863949,020,00072,ARS-01-0057677,Beacon International,Not captured,Not captured,Not captured,,,,Tounkara,Alexander,m,12/15/1988,male,Not captured,Not captured,Not captured,Not captured,Not captured,Not captured,Not captured,Not captured,Not captured,Not captured,Not captured,Not captured,Not captured,,,Not captured,Not captured,Not captured,Not captured,1822 pine st,,philadelphia,Pennsylvania,19103,,,Not captured,Not captured,alexander.tounkara.kone@gmail.com,Not captured,802051184,,Not captured,Not captured,Not captured,Not captured,Not captured,Not captured,
Not captured,Not captured,12/05/2020,03/05/2021,Not captured,Not captured,863949,020,00072,ARS-01-0057675,Beacon International,Not captured,Not captured,Not captured,Passport(546250688),,,McMasters,Nancy Aarin Lea,,04/10/1990,female,Not captured,Not captured,Not captured,Not captured,Not captured,Not captured,Not captured,Not captured,Not captured,Not captured,Not captured,Not captured,Not captured,Michael Coombe,,Not captured,Not captured,Not captured,Not captured,816 highway 150 west,,Greensboro,NC,27455,+1-555444,,Not captured,Not captured,mcmastersna@gmail.com,Not captured,802051182,,Not captured,Not captured,Not captured,Not captured,Not captured,Not captured,
Not captured,Not captured,12/03/2020,12/07/2020,Not captured,Not captured,863949,020,00072,ARS-01-0057668,Beacon International,Not captured,Not captured,Not captured,,,,Tipton,Gregg,,09/29/1964,male,Not captured,Not captured,Not captured,Not captured,Not captured,Not captured,Not captured,Not captured,Not captured,Not captured,Not captured,Not captured,Not captured,,,Not captured,Not captured,Not captured,Not captured,527 Ardmore Pl,,Franklin,Tennessee,37064,6152433758,,Not captured,Not captured,letsgo@oneweekmissions.org,Not captured,802051175,,Not captured,Not captured,Not captured,Not captured,Not captured,Not captured,
Not captured,Not captured,12/03/2020,12/07/2020,Not captured,Not captured,863949,020,00072,ARS-01-0057667,Beacon International,Not captured,Not captured,Not captured,,,,Hawkins,Charlie,,02/23/1996,male,Not captured,Not captured,Not captured,Not captured,Not captured,Not captured,Not captured,Not captured,Not captured,Not captured,Not captured,Not captured,Not captured,,,Not captured,Not captured,Not captured,Not captured,527 Ardmore Pl,,Franklin,Tennessee,37064,6152433758,,Not captured,Not captured,letsgo@oneweekmissions.org,Not captured,802051174,,Not captured,Not captured,Not captured,Not captured,Not captured,Not captured,
Not captured,Not captured,12/03/2020,12/07/2020,Not captured,Not captured,863949,020,00072,ARS-01-0057666,Beacon International,Not captured,Not captured,Not captured,,,,Church,Brian,,09/22/2009,male,Not captured,Not captured,Not captured,Not captured,Not captured,Not captured,Not captured,Not captured,Not captured,Not captured,Not captured,Not captured,Not captured,,,Not captured,Not captured,Not captured,Not captured,527 Ardmore Pl,,Franklin,Tennessee,37064,6152433758,,Not captured,Not captured,letsgo@oneweekmissions.org,Not captured,802051173,,Not captured,Not captured,Not captured,Not captured,Not captured,Not captured,
Not captured,Not captured,12/03/2020,12/07/2020,Not captured,Not captured,863949,020,00072,ARS-01-0057665,Beacon International,Not captured,Not captured,Not captured,,,,Church Sr,Brian,,06/24/1975,male,Not captured,Not captured,Not captured,Not captured,Not captured,Not captured,Not captured,Not captured,Not captured,Not captured,Not captured,Not captured,Not captured,,,Not captured,Not captured,Not captured,Not captured,527 Ardmore Pl,,Franklin,Tennessee,37064,6152433758,,Not captured,Not captured,letsgo@oneweekmissions.org,Not captured,802051172,,Not captured,Not captured,Not captured,Not captured,Not captured,Not captured,
Not captured,Not captured,12/03/2020,12/07/2020,Not captured,Not captured,863949,020,00072,ARS-01-0057664,Beacon International,Not captured,Not captured,Not captured,,,,Ruta,Vince ,,11/28/1989,male,Not captured,Not captured,Not captured,Not captured,Not captured,Not captured,Not captured,Not captured,Not captured,Not captured,Not captured,Not captured,Not captured,,,Not captured,Not captured,Not captured,Not captured,527 Ardmore Pl,,Franklin,Tennessee,37064,6152433758,,Not captured,Not captured,letsgo@oneweekmissions.org,Not captured,802051171,,Not captured,Not captured,Not captured,Not captured,Not captured,Not captured,
Not captured,Not captured,12/03/2020,12/07/2020,Not captured,Not captured,863949,020,00072,ARS-01-0057663,Beacon International,Not captured,Not captured,Not captured,,,,Ruta,Michelle,,05/09/1961,female,Not captured,Not captured,Not captured,Not captured,Not captured,Not captured,Not captured,Not captured,Not captured,Not captured,Not captured,Not captured,Not captured,,,Not captured,Not captured,Not captured,Not captured,527 Ardmore Pl,,Franklin,Tennessee,37064,6152433758,,Not captured,Not captured,letsgo@oneweekmissions.org,Not captured,802051170,,Not captured,Not captured,Not captured,Not captured,Not captured,Not captured,
Not captured,Not captured,12/03/2020,12/07/2020,Not captured,Not captured,863949,020,00072,ARS-01-0057662,Beacon International,Not captured,Not captured,Not captured,Passport(493718567),,,Wollenslegel,Daniel,,12/09/1987,male,Not captured,Not captured,Not captured,Not captured,Not captured,Not captured,Not captured,Not captured,Not captured,Not captured,Not captured,Not captured,Not captured,,,Not captured,Not captured,Not captured,Not captured,527 Ardmore Pl,,Franklin,Tennessee,37064,6152433758,,Not captured,Not captured,letsgo@oneweekmissions.org,Not captured,802051169,,Not captured,Not captured,Not captured,Not captured,Not captured,Not captured,
Not captured,Not captured,12/03/2020,12/07/2020,Not captured,Not captured,863949,020,00072,ARS-01-0057652,Beacon International,Not captured,Not captured,Not captured,,,,Church,William,,10/21/1948,male,Not captured,Not captured,Not captured,Not captured,Not captured,Not captured,Not captured,Not captured,Not captured,Not captured,Not captured,Not captured,Not captured,,,Not captured,Not captured,Not captured,Not captured,527 Ardmore Pl,,Franklin,Tennessee,37064,6152433758,,Not captured,Not captured,letsgo@oneweekmissions.org,Not captured,802051159,,Not captured,Not captured,Not captured,Not captured,Not captured,Not captured,
Not captured,Not captured,12/03/2020,12/06/2020,Not captured,Not captured,863949,020,00072,ARS-02-0057650,Beacon America,Not captured,Not captured,Not captured,Passport(GL248148),,,Irvine,Connor James,,11/12/1995,male,Not captured,Not captured,Not captured,Not captured,Not captured,Not captured,Not captured,Not captured,Not captured,Not captured,Not captured,Not captured,Not captured,Eric Irvine,,Not captured,Not captured,Not captured,Not captured,45 Victor Blvd,,St George,ON,N0E1N0,+1-6467265419,,Not captured,Not captured,connori11@hotmail.com,Not captured,802051157,,Not captured,Not captured,Not captured,Not captured,Not captured,Not captured,
Not captured,Not captured,12/06/2020,12/21/2020,Not captured,Not captured,863949,020,00072,ARS-02-0057648,Beacon America,Not captured,Not captured,Not captured,Passport(050917988),,,Vider,Zipora,,11/01/1951,female,Not captured,Not captured,Not captured,Not captured,Not captured,Not captured,Not captured,Not captured,Not captured,Not captured,Not captured,Not captured,Not captured,Avner Vider,,Not captured,Not captured,Not captured,Not captured,Eliyahu Havani 18,,Kiryat Ata,Alaska,28077,+1-2022996992,+972-48448176,Not captured,Not captured,avtlv@outlook.com,Not captured,802051155,,Not captured,Not captured,Not captured,Not captured,Not captured,Not captured,
Not captured,Not captured,12/03/2020,12/13/2020,Not captured,Not captured,863949,020,00072,ARS-01-0057647,Beacon International,Not captured,Not captured,Not captured,,,,Luong,Tong,,02/28/1985,male,Not captured,Not captured,Not captured,Not captured,Not captured,Not captured,Not captured,Not captured,Not captured,Not captured,Not captured,Not captured,Not captured,,,Not captured,Not captured,Not captured,Not captured,340 Eaton Dr,,Pasadena,California,91107,,,Not captured,Not captured,e.carol.chen@gmail.com,Not captured,802051154,,Not captured,Not captured,Not captured,Not captured,Not captured,Not captured,
Not captured,Not captured,12/03/2020,12/13/2020,Not captured,Not captured,863949,020,00072,ARS-01-0057646,Beacon International,Not captured,Not captured,Not captured,,,,Chen,Carol,,01/11/1983,female,Not captured,Not captured,Not captured,Not captured,Not captured,Not captured,Not captured,Not captured,Not captured,Not captured,Not captured,Not captured,Not captured,,,Not captured,Not captured,Not captured,Not captured,340 Eaton Dr,,Pasadena,California,91107,,,Not captured,Not captured,e.carol.chen@gmail.com,Not captured,802051153,,Not captured,Not captured,Not captured,Not captured,Not captured,Not captured,
Not captured,Not captured,12/03/2020,12/07/2020,Not captured,Not captured,863949,020,00072,ARS-02-0057644,Beacon America,Not captured,Not captured,Not captured,Passport(550107991),,,Kondrashov,Anton,,10/14/1999,male,Not captured,Not captured,Not captured,Not captured,Not captured,Not captured,Not captured,Not captured,Not captured,Not captured,Not captured,Not captured,Not captured,Alexey Kondrashov,,Not captured,Not captured,Not captured,Not captured,Via Di Doccia 26,,Pontassieve,FI,50065,+1-9178576425,,Not captured,Not captured,antonkon1410@gmail.com,Not captured,802051151,,Not captured,Not captured,Not captured,Not captured,Not captured,Not captured,
Not captured,Not captured,12/02/2020,12/09/2020,Not captured,Not captured,863949,020,00072,ARS-01-0057643,Beacon International,Not captured,Not captured,Not captured,,,,Srulowitz,Shimon ,,02/22/1990,male,Not captured,Not captured,Not captured,Not captured,Not captured,Not captured,Not captured,Not captured,Not captured,Not captured,Not captured,Not captured,Not captured,,,Not captured,Not captured,Not captured,Not captured,1249 58 St,,Brooklyn,New York,11219,845-362-1175,,Not captured,Not captured,3621175@gmail.com,Not captured,802051150,,Not captured,Not captured,Not captured,Not captured,Not captured,Not captured,
Not captured,Not captured,12/02/2020,12/09/2020,Not captured,Not captured,863949,020,00072,ARS-01-0057642,Beacon International,Not captured,Not captured,Not captured,,,,Lebovitz,Benzion,,04/26/1972,male,Not captured,Not captured,Not captured,Not captured,Not captured,Not captured,Not captured,Not captured,Not captured,Not captured,Not captured,Not captured,Not captured,,,Not captured,Not captured,Not captured,Not captured,1249 58 St,,Brooklyn,New York,11219,845-362-1175,,Not captured,Not captured,3621175@gmail.com,Not captured,802051149,,Not captured,Not captured,Not captured,Not captured,Not captured,Not captured,
Not captured,Not captured,12/02/2020,01/11/2021,Not captured,Not captured,863949,020,00072,ARS-01-0057639,Beacon International,Not captured,Not captured,Not captured,,,,Evans,Shaun,,11/02/1982,male,Not captured,Not captured,Not captured,Not captured,Not captured,Not captured,Not captured,Not captured,Not captured,Not captured,Not captured,Not captured,Not captured,,,Not captured,Not captured,Not captured,Not captured,400 Chambers Street,,New York,New York,10282,,,Not captured,Not captured,thezimbo@gmail.com,Not captured,802051146,,Not captured,Not captured,Not captured,Not captured,Not captured,Not captured,
Not captured,Not captured,12/02/2020,12/30/2020,Not captured,Not captured,863949,020,00072,ARS-02-0057638,Beacon America,Not captured,Not captured,Not captured,,,,Pamer,Barry,,03/09/1981,male,Not captured,Not captured,Not captured,Not captured,Not captured,Not captured,Not captured,Not captured,Not captured,Not captured,Not captured,Not captured,Not captured,,,Not captured,Not captured,Not captured,Not captured,240 E. 32nd St 3A,,New York,New York,10016,,,Not captured,Not captured,barrypamer@gmail.com,Not captured,802051145,,Not captured,Not captured,Not captured,Not captured,Not captured,Not captured,
Not captured,Not captured,12/02/2020,12/10/2020,Not captured,Not captured,863949,020,00072,ARS-01-0057634,Beacon International,Not captured,Not captured,Not captured,Passport(C8WKYZ33P),,,Atlas,Okyanus Furkan,,04/12/1994,male,Not captured,Not captured,Not captured,Not captured,Not captured,Not captured,Not captured,Not captured,Not captured,Not captured,Not captured,Not captured,Not captured,Okyanus Atlas,,Not captured,Not captured,Not captured,Not captured,7 Crofts Street,,London,England,E1 8LU,+90-5372094093,,Not captured,Not captured,okyanus.atlas@outlook.com,Not captured,802051141,,Not captured,Not captured,Not captured,Not captured,Not captured,Not captured,
Not captured,Not captured,12/02/2020,12/17/2020,Not captured,Not captured,863949,020,00072,ARS-01-0057633,Beacon International,Not captured,Not captured,Not captured,,,,Mordkovich,Elizabeth,,12/14/1996,female,Not captured,Not captured,Not captured,Not captured,Not captured,Not captured,Not captured,Not captured,Not captured,Not captured,Not captured,Not captured,Not captured,,,Not captured,Not captured,Not captured,Not captured,2 Horizon Rd Apt 1422,,Fort Lee,New Jersey,07024,,,Not captured,Not captured,marinochkam@gmail.com,Not captured,802051140,,Not captured,Not captured,Not captured,Not captured,Not captured,Not captured,
Not captured,Not captured,12/02/2020,12/17/2020,Not captured,Not captured,863949,020,00072,ARS-01-0057632,Beacon International,Not captured,Not captured,Not captured,,,,Mordkovich,Marina,,04/15/1961,female,Not captured,Not captured,Not captured,Not captured,Not captured,Not captured,Not captured,Not captured,Not captured,Not captured,Not captured,Not captured,Not captured,,,Not captured,Not captured,Not captured,Not captured,2 Horizon Rd Apt 1422,,Fort Lee,New Jersey,07024,,,Not captured,Not captured,marinochkam@gmail.com,Not captured,802051139,,Not captured,Not captured,Not captured,Not captured,Not captured,Not captured,
Not captured,Not captured,12/02/2020,12/06/2020,Not captured,Not captured,863949,020,00072,ARS-01-0057631,Beacon International,Not captured,Not captured,Not captured,,,,Igbinosa,Nosa,,12/20/1987,male,Not captured,Not captured,Not captured,Not captured,Not captured,Not captured,Not captured,Not captured,Not captured,Not captured,Not captured,Not captured,Not captured,,,Not captured,Not captured,Not captured,Not captured,5051 El Don Drive 1502,,Rocklin,California,95677,,,Not captured,Not captured,igbinosanosa@yahoo.com,Not captured,802051138,,Not captured,Not captured,Not captured,Not captured,Not captured,Not captured,
Not captured,Not captured,12/02/2020,12/06/2020,Not captured,Not captured,863949,020,00072,ARS-01-0057630,Beacon International,Not captured,Not captured,Not captured,,,,Aburekhanlen,Elomense,,04/28/1989,female,Not captured,Not captured,Not captured,Not captured,Not captured,Not captured,Not captured,Not captured,Not captured,Not captured,Not captured,Not captured,Not captured,,,Not captured,Not captured,Not captured,Not captured,5051 El Don Drive 1502,,Rocklin,California,95677,,,Not captured,Not captured,igbinosanosa@yahoo.com,Not captured,802051137,,Not captured,Not captured,Not captured,Not captured,Not captured,Not captured,
Not captured,Not captured,12/01/2020,12/21/2020,Not captured,Not captured,863949,020,00072,ARS-02-0057629,Beacon America,Not captured,Not captured,Not captured,Passport(L3090198),,,Ramanathan,Dipti,,09/17/1954,female,Not captured,Not captured,Not captured,Not captured,Not captured,Not captured,Not captured,Not captured,Not captured,Not captured,Not captured,Not captured,Not captured,Arti Ramanathan,,Not captured,Not captured,Not captured,Not captured,IC Ashiana,,Mumbai,MH,400103,+1-4842640153,+1-4842640153,Not captured,Not captured,sbhattacharya99@gmail.com,Not captured,802051136,,Not captured,Not captured,Not captured,Not captured,Not captured,Not captured,
Not captured,Not captured,12/01/2020,12/07/2020,Not captured,Not captured,863949,020,00072,ARS-01-0057627,Beacon International,Not captured,Not captured,Not captured,,,,Rosenberger,Esther,,09/14/2001,female,Not captured,Not captured,Not captured,Not captured,Not captured,Not captured,Not captured,Not captured,Not captured,Not captured,Not captured,Not captured,Not captured,,,Not captured,Not captured,Not captured,Not captured,546 Paul St,,Hillside,New Jersey,07205,0000000000,,Not captured,Not captured,avrumy1155@gmail.com,Not captured,802051133,,Not captured,Not captured,Not captured,Not captured,Not captured,Not captured,
Not captured,Not captured,12/01/2020,12/07/2020,Not captured,Not captured,863949,020,00072,ARS-01-0057626,Beacon International,Not captured,Not captured,Not captured,,,,Rosenberger,Miriam,,09/18/1978,female,Not captured,Not captured,Not captured,Not captured,Not captured,Not captured,Not captured,Not captured,Not captured,Not captured,Not captured,Not captured,Not captured,,,Not captured,Not captured,Not captured,Not captured,546 Paul St,,Hillside,New Jersey,07205,0000000000,,Not captured,Not captured,avrumy1155@gmail.com,Not captured,802051134,,Not captured,Not captured,Not captured,Not captured,Not captured,Not captured,
Not captured,Not captured,12/03/2020,02/18/2021,Not captured,Not captured,863949,020,00072,ARS-01-0057625,Beacon International,Not captured,Not captured,Not captured,Passport(727048909),,,EMELIANOVA,IRINA,,04/29/1982,female,Not captured,Not captured,Not captured,Not captured,Not captured,Not captured,Not captured,Not captured,Not captured,Not captured,Not captured,Not captured,Not captured,BRENT MURRAY ROBINSON,,Not captured,Not captured,Not captured,Not captured,LENINGRADYAN 36-20,,YEREVAN,YEREVAN,0031,+27-0847292210,,Not captured,Not captured,brentrobinson@yahoo.com,Not captured,802051132,,Not captured,Not captured,Not captured,Not captured,Not captured,Not captured,