EE Transaction Type,Dependent Transaction Type,Effective Date,Expiry Date,EE Signature,EE Signature Date,Control,Suffix,Account,Plan Number,Plan Name,Claim Office,Network ID Number,Customer Code,EE SSN,Dependent SSN,Dependent Relationship,Last Name,First Name,Middle Initial,DOB,Gender,Ethnicity,PCP/PCD,PCP/PCD Current Patient,Provider Cap Office Number,COB,Dep Student Indicator,Dep OOA Indicator,EE Prior Coverage Indicator,EE Late Entrant,EE Language Indicator,Hire Date,Earnings,Earnings Frequency,Beneficiary (Last Name First Name MI),Beneficiary Relationship,Continuation of Coverage Expiration Date,Continuation of Coverage Event Date,Continuation of Coverage Length of Coverage,Work Location Zip Code,Street Address Line 1,Street Address Line 2,City,State,Zip Code,Home Phone Number,Work Phone Number,Accept Code,Evidence Code,EE Email Address,Communication Disability Code,EE Alternate ID,Dep Alternate ID,Old Control,Old Suffix,Old Account,New Control,New Suffix,New Account,
Not captured,Not captured,11/30/2020,11/28/2021,Not captured,Not captured,863949,020,00072,ARS-03-0057563,Essential America,Not captured,Not captured,Not captured,Passport(550785899),,,Borden,Margot,Esther,05/28/1962,male,Not captured,Not captured,Not captured,Not captured,Not captured,Not captured,Not captured,Not captured,Not captured,Not captured,Not captured,Not captured,Not captured,,,Not captured,Not captured,Not captured,Not captured,Nipon 2 Flat 102,,Mumbai,Maharashtra,400049,+919920816811,,Not captured,Not captured,integral_psychology@yahoo.com,Not captured,802051051,,Not captured,Not captured,Not captured,Not captured,Not captured,Not captured,
Not captured,Not captured,11/30/2020,05/21/2021,Not captured,Not captured,863949,020,00072,ARS-02-0057614,Beacon America,Not captured,Not captured,Not captured,Passport(N5259914),,,natuva,Urmila Devi,,05/08/1953,female,Not captured,Not captured,Not captured,Not captured,Not captured,Not captured,Not captured,Not captured,Not captured,Not captured,Not captured,Not captured,Not captured,Spandana Natuva,,Not captured,Not captured,Not captured,Not captured,8-3-231/71/72 92 93/g-3,,Krishnanagar,TG,500045,+1-5025337942,,Not captured,Not captured,kapilvallamkonda@gmail.com,Not captured,802051116,,Not captured,Not captured,Not captured,Not captured,Not captured,Not captured,
Not captured,Not captured,11/30/2020,11/28/2021,Not captured,Not captured,863949,020,00072,ARS-03-0057454,Essential America,Not captured,Not captured,Not captured,Passport(479824535),,,Lewis,Mark,Elliott,12/27/1983,male,Not captured,Not captured,Not captured,Not captured,Not captured,Not captured,Not captured,Not captured,Not captured,Not captured,Not captured,Not captured,Not captured,,,Not captured,Not captured,Not captured,Not captured,1320 Robb Court,,Little Rock,Arkansas,72223,15012050456,,Not captured,Not captured,markandtorylewis@gmail.com,Not captured,802050917,,Not captured,Not captured,Not captured,Not captured,Not captured,Not captured,
Not captured,Not captured,11/30/2020,11/28/2021,Not captured,Not captured,863949,020,00072,ARS-03-0057454,Essential America,Not captured,Not captured,Not captured,,Passport(567497019),Spouse,Lewis,Tory,Hodges,07/21/1984,female,Not captured,Not captured,Not captured,Not captured,Not captured,Not captured,Not captured,Not captured,Not captured,Not captured,Not captured,Not captured,Not captured,,,Not captured,Not captured,Not captured,Not captured,1320 Robb Court,,Little Rock,Arkansas,72223,15012050456,,Not captured,Not captured,markandtorylewis@gmail.com,Not captured,,802051112,Not captured,Not captured,Not captured,Not captured,Not captured,Not captured,
Not captured,Not captured,11/30/2020,11/28/2021,Not captured,Not captured,863949,020,00072,ARS-03-0057454,Essential America,Not captured,Not captured,Not captured,,Passport(548158972),Dependant,Lewis,Levi,Elliott,10/03/2011,male,Not captured,Not captured,Not captured,Not captured,Not captured,Not captured,Not captured,Not captured,Not captured,Not captured,Not captured,Not captured,Not captured,,,Not captured,Not captured,Not captured,Not captured,1320 Robb Court,,Little Rock,Arkansas,72223,15012050456,,Not captured,Not captured,markandtorylewis@gmail.com,Not captured,,802051113,Not captured,Not captured,Not captured,Not captured,Not captured,Not captured,
Not captured,Not captured,11/30/2020,11/28/2021,Not captured,Not captured,863949,020,00072,ARS-03-0057454,Essential America,Not captured,Not captured,Not captured,,Passport(548158971),Dependant,Lewis,John,Isaac,11/19/2013,male,Not captured,Not captured,Not captured,Not captured,Not captured,Not captured,Not captured,Not captured,Not captured,Not captured,Not captured,Not captured,Not captured,,,Not captured,Not captured,Not captured,Not captured,1320 Robb Court,,Little Rock,Arkansas,72223,15012050456,,Not captured,Not captured,markandtorylewis@gmail.com,Not captured,,802051114,Not captured,Not captured,Not captured,Not captured,Not captured,Not captured,
Not captured,Not captured,11/30/2020,11/28/2021,Not captured,Not captured,863949,020,00072,ARS-03-0057454,Essential America,Not captured,Not captured,Not captured,,Passport(548158967),Dependant,Lewis,Nora,Jane,04/18/2016,female,Not captured,Not captured,Not captured,Not captured,Not captured,Not captured,Not captured,Not captured,Not captured,Not captured,Not captured,Not captured,Not captured,,,Not captured,Not captured,Not captured,Not captured,1320 Robb Court,,Little Rock,Arkansas,72223,15012050456,,Not captured,Not captured,markandtorylewis@gmail.com,Not captured,,802051115,Not captured,Not captured,Not captured,Not captured,Not captured,Not captured,
Not captured,Not captured,11/29/2020,12/18/2020,Not captured,Not captured,863949,020,00072,ARS-01-0057610,Beacon International,Not captured,Not captured,Not captured,,,,Twersky,Yakov,,06/01/1973,male,Not captured,Not captured,Not captured,Not captured,Not captured,Not captured,Not captured,Not captured,Not captured,Not captured,Not captured,Not captured,Not captured,,,Not captured,Not captured,Not captured,Not captured,32 Truman Ave,,Spring Valley,New York,10977,845-362-2402,,Not captured,Not captured,3621175@gmail.com,Not captured,802051107,,Not captured,Not captured,Not captured,Not captured,Not captured,Not captured,
Not captured,Not captured,11/30/2020,12/02/2020,Not captured,Not captured,863949,020,00072,ARS-01-0057609,Beacon International,Not captured,Not captured,Not captured,Passport(534156739),,,Fischer,Michael ,,01/14/1987,male,Not captured,Not captured,Not captured,Not captured,Not captured,Not captured,Not captured,Not captured,Not captured,Not captured,Not captured,Not captured,Not captured,,,Not captured,Not captured,Not captured,Not captured,936 51ST ST ,,BROOKLYN,New York,11219,3474525723,3474525723,Not captured,Not captured,mfischer718@gmail.com,Not captured,802051106,,Not captured,Not captured,Not captured,Not captured,Not captured,Not captured,
Not captured,Not captured,11/29/2020,12/09/2020,Not captured,Not captured,863949,020,00072,ARS-01-0057608,Beacon International,Not captured,Not captured,Not captured,,,,Davis,Tamika,K,11/18/1989,female,Not captured,Not captured,Not captured,Not captured,Not captured,Not captured,Not captured,Not captured,Not captured,Not captured,Not captured,Not captured,Not captured,,,Not captured,Not captured,Not captured,Not captured,35 Davenport Ave APT 4H,,New Rochelle,New York,10805,,,Not captured,Not captured,tkdavis1118@yahoo.com,Not captured,802051105,,Not captured,Not captured,Not captured,Not captured,Not captured,Not captured,
Not captured,Not captured,11/30/2020,12/02/2020,Not captured,Not captured,863949,020,00072,ARS-01-0057607,Beacon International,Not captured,Not captured,Not captured,Passport(531467761),,,Solomon,Yehudah,,02/21/1986,male,Not captured,Not captured,Not captured,Not captured,Not captured,Not captured,Not captured,Not captured,Not captured,Not captured,Not captured,Not captured,Not captured,Chana Solomon,,Not captured,Not captured,Not captured,Not captured,936 51st Street,,Brooklyn,NY,11219,+1-3474525723,+1-9175863689,Not captured,Not captured,yetd100@gmail.com,Not captured,802051104,,Not captured,Not captured,Not captured,Not captured,Not captured,Not captured,
Not captured,Not captured,11/29/2020,12/04/2020,Not captured,Not captured,863949,020,00072,ARS-02-0057606,Beacon America,Not captured,Not captured,Not captured,,,,TWERSKY,YEHUDA,,10/03/1993,male,Not captured,Not captured,Not captured,Not captured,Not captured,Not captured,Not captured,Not captured,Not captured,Not captured,Not captured,Not captured,Not captured,,,Not captured,Not captured,Not captured,Not captured,HALPERIN 77,,BNEI BERAK,,5155035,,,Not captured,Not captured,englandermordechaiba@gmail.com,Not captured,802051103,,Not captured,Not captured,Not captured,Not captured,Not captured,Not captured,
Not captured,Not captured,11/29/2020,12/04/2020,Not captured,Not captured,863949,020,00072,ARS-02-0057605,Beacon America,Not captured,Not captured,Not captured,,,,ROKACH,ISACHAR,,10/31/1972,male,Not captured,Not captured,Not captured,Not captured,Not captured,Not captured,Not captured,Not captured,Not captured,Not captured,Not captured,Not captured,Not captured,,,Not captured,Not captured,Not captured,Not captured,HALPERIN 77,,BNEI BERAK,,5155035,,,Not captured,Not captured,englandermordechaiba@gmail.com,Not captured,802051102,,Not captured,Not captured,Not captured,Not captured,Not captured,Not captured,
Not captured,Not captured,11/30/2020,12/17/2020,Not captured,Not captured,863949,020,00072,ARS-01-0057604,Beacon International,Not captured,Not captured,Not captured,,,,Abulibdeh,Jood Amjed,,12/28/2018,male,Not captured,Not captured,Not captured,Not captured,Not captured,Not captured,Not captured,Not captured,Not captured,Not captured,Not captured,Not captured,Not captured,Amjed Taleb Abulibdeh,Dependent,Not captured,Not captured,Not captured,Not captured,1029 w battlefield,,Springfield,MO,65807,+1-417-631-6698,,Not captured,Not captured,amaalbiotechnology@gmail.com,Not captured,802051101,,Not captured,Not captured,Not captured,Not captured,Not captured,Not captured,
Not captured,Not captured,11/30/2020,12/17/2020,Not captured,Not captured,863949,020,00072,ARS-01-0057603,Beacon International,Not captured,Not captured,Not captured,,,,Abulibdeh,Jad Amjed,,09/27/2016,male,Not captured,Not captured,Not captured,Not captured,Not captured,Not captured,Not captured,Not captured,Not captured,Not captured,Not captured,Not captured,Not captured,Amjed Taleb Abulibdeh,Dependent,Not captured,Not captured,Not captured,Not captured,1029 w battlefield,,Springfield,MO,65807,+1-417-631-6698,,Not captured,Not captured,amaalbiotechnology@gmail.com,Not captured,802051100,,Not captured,Not captured,Not captured,Not captured,Not captured,Not captured,
Not captured,Not captured,11/30/2020,12/17/2020,Not captured,Not captured,863949,020,00072,ARS-01-0057602,Beacon International,Not captured,Not captured,Not captured,,,,Abulibdeh,Julnar Amjed,,07/18/2013,female,Not captured,Not captured,Not captured,Not captured,Not captured,Not captured,Not captured,Not captured,Not captured,Not captured,Not captured,Not captured,Not captured,Amjed Taleb Abulibdeh,Dependent,Not captured,Not captured,Not captured,Not captured,1029 w battlefield,,Springfield,MO,65807,+1-417-631-6698,,Not captured,Not captured,amaalbiotechnology@gmail.com,Not captured,802051099,,Not captured,Not captured,Not captured,Not captured,Not captured,Not captured,
Not captured,Not captured,11/30/2020,12/17/2020,Not captured,Not captured,863949,020,00072,ARS-01-0057601,Beacon International,Not captured,Not captured,Not captured,Passport(4964388),,,Abulibdeh,Amaal AF,,10/16/1986,female,Not captured,Not captured,Not captured,Not captured,Not captured,Not captured,Not captured,Not captured,Not captured,Not captured,Not captured,Not captured,Not captured,Amjed Taleb Abulibdeh,,Not captured,Not captured,Not captured,Not captured,1029 w battlefield,,Springfield,MO,65807,+1-417-631-6698,,Not captured,Not captured,amaalbiotechnology@gmail.com,Not captured,802051098,,Not captured,Not captured,Not captured,Not captured,Not captured,Not captured,
Not captured,Not captured,11/29/2020,12/02/2020,Not captured,Not captured,863949,020,00072,ARS-01-0057600,Beacon International,Not captured,Not captured,Not captured,,,,Schwartz,Daniel,,02/12/2020,male,Not captured,Not captured,Not captured,Not captured,Not captured,Not captured,Not captured,Not captured,Not captured,Not captured,Not captured,Not captured,Not captured,,,Not captured,Not captured,Not captured,Not captured,7827 CANDLE LN,,Houston,Texas,77071,6509062660,,Not captured,Not captured,elischwartz@gmail.com,Not captured,802051097,,Not captured,Not captured,Not captured,Not captured,Not captured,Not captured,
Not captured,Not captured,11/29/2020,12/02/2020,Not captured,Not captured,863949,020,00072,ARS-01-0057599,Beacon International,Not captured,Not captured,Not captured,,,,Schwartz,Ilan,,10/25/2015,male,Not captured,Not captured,Not captured,Not captured,Not captured,Not captured,Not captured,Not captured,Not captured,Not captured,Not captured,Not captured,Not captured,,,Not captured,Not captured,Not captured,Not captured,7827 CANDLE LN,,Houston,Texas,77071,6509062660,,Not captured,Not captured,elischwartz@gmail.com,Not captured,802051096,,Not captured,Not captured,Not captured,Not captured,Not captured,Not captured,
Not captured,Not captured,11/29/2020,12/02/2020,Not captured,Not captured,863949,020,00072,ARS-01-0057598,Beacon International,Not captured,Not captured,Not captured,,,,Schwartz,Ariel ,,01/05/2014,male,Not captured,Not captured,Not captured,Not captured,Not captured,Not captured,Not captured,Not captured,Not captured,Not captured,Not captured,Not captured,Not captured,,,Not captured,Not captured,Not captured,Not captured,7827 CANDLE LN,,Houston,Texas,77071,6509062660,,Not captured,Not captured,elischwartz@gmail.com,Not captured,802051095,,Not captured,Not captured,Not captured,Not captured,Not captured,Not captured,
Not captured,Not captured,11/29/2020,12/02/2020,Not captured,Not captured,863949,020,00072,ARS-01-0057597,Beacon International,Not captured,Not captured,Not captured,,,,Schwartz,Gavriel,,10/29/2011,male,Not captured,Not captured,Not captured,Not captured,Not captured,Not captured,Not captured,Not captured,Not captured,Not captured,Not captured,Not captured,Not captured,,,Not captured,Not captured,Not captured,Not captured,7827 CANDLE LN,,Houston,Texas,77071,6509062660,,Not captured,Not captured,elischwartz@gmail.com,Not captured,802051094,,Not captured,Not captured,Not captured,Not captured,Not captured,Not captured,
Not captured,Not captured,11/29/2020,12/02/2020,Not captured,Not captured,863949,020,00072,ARS-01-0057596,Beacon International,Not captured,Not captured,Not captured,,,,Schwartz,Shoshana,,06/23/1987,female,Not captured,Not captured,Not captured,Not captured,Not captured,Not captured,Not captured,Not captured,Not captured,Not captured,Not captured,Not captured,Not captured,,,Not captured,Not captured,Not captured,Not captured,7827 CANDLE LN,,Houston,Texas,77071,6509062660,,Not captured,Not captured,elischwartz@gmail.com,Not captured,802051093,,Not captured,Not captured,Not captured,Not captured,Not captured,Not captured,
Not captured,Not captured,11/29/2020,12/02/2020,Not captured,Not captured,863949,020,00072,ARS-01-0057595,Beacon International,Not captured,Not captured,Not captured,,,,Schwartz,Eliezer,,05/12/1982,male,Not captured,Not captured,Not captured,Not captured,Not captured,Not captured,Not captured,Not captured,Not captured,Not captured,Not captured,Not captured,Not captured,,,Not captured,Not captured,Not captured,Not captured,7827 CANDLE LN,,Houston,Texas,77071,6509062660,,Not captured,Not captured,elischwartz@gmail.com,Not captured,802051092,,Not captured,Not captured,Not captured,Not captured,Not captured,Not captured,
Not captured,Not captured,11/30/2020,12/12/2020,Not captured,Not captured,863949,020,00072,ARS-01-0057594,Beacon International,Not captured,Not captured,Not captured,Passport(559803505),,,Engen,Cameron,,01/21/2000,male,Not captured,Not captured,Not captured,Not captured,Not captured,Not captured,Not captured,Not captured,Not captured,Not captured,Not captured,Not captured,Not captured,Debora Lopes,,Not captured,Not captured,Not captured,Not captured,10715 Lancaster Circleville rd,,Amanda,OH,43102,+1-7406759171,+1-7406759171,Not captured,Not captured,ci.three@yahoo.com,Not captured,802051091,,Not captured,Not captured,Not captured,Not captured,Not captured,Not captured,
Not captured,Not captured,11/28/2020,12/28/2020,Not captured,Not captured,863949,020,00072,ARS-02-0057593,Beacon America,Not captured,Not captured,Not captured,Passport(XDD670913),,,RUBIO HERNANDEZ,LUIS CARLOS,,12/06/1993,male,Not captured,Not captured,Not captured,Not captured,Not captured,Not captured,Not captured,Not captured,Not captured,Not captured,Not captured,Not captured,Not captured,CARLA RUBIO ,SISTER ,Not captured,Not captured,Not captured,Not captured,5955 NW 105TH CT,,DORAL,FLORIDA,33178,7868181082,,Not captured,Not captured,lcrubioh@gmail.com,Not captured,802051090,,Not captured,Not captured,Not captured,Not captured,Not captured,Not captured,
Not captured,Not captured,11/28/2020,12/05/2020,Not captured,Not captured,863949,020,00072,ARS-01-0057592,Beacon International,Not captured,Not captured,Not captured,,,,Newson,James,,11/29/1964,male,Not captured,Not captured,Not captured,Not captured,Not captured,Not captured,Not captured,Not captured,Not captured,Not captured,Not captured,Not captured,Not captured,,,Not captured,Not captured,Not captured,Not captured,2005 Bentbrooke Trail,,Lawrenceville,Georgia,30043,,,Not captured,Not captured,newsonhouse2005@gmail.com,Not captured,802051089,,Not captured,Not captured,Not captured,Not captured,Not captured,Not captured,
Not captured,Not captured,11/28/2020,12/05/2020,Not captured,Not captured,863949,020,00072,ARS-01-0057591,Beacon International,Not captured,Not captured,Not captured,,,,Lawrence-Newson,Mildred,,10/16/1967,female,Not captured,Not captured,Not captured,Not captured,Not captured,Not captured,Not captured,Not captured,Not captured,Not captured,Not captured,Not captured,Not captured,,,Not captured,Not captured,Not captured,Not captured,2005 Bentbrooke Trail,,Lawrenceville,Georgia,30043,,,Not captured,Not captured,newsonhouse2005@gmail.com,Not captured,802051088,,Not captured,Not captured,Not captured,Not captured,Not captured,Not captured,
Not captured,Not captured,11/27/2020,01/31/2021,Not captured,Not captured,863949,020,00072,ARS-01-0057587,Beacon International,Not captured,Not captured,Not captured,,,,Stoller,Jessica,,08/25/1987,female,Not captured,Not captured,Not captured,Not captured,Not captured,Not captured,Not captured,Not captured,Not captured,Not captured,Not captured,Not captured,Not captured,,,Not captured,Not captured,Not captured,Not captured,1440 crystal lake rd,,Aspen,Colorado,81611,,,Not captured,Not captured,stoller81611@gmail.com,Not captured,802051084,,Not captured,Not captured,Not captured,Not captured,Not captured,Not captured,
Not captured,Not captured,11/26/2020,11/29/2020,Not captured,Not captured,863949,020,00072,ARS-01-0057581,Beacon International,Not captured,Not captured,Not captured,,,,Rafael,,,09/24/2019,male,Not captured,Not captured,Not captured,Not captured,Not captured,Not captured,Not captured,Not captured,Not captured,Not captured,Not captured,Not captured,Not captured,,,Not captured,Not captured,Not captured,Not captured,32 Hickory Rd,,New Jersey,,08701,732-363-6125,,Not captured,Not captured,ynbaumol@gmail.com,Not captured,802051078,,Not captured,Not captured,Not captured,Not captured,Not captured,Not captured,
Not captured,Not captured,11/26/2020,11/29/2020,Not captured,Not captured,863949,020,00072,ARS-01-0057580,Beacon International,Not captured,Not captured,Not captured,,,,Baumol,Dina,,06/22/2016,female,Not captured,Not captured,Not captured,Not captured,Not captured,Not captured,Not captured,Not captured,Not captured,Not captured,Not captured,Not captured,Not captured,,,Not captured,Not captured,Not captured,Not captured,32 Hickory Rd,,New Jersey,,08701,732-363-6125,,Not captured,Not captured,ynbaumol@gmail.com,Not captured,802051077,,Not captured,Not captured,Not captured,Not captured,Not captured,Not captured,
Not captured,Not captured,11/26/2020,11/29/2020,Not captured,Not captured,863949,020,00072,ARS-01-0057579,Beacon International,Not captured,Not captured,Not captured,,,,Baumol,Yosef,,09/19/2014,male,Not captured,Not captured,Not captured,Not captured,Not captured,Not captured,Not captured,Not captured,Not captured,Not captured,Not captured,Not captured,Not captured,,,Not captured,Not captured,Not captured,Not captured,32 Hickory Rd,,New Jersey,,08701,732-363-6125,,Not captured,Not captured,ynbaumol@gmail.com,Not captured,802051076,,Not captured,Not captured,Not captured,Not captured,Not captured,Not captured,
Not captured,Not captured,11/26/2020,11/29/2020,Not captured,Not captured,863949,020,00072,ARS-01-0057578,Beacon International,Not captured,Not captured,Not captured,,,,Baumol,Aliza,,06/09/2013,female,Not captured,Not captured,Not captured,Not captured,Not captured,Not captured,Not captured,Not captured,Not captured,Not captured,Not captured,Not captured,Not captured,,,Not captured,Not captured,Not captured,Not captured,32 Hickory Rd,,New Jersey,,08701,732-363-6125,,Not captured,Not captured,ynbaumol@gmail.com,Not captured,802051075,,Not captured,Not captured,Not captured,Not captured,Not captured,Not captured,
Not captured,Not captured,11/26/2020,11/29/2020,Not captured,Not captured,863949,020,00072,ARS-01-0057577,Beacon International,Not captured,Not captured,Not captured,,,,Baumiol,Yocheved,,10/09/1990,female,Not captured,Not captured,Not captured,Not captured,Not captured,Not captured,Not captured,Not captured,Not captured,Not captured,Not captured,Not captured,Not captured,,,Not captured,Not captured,Not captured,Not captured,32 Hickory Rd,,New Jersey,,08701,732-363-6125,,Not captured,Not captured,ynbaumol@gmail.com,Not captured,802051074,,Not captured,Not captured,Not captured,Not captured,Not captured,Not captured,
Not captured,Not captured,11/26/2020,11/29/2020,Not captured,Not captured,863949,020,00072,ARS-01-0057576,Beacon International,Not captured,Not captured,Not captured,,,,Baumol,Nucham,,09/01/1988,male,Not captured,Not captured,Not captured,Not captured,Not captured,Not captured,Not captured,Not captured,Not captured,Not captured,Not captured,Not captured,Not captured,,,Not captured,Not captured,Not captured,Not captured,32 Hickory Rd,,New Jersey,,08701,732-363-6125,,Not captured,Not captured,ynbaumol@gmail.com,Not captured,802051073,,Not captured,Not captured,Not captured,Not captured,Not captured,Not captured,
Not captured,Not captured,11/26/2020,12/31/2020,Not captured,Not captured,863949,020,00072,ARS-02-0057575,Beacon America,Not captured,Not captured,Not captured,,,,Parimi,Lakshmi Kumari,,04/02/1961,female,Not captured,Not captured,Not captured,Not captured,Not captured,Not captured,Not captured,Not captured,Not captured,Not captured,Not captured,Not captured,Not captured,Upendra Parimi,Spouse,Not captured,Not captured,Not captured,Not captured,Plot no 135 road no 1 Anantha saraswathi nagar,,Hyderabad,TG,500047,+1-9152495446,,Not captured,Not captured,uppiparimi@gmail.com,Not captured,802051072,,Not captured,Not captured,Not captured,Not captured,Not captured,Not captured,