EE Transaction Type,Dependent Transaction Type,Effective Date,Expiry Date,EE Signature,EE Signature Date,Control,Suffix,Account,Plan Number,Plan Name,Claim Office,Network ID Number,Customer Code,EE SSN,Dependent SSN,Dependent Relationship,Last Name,First Name,Middle Initial,DOB,Gender,Ethnicity,PCP/PCD,PCP/PCD Current Patient,Provider Cap Office Number,COB,Dep Student Indicator,Dep OOA Indicator,EE Prior Coverage Indicator,EE Late Entrant,EE Language Indicator,Hire Date,Earnings,Earnings Frequency,Beneficiary (Last Name First Name MI),Beneficiary Relationship,Continuation of Coverage Expiration Date,Continuation of Coverage Event Date,Continuation of Coverage Length of Coverage,Work Location Zip Code,Street Address Line 1,Street Address Line 2,City,State,Zip Code,Home Phone Number,Work Phone Number,Accept Code,Evidence Code,EE Email Address,Communication Disability Code,EE Alternate ID,Dep Alternate ID,Old Control,Old Suffix,Old Account,New Control,New Suffix,New Account,
Not captured,Not captured,11/24/2020,01/25/2021,Not captured,Not captured,863949,020,00072,ARS-02-0057560,Beacon America,Not captured,Not captured,Not captured,,,,Meiselman,Yitzchok Tzvi,,05/18/2003,male,Not captured,Not captured,Not captured,Not captured,Not captured,Not captured,Not captured,Not captured,Not captured,Not captured,Not captured,Not captured,Not captured,,,Not captured,Not captured,Not captured,Not captured,90 Northumberland st,,Salford,,M74DR,4475157334256,,Not captured,Not captured,rcmeiselman@gmail.com,Not captured,802051048,,Not captured,Not captured,Not captured,Not captured,Not captured,Not captured,
Not captured,Not captured,11/23/2020,11/21/2021,Not captured,Not captured,863949,020,00072,ARS-03-0057519,Essential International,Not captured,Not captured,Not captured,Passport(643088859),,,Kumata,Alyssa,Joy,03/05/1996,female,Not captured,Not captured,Not captured,Not captured,Not captured,Not captured,Not captured,Not captured,Not captured,Not captured,Not captured,Not captured,Not captured,,,Not captured,Not captured,Not captured,Not captured,6304 W Poinsettia Dr,,Glendale,Arizona,85304,6233302976,,Not captured,Not captured,alyssakumata@gmail.com,Not captured,802051002,,Not captured,Not captured,Not captured,Not captured,Not captured,Not captured,
Not captured,Not captured,11/24/2020,03/16/2021,Not captured,Not captured,863949,020,00072,ARS-01-0057544,Beacon International,Not captured,Not captured,Not captured,Passport(566156683),,,Blasenstein,Menachem,M,07/04/2004,male,Not captured,Not captured,Not captured,Not captured,Not captured,Not captured,Not captured,Not captured,Not captured,Not captured,Not captured,Not captured,Not captured,rochel blasenstein,mother,Not captured,Not captured,Not captured,Not captured,7109 Pheasant Cross Drive,,baltimore,Maine,21209,19173734156,,Not captured,Not captured,fxblasa@gmail.com,Not captured,802051032,,Not captured,Not captured,Not captured,Not captured,Not captured,Not captured,
Not captured,Not captured,11/20/2020,11/18/2021,Not captured,Not captured,863949,020,00072,ARS-03-0057501,Essential America,Not captured,Not captured,Not captured,Passport(568906237),,,Woods,Douglas,W,04/15/1965,male,Not captured,Not captured,Not captured,Not captured,Not captured,Not captured,Not captured,Not captured,Not captured,Not captured,Not captured,Not captured,Not captured,,,Not captured,Not captured,Not captured,Not captured,Col. Altos de Miramontes,,Tegucigalpa,Francisco Morazán,00000,12708879426,,Not captured,Not captured,kakiwo88@yahoo.com,Not captured,802050984,,Not captured,Not captured,Not captured,Not captured,Not captured,Not captured,
Not captured,Not captured,11/20/2020,11/18/2021,Not captured,Not captured,863949,020,00072,ARS-03-0057501,Essential America,Not captured,Not captured,Not captured,,Passport(549559470),Spouse,Woods,Karen,,10/23/1961,female,Not captured,Not captured,Not captured,Not captured,Not captured,Not captured,Not captured,Not captured,Not captured,Not captured,Not captured,Not captured,Not captured,,,Not captured,Not captured,Not captured,Not captured,Col. Altos de Miramontes,,Tegucigalpa,Francisco Morazán,00000,12708879426,,Not captured,Not captured,kakiwo88@yahoo.com,Not captured,,802051031,Not captured,Not captured,Not captured,Not captured,Not captured,Not captured,
Not captured,Not captured,11/23/2020,11/30/2020,Not captured,Not captured,863949,020,00072,ARS-02-0057543,Beacon America,Not captured,Not captured,Not captured,Passport(P7347469),,,MANIBABU,SURIYAKALA DEVI,,06/16/1963,female,Not captured,Not captured,Not captured,Not captured,Not captured,Not captured,Not captured,Not captured,Not captured,Not captured,Not captured,Not captured,Not captured,Divya Vijayakumar,,Not captured,Not captured,Not captured,Not captured,BOLLINENI HILLSIDE- PHASE-2 NOOKAMPALAYAM VILLAGE,,Chennai,TN,600126,+1-4084769104,,Not captured,Not captured,pedapudibhargav@gmail.com,Not captured,802051028,,Not captured,Not captured,Not captured,Not captured,Not captured,Not captured,
Not captured,Not captured,11/23/2020,01/23/2021,Not captured,Not captured,863949,020,00072,ARS-02-0057542,Beacon America,Not captured,Not captured,Not captured,,,,joshi,rama,,06/01/1943,female,Not captured,Not captured,Not captured,Not captured,Not captured,Not captured,Not captured,Not captured,Not captured,Not captured,Not captured,Not captured,Not captured,ASHISH JOSHI,SON,Not captured,Not captured,Not captured,Not captured,33 lavender dr,,edison,New Jersey,08820,4435706018,,Not captured,Not captured,ashish1875@gmail.com,Not captured,802051027,,Not captured,Not captured,Not captured,Not captured,Not captured,Not captured,
Not captured,Not captured,11/23/2020,12/06/2020,Not captured,Not captured,863949,020,00072,ARS-02-0057541,Beacon America,Not captured,Not captured,Not captured,Passport(E92580204),,,Chu,Ruoxi,,06/23/1991,female,Not captured,Not captured,Not captured,Not captured,Not captured,Not captured,Not captured,Not captured,Not captured,Not captured,Not captured,Not captured,Not captured,Chu Chunjie,,Not captured,Not captured,Not captured,Not captured,20 Bruyeres Mews,,Toronto,ON,M5V 0G8,+1-9295350538,,Not captured,Not captured,raechu1023@gmail.com,Not captured,802051026,,Not captured,Not captured,Not captured,Not captured,Not captured,Not captured,
Not captured,Not captured,11/23/2020,11/28/2020,Not captured,Not captured,863949,020,00072,ARS-02-0057540,Beacon America,Not captured,Not captured,Not captured,,,,WU,PING,,12/20/1948,female,Not captured,Not captured,Not captured,Not captured,Not captured,Not captured,Not captured,Not captured,Not captured,Not captured,Not captured,Not captured,Not captured,RUI ZHAO,Spouse,Not captured,Not captured,Not captured,Not captured,3-2-201 2nd Area,,Beijing,Beijing,100085,+1-9844394630,+86-17611605671,Not captured,Not captured,jarry.zhao@outlook.com,Not captured,802051025,,Not captured,Not captured,Not captured,Not captured,Not captured,Not captured,
Not captured,Not captured,11/23/2020,11/28/2020,Not captured,Not captured,863949,020,00072,ARS-02-0057539,Beacon America,Not captured,Not captured,Not captured,Passport(G49836186),,,ZHAO,KEQIANG,,11/27/1947,male,Not captured,Not captured,Not captured,Not captured,Not captured,Not captured,Not captured,Not captured,Not captured,Not captured,Not captured,Not captured,Not captured,RUI ZHAO,,Not captured,Not captured,Not captured,Not captured,3-2-201 2nd Area,,Beijing,Beijing,100085,+1-9844394630,+86-17611605671,Not captured,Not captured,jarry.zhao@outlook.com,Not captured,802051024,,Not captured,Not captured,Not captured,Not captured,Not captured,Not captured,
Not captured,Not captured,11/22/2020,11/20/2021,Not captured,Not captured,863949,020,00072,ARS-03-0057518,Essential America,Not captured,Not captured,Not captured,Passport(4982911533),,,Kumata,Andrew,Alan,01/30/1990,male,Not captured,Not captured,Not captured,Not captured,Not captured,Not captured,Not captured,Not captured,Not captured,Not captured,Not captured,Not captured,Not captured,,,Not captured,Not captured,Not captured,Not captured,6304 W Poinsettia Dr,,Glendale,Arizona,85304,5304003466,,Not captured,Not captured,drewkumata@gmail.com,Not captured,802051001,,Not captured,Not captured,Not captured,Not captured,Not captured,Not captured,
Not captured,Not captured,11/23/2020,12/22/2020,Not captured,Not captured,863949,020,00072,ARS-01-0057537,Beacon International,Not captured,Not captured,Not captured,Passport(C6274066),,,NGUYEN,HUU KHANH TUONG,,09/29/1988,female,Not captured,Not captured,Not captured,Not captured,Not captured,Not captured,Not captured,Not captured,Not captured,Not captured,Not captured,Not captured,Not captured,TRAN THI VUI,,Not captured,Not captured,Not captured,Not captured,9574 BROADWAY,,TEMPLE CITY,CA,91780-3135,+1-6268981414,,Not captured,Not captured,sales@2vntravel.com,Not captured,802051022,,Not captured,Not captured,Not captured,Not captured,Not captured,Not captured,
Not captured,Not captured,11/22/2020,01/31/2021,Not captured,Not captured,863949,020,00072,ARS-01-0057534,Beacon International,Not captured,Not captured,Not captured,,,,Ospina,Juan,M,09/08/1981,male,Not captured,Not captured,Not captured,Not captured,Not captured,Not captured,Not captured,Not captured,Not captured,Not captured,Not captured,Not captured,Not captured,,,Not captured,Not captured,Not captured,Not captured,932 E WOODLAWN RD,,Charlotte,North Carolina,28209,,,Not captured,Not captured,juanman81@gmail.com,Not captured,802051019,,Not captured,Not captured,Not captured,Not captured,Not captured,Not captured,
Not captured,Not captured,11/22/2020,12/22/2020,Not captured,Not captured,863949,020,00072,ARS-02-0057533,Beacon America,Not captured,Not captured,Not captured,Passport(L3180667),,,Mohammed,Salman,,04/14/1992,male,Not captured,Not captured,Not captured,Not captured,Not captured,Not captured,Not captured,Not captured,Not captured,Not captured,Not captured,Not captured,Not captured,Aneesa Banu,,Not captured,Not captured,Not captured,Not captured,19-4-279/A 86,,Hyderabad,TG,500053,+1-(347) 955-8979,,Not captured,Not captured,salmanmohd2892@gmail.com,Not captured,802051018,,Not captured,Not captured,Not captured,Not captured,Not captured,Not captured,
Not captured,Not captured,11/22/2020,11/27/2020,Not captured,Not captured,863949,020,00072,ARS-01-0057532,Beacon International,Not captured,Not captured,Not captured,Passport(507381338),,,Greenberg,Gil,,02/06/1993,male,Not captured,Not captured,Not captured,Not captured,Not captured,Not captured,Not captured,Not captured,Not captured,Not captured,Not captured,Not captured,Not captured,Dorit Greenberg,,Not captured,Not captured,Not captured,Not captured,400e 90th street #19D,,New York,NY,10128,+1-516-695-4533,+1-516-361-9192,Not captured,Not captured,doritg@verizon.net,Not captured,802051017,,Not captured,Not captured,Not captured,Not captured,Not captured,Not captured,
Not captured,Not captured,11/21/2020,12/01/2020,Not captured,Not captured,863949,020,00072,ARS-02-0057531,Beacon America,Not captured,Not captured,Not captured,Passport(547915076),,,Timm,Krystle,,12/03/1984,female,Not captured,Not captured,Not captured,Not captured,Not captured,Not captured,Not captured,Not captured,Not captured,Not captured,Not captured,Not captured,Not captured,Chloe Timm,Sister,Not captured,Not captured,Not captured,Not captured,622 E 11th Street,,New York,New York,10009,646-620-0257,,Not captured,Not captured,krystletim@gmail.com,Not captured,802051016,,Not captured,Not captured,Not captured,Not captured,Not captured,Not captured,
Not captured,Not captured,11/22/2020,12/31/2020,Not captured,Not captured,863949,020,00072,ARS-01-0057530,Beacon International,Not captured,Not captured,Not captured,,,,Perkins,Avery Murdock,,08/06/2007,female,Not captured,Not captured,Not captured,Not captured,Not captured,Not captured,Not captured,Not captured,Not captured,Not captured,Not captured,Not captured,Not captured,Jennifer Dye,Dependent,Not captured,Not captured,Not captured,Not captured,524 Marlowe Rd.,,Raleigh,NC,27609,+1-9193892360,,Not captured,Not captured,juliaeperkins10@hotmail.com,Not captured,802051015,,Not captured,Not captured,Not captured,Not captured,Not captured,Not captured,
Not captured,Not captured,11/22/2020,12/31/2020,Not captured,Not captured,863949,020,00072,ARS-01-0057529,Beacon International,Not captured,Not captured,Not captured,,,,Perkins III,John Richard,,01/29/2005,male,Not captured,Not captured,Not captured,Not captured,Not captured,Not captured,Not captured,Not captured,Not captured,Not captured,Not captured,Not captured,Not captured,Jennifer Dye,Dependent,Not captured,Not captured,Not captured,Not captured,524 Marlowe Rd.,,Raleigh,NC,27609,+1-9193892360,,Not captured,Not captured,juliaeperkins10@hotmail.com,Not captured,802051014,,Not captured,Not captured,Not captured,Not captured,Not captured,Not captured,
Not captured,Not captured,11/22/2020,12/31/2020,Not captured,Not captured,863949,020,00072,ARS-01-0057528,Beacon International,Not captured,Not captured,Not captured,,,,Perkins,Julia Ellen,,02/08/1976,female,Not captured,Not captured,Not captured,Not captured,Not captured,Not captured,Not captured,Not captured,Not captured,Not captured,Not captured,Not captured,Not captured,Jennifer Dye,Spouse,Not captured,Not captured,Not captured,Not captured,524 Marlowe Rd.,,Raleigh,NC,27609,+1-9193892360,,Not captured,Not captured,juliaeperkins10@hotmail.com,Not captured,802051013,,Not captured,Not captured,Not captured,Not captured,Not captured,Not captured,
Not captured,Not captured,11/22/2020,12/31/2020,Not captured,Not captured,863949,020,00072,ARS-01-0057527,Beacon International,Not captured,Not captured,Not captured,Passport(546363623),,,Perkins II,John Richard,,01/31/1971,male,Not captured,Not captured,Not captured,Not captured,Not captured,Not captured,Not captured,Not captured,Not captured,Not captured,Not captured,Not captured,Not captured,Jennifer Dye,,Not captured,Not captured,Not captured,Not captured,524 Marlowe Rd.,,Raleigh,NC,27609,+1-9193892360,,Not captured,Not captured,juliaeperkins10@hotmail.com,Not captured,802051012,,Not captured,Not captured,Not captured,Not captured,Not captured,Not captured,
Not captured,Not captured,11/21/2020,12/01/2020,Not captured,Not captured,863949,020,00072,ARS-01-0057524,Beacon International,Not captured,Not captured,Not captured,,,,Sakhterova,Anastasia,,09/09/1991,female,Not captured,Not captured,Not captured,Not captured,Not captured,Not captured,Not captured,Not captured,Not captured,Not captured,Not captured,Not captured,Not captured,,,Not captured,Not captured,Not captured,Not captured,Dzerzhinsky Lesnaya st. building 15 ap. 143,,Moscow,,140090,,,Not captured,Not captured,Pishivotvet@gmail.com,Not captured,802051009,,Not captured,Not captured,Not captured,Not captured,Not captured,Not captured,
Not captured,Not captured,11/21/2020,05/18/2021,Not captured,Not captured,863949,020,00072,ARS-02-0057520,Beacon America,Not captured,Not captured,Not captured,Passport(K2694599),,,Joseph,Philomena,,11/16/1962,female,Not captured,Not captured,Not captured,Not captured,Not captured,Not captured,Not captured,Not captured,Not captured,Not captured,Not captured,Not captured,Not captured,Nancy weaver,,Not captured,Not captured,Not captured,Not captured,No. 23 madonna villa michael palayam,,Bangalore,KA,560075,+1-5612541280,,Not captured,Not captured,mweav6387@gmail.com,Not captured,802051003,,Not captured,Not captured,Not captured,Not captured,Not captured,Not captured,
Not captured,Not captured,11/21/2020,03/21/2021,Not captured,Not captured,863949,020,00072,ARS-02-0057514,Beacon America,Not captured,Not captured,Not captured,,,,Vallapureddy,Prameela,,08/01/1963,female,Not captured,Not captured,Not captured,Not captured,Not captured,Not captured,Not captured,Not captured,Not captured,Not captured,Not captured,Not captured,Not captured,Varaprasada Reddy,Spouse,Not captured,Not captured,Not captured,Not captured,4/880-D6-1 Mahatma Nagar,,YSR District,AP,516309,+1-8582184123,,Not captured,Not captured,varaprasada.reddy@gmail.com,Not captured,802050997,,Not captured,Not captured,Not captured,Not captured,Not captured,Not captured,
Not captured,Not captured,11/21/2020,03/21/2021,Not captured,Not captured,863949,020,00072,ARS-02-0057513,Beacon America,Not captured,Not captured,Not captured,Passport(K1420578),,,Vallapu Reddy,Narayana Reddy,,07/01/1955,male,Not captured,Not captured,Not captured,Not captured,Not captured,Not captured,Not captured,Not captured,Not captured,Not captured,Not captured,Not captured,Not captured,Varaprasada Reddy,,Not captured,Not captured,Not captured,Not captured,4/880-D6-1 Mahatma Nagar,,YSR District,AP,516309,+1-8582184123,,Not captured,Not captured,varaprasada.reddy@gmail.com,Not captured,802050996,,Not captured,Not captured,Not captured,Not captured,Not captured,Not captured,
Not captured,Not captured,11/20/2020,11/27/2020,Not captured,Not captured,863949,020,00072,OVI-41-0057512,Overseas Visitors Insurance Plan A,Not captured,Not captured,Not captured,Passport(Z4143214),,,Chaudhari,Kamuben,,10/15/1958,female,Not captured,Not captured,Not captured,Not captured,Not captured,Not captured,Not captured,Not captured,Not captured,Not captured,Not captured,Not captured,Not captured,Nirav Chaudhari,Son,Not captured,Not captured,Not captured,Not captured,11112 GLENCORSE AVE,,RICHMOND,Texas,77407,+18329458043,,Not captured,Not captured,bholabhaic@gmail.com,Not captured,802050995,,Not captured,Not captured,Not captured,Not captured,Not captured,Not captured,
Not captured,Not captured,11/20/2020,11/27/2020,Not captured,Not captured,863949,020,00072,OVI-41-0057511,Overseas Visitors Insurance Plan A,Not captured,Not captured,Not captured,Passport(Z4143215),,,Chaudhari,Bholabhai,,06/01/1959,male,Not captured,Not captured,Not captured,Not captured,Not captured,Not captured,Not captured,Not captured,Not captured,Not captured,Not captured,Not captured,Not captured,Nirav Chaudhari,Son,Not captured,Not captured,Not captured,Not captured,11112 GLENCORSE AVE,,RICHMOND,Texas,77407,+18329458043,,Not captured,Not captured,bholabhaic@gmail.com,Not captured,802050994,,Not captured,Not captured,Not captured,Not captured,Not captured,Not captured,
Not captured,Not captured,11/19/2020,02/15/2021,Not captured,Not captured,863949,020,00072,ARS-02-0057507,Beacon America,Not captured,Not captured,Not captured,,,,RAMOS,JUAN JOSE VILLALOBOS,,03/24/1978,male,Not captured,Not captured,Not captured,Not captured,Not captured,Not captured,Not captured,Not captured,Not captured,Not captured,Not captured,Not captured,Not captured,CONRADO GERMAN ISLA,SON,Not captured,Not captured,Not captured,Not captured,LOS PARAISOS 1567,,CIPOLLETTI,Buenos Aires Province,8324,+54 67823517,,Not captured,Not captured,ANGIECRELLIN@HOTMAIL.COM,Not captured,802050990,,Not captured,Not captured,Not captured,Not captured,Not captured,Not captured,
Not captured,Not captured,11/19/2020,02/15/2021,Not captured,Not captured,863949,020,00072,ARS-02-0057506,Beacon America,Not captured,Not captured,Not captured,,,,ISLA,EUGENIA BERENICE,,03/13/1993,female,Not captured,Not captured,Not captured,Not captured,Not captured,Not captured,Not captured,Not captured,Not captured,Not captured,Not captured,Not captured,Not captured,CONRADO GERMAN ISLA,SON,Not captured,Not captured,Not captured,Not captured,LOS PARAISOS 1567,,CIPOLLETTI,Buenos Aires Province,8324,+54 67823517,,Not captured,Not captured,ANGIECRELLIN@HOTMAIL.COM,Not captured,802050989,,Not captured,Not captured,Not captured,Not captured,Not captured,Not captured,
Not captured,Not captured,11/19/2020,02/15/2021,Not captured,Not captured,863949,020,00072,ARS-02-0057505,Beacon America,Not captured,Not captured,Not captured,,,,CARNAVALE,CRISTINA MONICA,,07/21/1966,female,Not captured,Not captured,Not captured,Not captured,Not captured,Not captured,Not captured,Not captured,Not captured,Not captured,Not captured,Not captured,Not captured,CONRADO GERMAN ISLA,SON,Not captured,Not captured,Not captured,Not captured,LOS PARAISOS 1567,,CIPOLLETTI,Buenos Aires Province,8324,+54 67823517,,Not captured,Not captured,ANGIECRELLIN@HOTMAIL.COM,Not captured,802050988,,Not captured,Not captured,Not captured,Not captured,Not captured,Not captured,
Not captured,Not captured,11/19/2020,02/15/2021,Not captured,Not captured,863949,020,00072,ARS-02-0057504,Beacon America,Not captured,Not captured,Not captured,Passport(14169242),,,ISLA,CARLOS EUGENIO DEL CORAZON DE JESUS,,04/25/1960,male,Not captured,Not captured,Not captured,Not captured,Not captured,Not captured,Not captured,Not captured,Not captured,Not captured,Not captured,Not captured,Not captured,CONRADO GERMAN ISLA,SON,Not captured,Not captured,Not captured,Not captured,LOS PARAISOS 1567,,CIPOLLETTI,Buenos Aires Province,8324,+54 67823517,,Not captured,Not captured,ANGIECRELLIN@HOTMAIL.COM,Not captured,802050987,,Not captured,Not captured,Not captured,Not captured,Not captured,Not captured,
Not captured,Not captured,11/19/2020,01/14/2021,Not captured,Not captured,863949,020,00072,ARS-02-0057503,Beacon America,Not captured,Not captured,Not captured,,,,Cohen,Daniel,,10/02/1986,male,Not captured,Not captured,Not captured,Not captured,Not captured,Not captured,Not captured,Not captured,Not captured,Not captured,Not captured,Not captured,Not captured,,,Not captured,Not captured,Not captured,Not captured,15 Derech haAchayot,,Jerusalem,,95742,,,Not captured,Not captured,dcohenj@Gmail.com,Not captured,802050986,,Not captured,Not captured,Not captured,Not captured,Not captured,Not captured,
Not captured,Not captured,11/19/2020,12/19/2020,Not captured,Not captured,863949,020,00072,ARS-02-0057502,Beacon America,Not captured,Not captured,Not captured,Passport(AAA546104),,,Masera,Paola,,10/08/1976,female,Not captured,Not captured,Not captured,Not captured,Not captured,Not captured,Not captured,Not captured,Not captured,Not captured,Not captured,Not captured,Not captured,Adriana Maria Fernandez,Mother,Not captured,Not captured,Not captured,Not captured,PASEO MALECON ZONA HOTELERA,,LOS CABOS,Baja California Sur,23405,6241821718,,Not captured,Not captured,paola@paolamasera.com,Not captured,802050985,,Not captured,Not captured,Not captured,Not captured,Not captured,Not captured,
Not captured,Not captured,11/20/2020,02/19/2021,Not captured,Not captured,863949,020,00072,ARS-02-0057499,Beacon America,Not captured,Not captured,Not captured,,,,Surati,Manjulaben Dhansukhlal,,02/04/1951,female,Not captured,Not captured,Not captured,Not captured,Not captured,Not captured,Not captured,Not captured,Not captured,Not captured,Not captured,Not captured,Not captured,Sejal Patel,Spouse,Not captured,Not captured,Not captured,Not captured,B5 Anando Apartment,,Surat,GJ,395006,+1-4092016892,+1-4125524234,Not captured,Not captured,patelai2609@gmail.com,Not captured,802050982,,Not captured,Not captured,Not captured,Not captured,Not captured,Not captured,
Not captured,Not captured,11/20/2020,02/19/2021,Not captured,Not captured,863949,020,00072,ARS-02-0057498,Beacon America,Not captured,Not captured,Not captured,Passport(S5655939),,,Surati,Dhansukhlal Ratanji,,03/31/1951,male,Not captured,Not captured,Not captured,Not captured,Not captured,Not captured,Not captured,Not captured,Not captured,Not captured,Not captured,Not captured,Not captured,Sejal Patel,,Not captured,Not captured,Not captured,Not captured,B5 Anando Apartment,,Surat,GJ,395006,+1-4092016892,+1-4125524234,Not captured,Not captured,patelai2609@gmail.com,Not captured,802050981,,Not captured,Not captured,Not captured,Not captured,Not captured,Not captured,