EE Transaction Type,Dependent Transaction Type,Effective Date,Expiry Date,EE Signature,EE Signature Date,Control,Suffix,Account,Plan Number,Plan Name,Claim Office,Network ID Number,Customer Code,EE SSN,Dependent SSN,Dependent Relationship,Last Name,First Name,Middle Initial,DOB,Gender,Ethnicity,PCP/PCD,PCP/PCD Current Patient,Provider Cap Office Number,COB,Dep Student Indicator,Dep OOA Indicator,EE Prior Coverage Indicator,EE Late Entrant,EE Language Indicator,Hire Date,Earnings,Earnings Frequency,Beneficiary (Last Name First Name MI),Beneficiary Relationship,Continuation of Coverage Expiration Date,Continuation of Coverage Event Date,Continuation of Coverage Length of Coverage,Work Location Zip Code,Street Address Line 1,Street Address Line 2,City,State,Zip Code,Home Phone Number,Work Phone Number,Accept Code,Evidence Code,EE Email Address,Communication Disability Code,EE Alternate ID,Dep Alternate ID,Old Control,Old Suffix,Old Account,New Control,New Suffix,New Account,
Not captured,Not captured,11/16/2020,11/24/2020,Not captured,Not captured,863949,020,00072,OVI-41-0057474,Overseas Visitors Insurance Plan A,Not captured,Not captured,Not captured,Passport(L8438084),,,Shah,Madhuri,H,03/02/1954,female,Not captured,Not captured,Not captured,Not captured,Not captured,Not captured,Not captured,Not captured,Not captured,Not captured,Not captured,Not captured,Not captured,Kalpesh Harendra Shah,Son,Not captured,Not captured,Not captured,Not captured,8537 Sandpiper Ridge Ave,,Tampa,Florida,33647,8139431007,,Not captured,Not captured,kalpeshmail@gmail.com,Not captured,802050947,,Not captured,Not captured,Not captured,Not captured,Not captured,Not captured,
Not captured,Not captured,11/16/2020,11/24/2020,Not captured,Not captured,863949,020,00072,OVI-41-0057473,Overseas Visitors Insurance Plan A,Not captured,Not captured,Not captured,Passport(L9723625),,,Shah,Harendra,B,03/10/1949,male,Not captured,Not captured,Not captured,Not captured,Not captured,Not captured,Not captured,Not captured,Not captured,Not captured,Not captured,Not captured,Not captured,Kalpesh Harendra Shah,Son,Not captured,Not captured,Not captured,Not captured,8537 Sandpiper Ridge Ave,,Tampa,Florida,33647,8139431007,,Not captured,Not captured,kalpeshmail@gmail.com,Not captured,802050946,,Not captured,Not captured,Not captured,Not captured,Not captured,Not captured,
Not captured,Not captured,11/15/2020,11/21/2020,Not captured,Not captured,863949,020,00072,ARS-02-0057469,Beacon America,Not captured,Not captured,Not captured,,,,Gupta,Rajni,,08/17/1957,female,Not captured,Not captured,Not captured,Not captured,Not captured,Not captured,Not captured,Not captured,Not captured,Not captured,Not captured,Not captured,Not captured,Manish Kumar Gupta,Son,Not captured,Not captured,Not captured,Not captured,3273 John F Kennedy blvd,,Jersey City,New Jersey,07306,2014967693,,Not captured,Not captured,manishg658@gmail.com,Not captured,802050939,,Not captured,Not captured,Not captured,Not captured,Not captured,Not captured,
Not captured,Not captured,11/15/2020,11/21/2020,Not captured,Not captured,863949,020,00072,ARS-02-0057468,Beacon America,Not captured,Not captured,Not captured,,,,Gupta,Sunil,Kumar,09/02/1954,male,Not captured,Not captured,Not captured,Not captured,Not captured,Not captured,Not captured,Not captured,Not captured,Not captured,Not captured,Not captured,Not captured,Manish Kumar Gupta,Son,Not captured,Not captured,Not captured,Not captured,3273 John F Kennedy blvd,,Jersey City,New Jersey,07306,2014967693,,Not captured,Not captured,manishg658@gmail.com,Not captured,802050938,,Not captured,Not captured,Not captured,Not captured,Not captured,Not captured,
Not captured,Not captured,11/15/2020,11/18/2020,Not captured,Not captured,863949,020,00072,ARS-01-0057467,Beacon International,Not captured,Not captured,Not captured,,,,Halberstam,Rachel,,03/27/1997,female,Not captured,Not captured,Not captured,Not captured,Not captured,Not captured,Not captured,Not captured,Not captured,Not captured,Not captured,Not captured,Not captured,,,Not captured,Not captured,Not captured,Not captured,70 Randolph Ave,,waterbury,Connecticut,06710,,,Not captured,Not captured,rhalberstam@gmail.com,Not captured,802050937,,Not captured,Not captured,Not captured,Not captured,Not captured,Not captured,
Not captured,Not captured,11/15/2020,11/18/2020,Not captured,Not captured,863949,020,00072,ARS-01-0057466,Beacon International,Not captured,Not captured,Not captured,,,,Shteierman,Yisroel,M,08/20/1997,male,Not captured,Not captured,Not captured,Not captured,Not captured,Not captured,Not captured,Not captured,Not captured,Not captured,Not captured,Not captured,Not captured,,,Not captured,Not captured,Not captured,Not captured,70 Randolph Ave,,waterbury,Connecticut,06710,,,Not captured,Not captured,rhalberstam@gmail.com,Not captured,802050936,,Not captured,Not captured,Not captured,Not captured,Not captured,Not captured,
Not captured,Not captured,11/16/2020,11/30/2020,Not captured,Not captured,863949,020,00072,ARS-01-0057463,Beacon International,Not captured,Not captured,Not captured,Passport(651185491),,,Schob,Gregory,A,10/09/1959,male,Not captured,Not captured,Not captured,Not captured,Not captured,Not captured,Not captured,Not captured,Not captured,Not captured,Not captured,Not captured,Not captured,Charles Schob,son,Not captured,Not captured,Not captured,Not captured,779 Arrow Trail,,Bozeman,Montana,59718,5599771600,,Not captured,Not captured,vicki@safeguard365.com,Not captured,802050933,,Not captured,Not captured,Not captured,Not captured,Not captured,Not captured,
Not captured,Not captured,11/16/2020,11/30/2020,Not captured,Not captured,863949,020,00072,ARS-01-0057462,Beacon International,Not captured,Not captured,Not captured,Passport(534980046),,,Schob,Vicki,L,10/11/1958,female,Not captured,Not captured,Not captured,Not captured,Not captured,Not captured,Not captured,Not captured,Not captured,Not captured,Not captured,Not captured,Not captured,Caitlin Schob,daughter,Not captured,Not captured,Not captured,Not captured,779 Arrow Trail,,Bozeman,Montana,59718,5599777335,,Not captured,Not captured,vicki@safeguard365.com,Not captured,802050932,,Not captured,Not captured,Not captured,Not captured,Not captured,Not captured,
Not captured,Not captured,11/15/2020,04/27/2021,Not captured,Not captured,863949,020,00072,OVI-28-0057459,OverseasCare Visitors Insurance Plan,Not captured,Not captured,Not captured,Passport(M8422673),,,NA,Vandana,,02/13/1952,female,Not captured,Not captured,Not captured,Not captured,Not captured,Not captured,Not captured,Not captured,Not captured,Not captured,Not captured,Not captured,Not captured,Rohan Gandhi,Son,Not captured,Not captured,Not captured,Not captured,11612 Orange Palm Way,,Tampa,Florida,33626,813-335-9096,,Not captured,Not captured,rgandhi0803@gmail.com,Not captured,802050929,,Not captured,Not captured,Not captured,Not captured,Not captured,Not captured,
Not captured,Not captured,11/15/2020,04/27/2021,Not captured,Not captured,863949,020,00072,OVI-28-0057458,OverseasCare Visitors Insurance Plan,Not captured,Not captured,Not captured,Passport(M8422673),,,Gandhi,Kharati,Lal,04/03/1948,male,Not captured,Not captured,Not captured,Not captured,Not captured,Not captured,Not captured,Not captured,Not captured,Not captured,Not captured,Not captured,Not captured,Rohan Gandhi,Son,Not captured,Not captured,Not captured,Not captured,11612 Orange Palm Way,,Tampa,Florida,33626,813-335-9096,,Not captured,Not captured,rgandhi0803@gmail.com,Not captured,802050928,,Not captured,Not captured,Not captured,Not captured,Not captured,Not captured,
Not captured,Not captured,11/13/2020,11/30/2020,Not captured,Not captured,863949,020,00072,ARS-02-0057452,Beacon America,Not captured,Not captured,Not captured,,,,HOSSAIN,MOHAMMAD MAHDI,,06/25/2001,male,Not captured,Not captured,Not captured,Not captured,Not captured,Not captured,Not captured,Not captured,Not captured,Not captured,Not captured,Not captured,Not captured,,,Not captured,Not captured,Not captured,Not captured,101-210 OAK STREET,,TORONTO,Ontario,M5A 2C9,,,Not captured,Not captured,MAHDIFICATION@PROTONMAIL.COM,Not captured,802050915,,Not captured,Not captured,Not captured,Not captured,Not captured,Not captured,
Not captured,Not captured,11/12/2020,12/24/2020,Not captured,Not captured,863949,020,00072,ARS-02-0057450,Beacon America,Not captured,Not captured,Not captured,,,,Jain,Madhu,,03/02/1965,female,Not captured,Not captured,Not captured,Not captured,Not captured,Not captured,Not captured,Not captured,Not captured,Not captured,Not captured,Not captured,Not captured,Garima Jain,Daughter,Not captured,Not captured,Not captured,Not captured,10189 south foothill blvd,,Cupertino,California,95014,4087180900,,Not captured,Not captured,kothari@gmail.com,Not captured,802050912,,Not captured,Not captured,Not captured,Not captured,Not captured,Not captured,
Not captured,Not captured,11/12/2020,12/24/2020,Not captured,Not captured,863949,020,00072,ARS-02-0057449,Beacon America,Not captured,Not captured,Not captured,,,,Jain,HimmatSingh Rajmal,,09/30/1955,male,Not captured,Not captured,Not captured,Not captured,Not captured,Not captured,Not captured,Not captured,Not captured,Not captured,Not captured,Not captured,Not captured,Garima Jain,Daughter,Not captured,Not captured,Not captured,Not captured,10189 south foothill blvd,,Cupertino,California,95014,4087180900,,Not captured,Not captured,kothari@gmail.com,Not captured,802050911,,Not captured,Not captured,Not captured,Not captured,Not captured,Not captured,
Not captured,Not captured,11/12/2020,01/31/2021,Not captured,Not captured,863949,020,00072,ARS-01-0057448,Beacon International,Not captured,Not captured,Not captured,,,,Rados,Dario,T,08/10/1981,male,Not captured,Not captured,Not captured,Not captured,Not captured,Not captured,Not captured,Not captured,Not captured,Not captured,Not captured,Not captured,Not captured,,,Not captured,Not captured,Not captured,Not captured,7763 SHARLENE DR,,Dublin,Ohio,43016,,,Not captured,Not captured,drados81@gmail.com,Not captured,802050910,,Not captured,Not captured,Not captured,Not captured,Not captured,Not captured,
Not captured,Not captured,11/13/2020,11/11/2021,Not captured,Not captured,863949,020,00072,ARS-03-0057377,Essential America,Not captured,Not captured,Not captured,Passport(488222483),,,Simpson,Geoffrey,Scott,06/06/1974,male,Not captured,Not captured,Not captured,Not captured,Not captured,Not captured,Not captured,Not captured,Not captured,Not captured,Not captured,Not captured,Not captured,,,Not captured,Not captured,Not captured,Not captured,Plot 830,,Ongata Rongai,,00511,6096444664,,Not captured,Not captured,Geoffrey.s.simpson@gmail.com,Not captured,802050800,,Not captured,Not captured,Not captured,Not captured,Not captured,Not captured,
Not captured,Not captured,11/13/2020,11/11/2021,Not captured,Not captured,863949,020,00072,ARS-03-0057377,Essential America,Not captured,Not captured,Not captured,,Passport(488222482),Spouse,Simpson,Linda,Ann,11/28/1970,female,Not captured,Not captured,Not captured,Not captured,Not captured,Not captured,Not captured,Not captured,Not captured,Not captured,Not captured,Not captured,Not captured,,,Not captured,Not captured,Not captured,Not captured,Plot 830,,Ongata Rongai,,00511,6096444664,,Not captured,Not captured,Geoffrey.s.simpson@gmail.com,Not captured,,802050907,Not captured,Not captured,Not captured,Not captured,Not captured,Not captured,
Not captured,Not captured,11/13/2020,11/11/2021,Not captured,Not captured,863949,020,00072,ARS-03-0057377,Essential America,Not captured,Not captured,Not captured,,Passport(546905391),Dependant,Simpson,Christian,Matthew,11/07/1999,male,Not captured,Not captured,Not captured,Not captured,Not captured,Not captured,Not captured,Not captured,Not captured,Not captured,Not captured,Not captured,Not captured,,,Not captured,Not captured,Not captured,Not captured,Plot 830,,Ongata Rongai,,00511,6096444664,,Not captured,Not captured,Geoffrey.s.simpson@gmail.com,Not captured,,802050908,Not captured,Not captured,Not captured,Not captured,Not captured,Not captured,
Not captured,Not captured,11/13/2020,11/11/2021,Not captured,Not captured,863949,020,00072,ARS-03-0057377,Essential America,Not captured,Not captured,Not captured,,Passport(546905392),Dependant,Simpson,Faith,Warinda,08/29/2002,female,Not captured,Not captured,Not captured,Not captured,Not captured,Not captured,Not captured,Not captured,Not captured,Not captured,Not captured,Not captured,Not captured,,,Not captured,Not captured,Not captured,Not captured,Plot 830,,Ongata Rongai,,00511,6096444664,,Not captured,Not captured,Geoffrey.s.simpson@gmail.com,Not captured,,802050909,Not captured,Not captured,Not captured,Not captured,Not captured,Not captured,
Not captured,Not captured,11/12/2020,01/10/2021,Not captured,Not captured,863949,020,00072,ARS-02-0057447,Beacon America,Not captured,Not captured,Not captured,Passport(T6937917),,,pocham reddy,Suguna,,11/15/1962,female,Not captured,Not captured,Not captured,Not captured,Not captured,Not captured,Not captured,Not captured,Not captured,Not captured,Not captured,Not captured,Not captured,Surya Prakash Pocham,,Not captured,Not captured,Not captured,Not captured,TNR constructions hastinapuram karmanghat,,hyderabad,TG,500079,+1-9527372812,+1-9083041981,Not captured,Not captured,srilathavaddireddy@gmail.com,Not captured,802050905,,Not captured,Not captured,Not captured,Not captured,Not captured,Not captured,
Not captured,Not captured,11/11/2020,03/15/2021,Not captured,Not captured,863949,020,00072,ARS-01-0057444,Beacon International,Not captured,Not captured,Not captured,,,,Schlesinger,Sol,,11/28/2001,male,Not captured,Not captured,Not captured,Not captured,Not captured,Not captured,Not captured,Not captured,Not captured,Not captured,Not captured,Not captured,Not captured,,,Not captured,Not captured,Not captured,Not captured,1218 55th street,,Brooklyn NY,,11219,917-703-8007,,Not captured,Not captured,leahschlesinger@gmail.com,Not captured,802050902,,Not captured,Not captured,Not captured,Not captured,Not captured,Not captured,
Not captured,Not captured,11/11/2020,11/09/2021,Not captured,Not captured,863949,020,00072,ARS-03-0057426,Essential America,Not captured,Not captured,Not captured,Passport(HK096119),,,Patel,Rashmikaben,C,06/28/1972,female,Not captured,Not captured,Not captured,Not captured,Not captured,Not captured,Not captured,Not captured,Not captured,Not captured,Not captured,Not captured,Not captured,,,Not captured,Not captured,Not captured,Not captured,141 Shadywood Lane,,Elk Grove Village,Illinois,60007,847-385-4231,,Not captured,Not captured,chitu.patel@hotmail.com,Not captured,802050884,,Not captured,Not captured,Not captured,Not captured,Not captured,Not captured,
Not captured,Not captured,11/11/2020,11/23/2020,Not captured,Not captured,863949,020,00072,ARS-01-0057441,Beacon International,Not captured,Not captured,Not captured,,,,yanikian,andreas,,06/13/1990,male,Not captured,Not captured,Not captured,Not captured,Not captured,Not captured,Not captured,Not captured,Not captured,Not captured,Not captured,Not captured,Not captured,,,Not captured,Not captured,Not captured,Not captured,3131 lama ave,,Long Beach,California,90808,,,Not captured,Not captured,andreas.yanikian@gmail.com,Not captured,802050899,,Not captured,Not captured,Not captured,Not captured,Not captured,Not captured,
Not captured,Not captured,11/11/2020,11/16/2020,Not captured,Not captured,863949,020,00072,ARS-01-0057440,Beacon International,Not captured,Not captured,Not captured,,,,Duran,Karen,E,06/14/1989,female,Not captured,Not captured,Not captured,Not captured,Not captured,Not captured,Not captured,Not captured,Not captured,Not captured,Not captured,Not captured,Not captured,,,Not captured,Not captured,Not captured,Not captured,243 N Whitewater Park Blvd,,Boise,Idaho,83702,,,Not captured,Not captured,Hansrk.id@gmail.com,Not captured,802050898,,Not captured,Not captured,Not captured,Not captured,Not captured,Not captured,
Not captured,Not captured,11/11/2020,11/16/2020,Not captured,Not captured,863949,020,00072,ARS-01-0057439,Beacon International,Not captured,Not captured,Not captured,,,,Hansen,Regan,K,03/22/1989,male,Not captured,Not captured,Not captured,Not captured,Not captured,Not captured,Not captured,Not captured,Not captured,Not captured,Not captured,Not captured,Not captured,,,Not captured,Not captured,Not captured,Not captured,243 N Whitewater Park Blvd,,Boise,Idaho,83702,,,Not captured,Not captured,Hansrk.id@gmail.com,Not captured,802050897,,Not captured,Not captured,Not captured,Not captured,Not captured,Not captured,
Not captured,Not captured,11/11/2020,01/11/2021,Not captured,Not captured,863949,020,00072,ARS-02-0057438,Beacon America,Not captured,Not captured,Not captured,Passport(20906102),,,Suky,Ester,,12/18/1958,female,Not captured,Not captured,Not captured,Not captured,Not captured,Not captured,Not captured,Not captured,Not captured,Not captured,Not captured,Not captured,Not captured,,,Not captured,Not captured,Not captured,Not captured,450 East 83rd Street Unit 8C,,New York,New York,10028,9173372777,,Not captured,Not captured,bensuky@aol.com,Not captured,802050896,,Not captured,Not captured,Not captured,Not captured,Not captured,Not captured,
Not captured,Not captured,11/11/2020,01/11/2021,Not captured,Not captured,863949,020,00072,ARS-02-0057437,Beacon America,Not captured,Not captured,Not captured,Passport(22567722),,,Suky,Herzel,,03/15/1950,male,Not captured,Not captured,Not captured,Not captured,Not captured,Not captured,Not captured,Not captured,Not captured,Not captured,Not captured,Not captured,Not captured,,,Not captured,Not captured,Not captured,Not captured,450 East 83rd Street Unit 8C,,New York,New York,10028,9173372777,,Not captured,Not captured,bensuky@aol.com,Not captured,802050895,,Not captured,Not captured,Not captured,Not captured,Not captured,Not captured,
Not captured,Not captured,11/11/2020,12/03/2020,Not captured,Not captured,863949,020,00072,ARS-02-0057436,Beacon America,Not captured,Not captured,Not captured,Passport(30156123),,,Alalus,Rachel,,11/11/1953,female,Not captured,Not captured,Not captured,Not captured,Not captured,Not captured,Not captured,Not captured,Not captured,Not captured,Not captured,Not captured,Not captured,,,Not captured,Not captured,Not captured,Not captured,450 East 83rd Street Unit 8C,,New York,New York,10028,917337-2777,,Not captured,Not captured,bensuky@aol.com,Not captured,802050894,,Not captured,Not captured,Not captured,Not captured,Not captured,Not captured,
Not captured,Not captured,11/11/2020,03/11/2021,Not captured,Not captured,863949,020,00072,OVI-28-0057433,OverseasCare Visitors Insurance Plan,Not captured,Not captured,Not captured,Passport(K1856649),,,Nitrahalli Rajagopal,Umadevi,,06/27/1965,female,Not captured,Not captured,Not captured,Not captured,Not captured,Not captured,Not captured,Not captured,Not captured,Not captured,Not captured,Not captured,Not captured,Subhasree Mohan,Daughter,Not captured,Not captured,Not captured,Not captured,2429 Balmoral St,,Union City,California,94587,5105989874,5105988336,Not captured,Not captured,subharaghuiyer@gmail.com,Not captured,802050891,,Not captured,Not captured,Not captured,Not captured,Not captured,Not captured,
Not captured,Not captured,11/11/2020,03/11/2021,Not captured,Not captured,863949,020,00072,OVI-28-0057432,OverseasCare Visitors Insurance Plan,Not captured,Not captured,Not captured,Passport(K1856649),,,Ganapathy A Ananthanarayanan,Mohan,,04/25/1961,male,Not captured,Not captured,Not captured,Not captured,Not captured,Not captured,Not captured,Not captured,Not captured,Not captured,Not captured,Not captured,Not captured,Subhasree Mohan,Daughter,Not captured,Not captured,Not captured,Not captured,2429 Balmoral St,,Union City,California,94587,5105989874,5105988336,Not captured,Not captured,subharaghuiyer@gmail.com,Not captured,802050890,,Not captured,Not captured,Not captured,Not captured,Not captured,Not captured,
Not captured,Not captured,11/11/2020,11/19/2020,Not captured,Not captured,863949,020,00072,ARS-01-0057415,Beacon International,Not captured,Not captured,Not captured,Passport(566577512),,,Fryar,Kirk Wayne,,06/26/1974,male,Not captured,Not captured,Not captured,Not captured,Not captured,Not captured,Not captured,Not captured,Not captured,Not captured,Not captured,Not captured,Not captured,Cristiane Medeiros,,Not captured,Not captured,Not captured,Not captured,507 Ravenna street south,,Nokomis,FL,34275,+1-9416280723,,Not captured,Not captured,kirk@sarasotaavionics.com,Not captured,802050871,,Not captured,Not captured,Not captured,Not captured,Not captured,Not captured,
Not captured,Not captured,11/12/2020,05/09/2021,Not captured,Not captured,863949,020,00072,ARS-02-0057410,Beacon America,Not captured,Not captured,Not captured,Passport(L3604106),,,Gajula,Gouri,,03/12/1964,female,Not captured,Not captured,Not captured,Not captured,Not captured,Not captured,Not captured,Not captured,Not captured,Not captured,Not captured,Not captured,Not captured,Chandrama Gajula,,Not captured,Not captured,Not captured,Not captured,501 PANCHAMUKHI RESIDENCY,,Bhubaneswar,OR,752101,+1-2077493719,+1-2072529050,Not captured,Not captured,siva2628@hotmail.com,Not captured,802050866,,Not captured,Not captured,Not captured,Not captured,Not captured,Not captured,
Not captured,Not captured,11/15/2020,11/13/2021,Not captured,Not captured,863949,020,00072,ARS-03-0057386,Essential America,Not captured,Not captured,Not captured,Passport(506067184),,,Reyes,Jonathan ,Paul,07/30/1988,male,Not captured,Not captured,Not captured,Not captured,Not captured,Not captured,Not captured,Not captured,Not captured,Not captured,Not captured,Not captured,Not captured,,,Not captured,Not captured,Not captured,Not captured,9050 DOUBLE R BLVD,,Reno,Nevada,89521,7076027696,,Not captured,Not captured,me@jonathanreyes.com,Not captured,802050809,,Not captured,Not captured,Not captured,Not captured,Not captured,Not captured,
Not captured,Not captured,11/15/2020,11/13/2021,Not captured,Not captured,863949,020,00072,ARS-03-0057386,Essential America,Not captured,Not captured,Not captured,,Passport(566354408),Dependant,Reyes,Ryan,Shiloh,08/05/2018,male,Not captured,Not captured,Not captured,Not captured,Not captured,Not captured,Not captured,Not captured,Not captured,Not captured,Not captured,Not captured,Not captured,,,Not captured,Not captured,Not captured,Not captured,9050 DOUBLE R BLVD,,Reno,Nevada,89521,7076027696,,Not captured,Not captured,me@jonathanreyes.com,Not captured,,802050830,Not captured,Not captured,Not captured,Not captured,Not captured,Not captured,
Not captured,Not captured,11/14/2020,12/01/2020,Not captured,Not captured,863949,020,00072,ARS-01-0057312,Beacon International,Not captured,Not captured,Not captured,Passport(652760937),,,litton,Glenn nathan,,05/23/1968,male,Not captured,Not captured,Not captured,Not captured,Not captured,Not captured,Not captured,Not captured,Not captured,Not captured,Not captured,Not captured,Not captured,Glenn Litton,,Not captured,Not captured,Not captured,Not captured,9180 Morgan point ct,,elk grove,CA,95624,+1-9168694416,,Not captured,Not captured,glennlitton77@gmail.com,Not captured,802050479,,Not captured,Not captured,Not captured,Not captured,Not captured,Not captured,