EE Transaction Type,Dependent Transaction Type,Effective Date,Expiry Date,EE Signature,EE Signature Date,Control,Suffix,Account,Plan Number,Plan Name,Claim Office,Network ID Number,Customer Code,EE SSN,Dependent SSN,Dependent Relationship,Last Name,First Name,Middle Initial,DOB,Gender,Ethnicity,PCP/PCD,PCP/PCD Current Patient,Provider Cap Office Number,COB,Dep Student Indicator,Dep OOA Indicator,EE Prior Coverage Indicator,EE Late Entrant,EE Language Indicator,Hire Date,Earnings,Earnings Frequency,Beneficiary (Last Name First Name MI),Beneficiary Relationship,Continuation of Coverage Expiration Date,Continuation of Coverage Event Date,Continuation of Coverage Length of Coverage,Work Location Zip Code,Street Address Line 1,Street Address Line 2,City,State,Zip Code,Home Phone Number,Work Phone Number,Accept Code,Evidence Code,EE Email Address,Communication Disability Code,EE Alternate ID,Dep Alternate ID,Old Control,Old Suffix,Old Account,New Control,New Suffix,New Account,
Not captured,Not captured,11/11/2020,11/09/2021,Not captured,Not captured,863949,020,00072,ARS-03-0057426,Essential America,Not captured,Not captured,Not captured,Passport(HK096119),,,Patel,Rashmikaben,C,06/28/1972,female,Not captured,Not captured,Not captured,Not captured,Not captured,Not captured,Not captured,Not captured,Not captured,Not captured,Not captured,Not captured,Not captured,,,Not captured,Not captured,Not captured,Not captured,141 Shadywood Lane,,Elk Grove Village,Illinois,60007,847-385-4231,,Not captured,Not captured,chitu.patel@hotmail.com,Not captured,802050884,,Not captured,Not captured,Not captured,Not captured,Not captured,Not captured,
Not captured,Not captured,11/11/2020,11/23/2020,Not captured,Not captured,863949,020,00072,ARS-01-0057441,Beacon International,Not captured,Not captured,Not captured,,,,yanikian,andreas,,06/13/1990,male,Not captured,Not captured,Not captured,Not captured,Not captured,Not captured,Not captured,Not captured,Not captured,Not captured,Not captured,Not captured,Not captured,,,Not captured,Not captured,Not captured,Not captured,3131 lama ave,,Long Beach,California,90808,,,Not captured,Not captured,andreas.yanikian@gmail.com,Not captured,802050899,,Not captured,Not captured,Not captured,Not captured,Not captured,Not captured,
Not captured,Not captured,11/11/2020,11/16/2020,Not captured,Not captured,863949,020,00072,ARS-01-0057440,Beacon International,Not captured,Not captured,Not captured,,,,Duran,Karen,E,06/14/1989,female,Not captured,Not captured,Not captured,Not captured,Not captured,Not captured,Not captured,Not captured,Not captured,Not captured,Not captured,Not captured,Not captured,,,Not captured,Not captured,Not captured,Not captured,243 N Whitewater Park Blvd,,Boise,Idaho,83702,,,Not captured,Not captured,Hansrk.id@gmail.com,Not captured,802050898,,Not captured,Not captured,Not captured,Not captured,Not captured,Not captured,
Not captured,Not captured,11/11/2020,11/16/2020,Not captured,Not captured,863949,020,00072,ARS-01-0057439,Beacon International,Not captured,Not captured,Not captured,,,,Hansen,Regan,K,03/22/1989,male,Not captured,Not captured,Not captured,Not captured,Not captured,Not captured,Not captured,Not captured,Not captured,Not captured,Not captured,Not captured,Not captured,,,Not captured,Not captured,Not captured,Not captured,243 N Whitewater Park Blvd,,Boise,Idaho,83702,,,Not captured,Not captured,Hansrk.id@gmail.com,Not captured,802050897,,Not captured,Not captured,Not captured,Not captured,Not captured,Not captured,
Not captured,Not captured,11/11/2020,01/11/2021,Not captured,Not captured,863949,020,00072,ARS-02-0057438,Beacon America,Not captured,Not captured,Not captured,Passport(20906102),,,Suky,Ester,,12/18/1958,female,Not captured,Not captured,Not captured,Not captured,Not captured,Not captured,Not captured,Not captured,Not captured,Not captured,Not captured,Not captured,Not captured,,,Not captured,Not captured,Not captured,Not captured,450 East 83rd Street Unit 8C,,New York,New York,10028,9173372777,,Not captured,Not captured,bensuky@aol.com,Not captured,802050896,,Not captured,Not captured,Not captured,Not captured,Not captured,Not captured,
Not captured,Not captured,11/11/2020,01/11/2021,Not captured,Not captured,863949,020,00072,ARS-02-0057437,Beacon America,Not captured,Not captured,Not captured,Passport(22567722),,,Suky,Herzel,,03/15/1950,male,Not captured,Not captured,Not captured,Not captured,Not captured,Not captured,Not captured,Not captured,Not captured,Not captured,Not captured,Not captured,Not captured,,,Not captured,Not captured,Not captured,Not captured,450 East 83rd Street Unit 8C,,New York,New York,10028,9173372777,,Not captured,Not captured,bensuky@aol.com,Not captured,802050895,,Not captured,Not captured,Not captured,Not captured,Not captured,Not captured,
Not captured,Not captured,11/11/2020,12/03/2020,Not captured,Not captured,863949,020,00072,ARS-02-0057436,Beacon America,Not captured,Not captured,Not captured,Passport(30156123),,,Alalus,Rachel,,11/11/1953,female,Not captured,Not captured,Not captured,Not captured,Not captured,Not captured,Not captured,Not captured,Not captured,Not captured,Not captured,Not captured,Not captured,,,Not captured,Not captured,Not captured,Not captured,450 East 83rd Street Unit 8C,,New York,New York,10028,917337-2777,,Not captured,Not captured,bensuky@aol.com,Not captured,802050894,,Not captured,Not captured,Not captured,Not captured,Not captured,Not captured,
Not captured,Not captured,11/11/2020,03/11/2021,Not captured,Not captured,863949,020,00072,OVI-28-0057433,OverseasCare Visitors Insurance Plan,Not captured,Not captured,Not captured,Passport(K1856649),,,Nitrahalli Rajagopal,Umadevi,,06/27/1965,female,Not captured,Not captured,Not captured,Not captured,Not captured,Not captured,Not captured,Not captured,Not captured,Not captured,Not captured,Not captured,Not captured,Subhasree Mohan,Daughter,Not captured,Not captured,Not captured,Not captured,2429 Balmoral St,,Union City,California,94587,5105989874,5105988336,Not captured,Not captured,subharaghuiyer@gmail.com,Not captured,802050891,,Not captured,Not captured,Not captured,Not captured,Not captured,Not captured,
Not captured,Not captured,11/11/2020,03/11/2021,Not captured,Not captured,863949,020,00072,OVI-28-0057432,OverseasCare Visitors Insurance Plan,Not captured,Not captured,Not captured,Passport(K1856649),,,Ganapathy A Ananthanarayanan,Mohan,,04/25/1961,male,Not captured,Not captured,Not captured,Not captured,Not captured,Not captured,Not captured,Not captured,Not captured,Not captured,Not captured,Not captured,Not captured,Subhasree Mohan,Daughter,Not captured,Not captured,Not captured,Not captured,2429 Balmoral St,,Union City,California,94587,5105989874,5105988336,Not captured,Not captured,subharaghuiyer@gmail.com,Not captured,802050890,,Not captured,Not captured,Not captured,Not captured,Not captured,Not captured,
Not captured,Not captured,11/10/2020,11/19/2020,Not captured,Not captured,863949,020,00072,ARS-01-0057431,Beacon International,Not captured,Not captured,Not captured,,,,Rolfe,Andrew,J,07/19/1966,male,Not captured,Not captured,Not captured,Not captured,Not captured,Not captured,Not captured,Not captured,Not captured,Not captured,Not captured,Not captured,Not captured,,,Not captured,Not captured,Not captured,Not captured,30 field point circle,,Greenwich,Connecticut,06830,,,Not captured,Not captured,andrew.rolfe@towerbrook.com,Not captured,802050889,,Not captured,Not captured,Not captured,Not captured,Not captured,Not captured,
Not captured,Not captured,11/10/2020,12/09/2020,Not captured,Not captured,863949,020,00072,ARS-02-0057427,Beacon America,Not captured,Not captured,Not captured,Passport(K3787534),,,Dwarkanath,Usharani,,12/19/1955,female,Not captured,Not captured,Not captured,Not captured,Not captured,Not captured,Not captured,Not captured,Not captured,Not captured,Not captured,Not captured,Not captured,Deepthi Prashanth,,Not captured,Not captured,Not captured,Not captured,34/1 1st floor,,Bangalore,KA,560020,+1-9378302813,+1-9729616632,Not captured,Not captured,peeyen9@yahoo.com,Not captured,802050885,,Not captured,Not captured,Not captured,Not captured,Not captured,Not captured,
Not captured,Not captured,11/10/2020,05/09/2021,Not captured,Not captured,863949,020,00072,ARS-02-0057425,Beacon America,Not captured,Not captured,Not captured,Passport(R3948454),,,Vijayaraghavan,Mythili,,09/01/1961,female,Not captured,Not captured,Not captured,Not captured,Not captured,Not captured,Not captured,Not captured,Not captured,Not captured,Not captured,Not captured,Not captured,Jhanani Vijayaraghavan,,Not captured,Not captured,Not captured,Not captured,A305 Esteem enclave Bannerghatta Rd,,Bangalore,KA,560076,+1-9084256637,,Not captured,Not captured,jhanani.v@gmail.com,Not captured,802050881,,Not captured,Not captured,Not captured,Not captured,Not captured,Not captured,
Not captured,Not captured,11/10/2020,04/26/2021,Not captured,Not captured,863949,020,00072,ARS-02-0057424,Beacon America,Not captured,Not captured,Not captured,Passport(K6842327),,,Pandit,Vaiju,,12/26/1956,female,Not captured,Not captured,Not captured,Not captured,Not captured,Not captured,Not captured,Not captured,Not captured,Not captured,Not captured,Not captured,Not captured,Pranav Prakash Pandit,,Not captured,Not captured,Not captured,Not captured,128-129 Nikhil Society Sahakarnagar No.2,,Pune,MH,411009,+1-6789076441,,Not captured,Not captured,pppandit@gmail.com,Not captured,802050880,,Not captured,Not captured,Not captured,Not captured,Not captured,Not captured,
Not captured,Not captured,11/10/2020,04/26/2021,Not captured,Not captured,863949,020,00072,ARS-02-0057423,Beacon America,Not captured,Not captured,Not captured,Passport(S7961719),,,Pandit,Prakash Nathupant,,01/02/1950,male,Not captured,Not captured,Not captured,Not captured,Not captured,Not captured,Not captured,Not captured,Not captured,Not captured,Not captured,Not captured,Not captured,Pranav Prakash Pandit,,Not captured,Not captured,Not captured,Not captured,128-129 Nikhil Society Sahakarnagar No.2,,Pune,MH,411009,+1-6789076441,,Not captured,Not captured,pppandit@gmail.com,Not captured,802050879,,Not captured,Not captured,Not captured,Not captured,Not captured,Not captured,
Not captured,Not captured,11/10/2020,05/08/2021,Not captured,Not captured,863949,020,00072,ARS-02-0057421,Beacon America,Not captured,Not captured,Not captured,Passport(R6564677),,,Bhurke,Purva Pramod,,01/09/1954,female,Not captured,Not captured,Not captured,Not captured,Not captured,Not captured,Not captured,Not captured,Not captured,Not captured,Not captured,Not captured,Not captured,Prajakta Bhurke,,Not captured,Not captured,Not captured,Not captured,122 Ramacha Got,,Satara,MH,415002,+1-3373569269,+1-3378527749,Not captured,Not captured,prajaktabhurke@gmail.com,Not captured,802050877,,Not captured,Not captured,Not captured,Not captured,Not captured,Not captured,
Not captured,Not captured,11/06/2020,11/30/2020,Not captured,Not captured,863949,020,00072,ARS-02-0057419,Beacon America,Not captured,Not captured,Not captured,,,,Bell,Alexandra,Sydney,06/25/2009,female,Not captured,Not captured,Not captured,Not captured,Not captured,Not captured,Not captured,Not captured,Not captured,Not captured,Not captured,Not captured,Not captured,,,Not captured,Not captured,Not captured,Not captured,7 Worthington Pl,,Carlisle,England,00000,9417279426,,Not captured,Not captured,tbell1oo@hotmail.co.uk,Not captured,802050875,,Not captured,Not captured,Not captured,Not captured,Not captured,Not captured,
Not captured,Not captured,11/06/2020,11/30/2020,Not captured,Not captured,863949,020,00072,ARS-02-0057418,Beacon America,Not captured,Not captured,Not captured,,,,Bell,Adam,Daniel,08/08/2004,male,Not captured,Not captured,Not captured,Not captured,Not captured,Not captured,Not captured,Not captured,Not captured,Not captured,Not captured,Not captured,Not captured,,,Not captured,Not captured,Not captured,Not captured,7 Worthington Pl,,Carlisle,England,00000,9417279426,,Not captured,Not captured,tbell1oo@hotmail.co.uk,Not captured,802050874,,Not captured,Not captured,Not captured,Not captured,Not captured,Not captured,
Not captured,Not captured,11/06/2020,11/30/2020,Not captured,Not captured,863949,020,00072,ARS-02-0057417,Beacon America,Not captured,Not captured,Not captured,,,,Bell,Tracy ,,05/06/1976,female,Not captured,Not captured,Not captured,Not captured,Not captured,Not captured,Not captured,Not captured,Not captured,Not captured,Not captured,Not captured,Not captured,,,Not captured,Not captured,Not captured,Not captured,7 Worthington Pl,,Carlisle,England,00000,9417279426,,Not captured,Not captured,tbell1oo@hotmail.co.uk,Not captured,802050873,,Not captured,Not captured,Not captured,Not captured,Not captured,Not captured,
Not captured,Not captured,11/06/2020,11/30/2020,Not captured,Not captured,863949,020,00072,ARS-02-0057416,Beacon America,Not captured,Not captured,Not captured,Passport(531594336),,,Bell,Stephen,,05/04/1971,male,Not captured,Not captured,Not captured,Not captured,Not captured,Not captured,Not captured,Not captured,Not captured,Not captured,Not captured,Not captured,Not captured,,,Not captured,Not captured,Not captured,Not captured,7 Worthington Pl,,Carlisle,England,00000,9417279426,,Not captured,Not captured,tbell1oo@hotmail.co.uk,Not captured,802050872,,Not captured,Not captured,Not captured,Not captured,Not captured,Not captured,
Not captured,Not captured,11/11/2020,11/19/2020,Not captured,Not captured,863949,020,00072,ARS-01-0057415,Beacon International,Not captured,Not captured,Not captured,Passport(566577512),,,Fryar,Kirk Wayne,,06/26/1974,male,Not captured,Not captured,Not captured,Not captured,Not captured,Not captured,Not captured,Not captured,Not captured,Not captured,Not captured,Not captured,Not captured,Cristiane Medeiros,,Not captured,Not captured,Not captured,Not captured,507 Ravenna street south,,Nokomis,FL,34275,+1-9416280723,,Not captured,Not captured,kirk@sarasotaavionics.com,Not captured,802050871,,Not captured,Not captured,Not captured,Not captured,Not captured,Not captured,
Not captured,Not captured,11/08/2020,03/31/2021,Not captured,Not captured,863949,020,00072,ARS-01-0057411,Beacon International,Not captured,Not captured,Not captured,,,,Levine,Aron Lazer,,08/11/2020,male,Not captured,Not captured,Not captured,Not captured,Not captured,Not captured,Not captured,Not captured,Not captured,Not captured,Not captured,Not captured,Not captured,,,Not captured,Not captured,Not captured,Not captured,12 Engelberg terr,,Lakewood,,08701,732-886-5751,,Not captured,Not captured,sol@primeins.com,Not captured,802050867,,Not captured,Not captured,Not captured,Not captured,Not captured,Not captured,
Not captured,Not captured,11/08/2020,12/01/2020,Not captured,Not captured,863949,020,00072,ARS-02-0057409,Beacon America,Not captured,Not captured,Not captured,Passport(ER0104071),,,MCCARTNEY,FREDERICK LEROY,,07/04/1961,male,Not captured,Not captured,Not captured,Not captured,Not captured,Not captured,Not captured,Not captured,Not captured,Not captured,Not captured,Not captured,Not captured,ALEXANDRA SMITH,,Not captured,Not captured,Not captured,Not captured,Pinewood,,NASSAU,BAH,00000,+1-7542487396,,Not captured,Not captured,alexandrawalkine1988@gmail.com,Not captured,802050865,,Not captured,Not captured,Not captured,Not captured,Not captured,Not captured,
Not captured,Not captured,11/07/2020,11/12/2020,Not captured,Not captured,863949,020,00072,ARS-01-0057408,Beacon International,Not captured,Not captured,Not captured,Passport(G31078833),,,Alvarez Cardenas,Jose Francisco,,02/24/1964,male,Not captured,Not captured,Not captured,Not captured,Not captured,Not captured,Not captured,Not captured,Not captured,Not captured,Not captured,Not captured,Not captured,Diana,,Not captured,Not captured,Not captured,Not captured,18205 NW Bronson rd,,Portland,OR,97229,+52-4591104143,,Not captured,Not captured,cagatu9@icloud.com,Not captured,802050864,,Not captured,Not captured,Not captured,Not captured,Not captured,Not captured,
Not captured,Not captured,11/09/2020,11/16/2020,Not captured,Not captured,863949,020,00072,ARS-01-0057407,Beacon International,Not captured,Not captured,Not captured,,,,Pham,Hong,,05/05/1977,female,Not captured,Not captured,Not captured,Not captured,Not captured,Not captured,Not captured,Not captured,Not captured,Not captured,Not captured,Not captured,Not captured,Lisa Danielle Torres,Spouse,Not captured,Not captured,Not captured,Not captured,4445 Howell Dr,,Port Arthur,TX,77642,+1-4093502062,,Not captured,Not captured,gttorres72@gmail.com,Not captured,802050863,,Not captured,Not captured,Not captured,Not captured,Not captured,Not captured,
Not captured,Not captured,11/09/2020,11/16/2020,Not captured,Not captured,863949,020,00072,ARS-01-0057406,Beacon International,Not captured,Not captured,Not captured,Passport(515997399),,,Torres,Gonzalo,,01/11/1972,male,Not captured,Not captured,Not captured,Not captured,Not captured,Not captured,Not captured,Not captured,Not captured,Not captured,Not captured,Not captured,Not captured,Lisa Danielle Torres,,Not captured,Not captured,Not captured,Not captured,4445 Howell Dr,,Port Arthur,TX,77642,+1-4093502062,,Not captured,Not captured,gttorres72@gmail.com,Not captured,802050862,,Not captured,Not captured,Not captured,Not captured,Not captured,Not captured,
Not captured,Not captured,11/07/2020,11/12/2020,Not captured,Not captured,863949,020,00072,ARS-01-0057405,Beacon International,Not captured,Not captured,Not captured,Passport(G22122120),,,Torres Gonzales,Jose Cruz,,05/18/1976,male,Not captured,Not captured,Not captured,Not captured,Not captured,Not captured,Not captured,Not captured,Not captured,Not captured,Not captured,Not captured,Not captured,Diana,,Not captured,Not captured,Not captured,Not captured,18205 NW Bronson rd,,Portland,OR,97229,+52-4591104143,,Not captured,Not captured,cagatu9@icloud.com,Not captured,802050861,,Not captured,Not captured,Not captured,Not captured,Not captured,Not captured,
Not captured,Not captured,11/07/2020,11/12/2020,Not captured,Not captured,863949,020,00072,ARS-01-0057404,Beacon International,Not captured,Not captured,Not captured,Passport(G18551236),,,Acosta Echeverria,Jose de Jesus,,02/10/1988,male,Not captured,Not captured,Not captured,Not captured,Not captured,Not captured,Not captured,Not captured,Not captured,Not captured,Not captured,Not captured,Not captured,Diana,,Not captured,Not captured,Not captured,Not captured,18205 Nw Bronson rd,,Portland,OR,97229,+52-4591104143,,Not captured,Not captured,cagatu9@icloud.com,Not captured,802050860,,Not captured,Not captured,Not captured,Not captured,Not captured,Not captured,
Not captured,Not captured,11/07/2020,11/14/2020,Not captured,Not captured,863949,020,00072,ARS-01-0057403,Beacon International,Not captured,Not captured,Not captured,,,,Heffner,Monica,,12/13/1985,female,Not captured,Not captured,Not captured,Not captured,Not captured,Not captured,Not captured,Not captured,Not captured,Not captured,Not captured,Not captured,Not captured,,,Not captured,Not captured,Not captured,Not captured,3528 Ashington Ln,,Plano,Texas,75023,,,Not captured,Not captured,alice.l.white@gmail.com,Not captured,802050859,,Not captured,Not captured,Not captured,Not captured,Not captured,Not captured,
Not captured,Not captured,11/07/2020,11/14/2020,Not captured,Not captured,863949,020,00072,ARS-01-0057402,Beacon International,Not captured,Not captured,Not captured,,,,Daniel,Kathleen,,10/22/1970,female,Not captured,Not captured,Not captured,Not captured,Not captured,Not captured,Not captured,Not captured,Not captured,Not captured,Not captured,Not captured,Not captured,,,Not captured,Not captured,Not captured,Not captured,1578 EAST 51 STREET,,BROOKLYN NEW YORK,New York,11234,,,Not captured,Not captured,kathleendaniel2018@gmail.com,Not captured,802050841,,Not captured,Not captured,Not captured,Not captured,Not captured,Not captured,
Not captured,Not captured,11/06/2020,11/04/2021,Not captured,Not captured,863949,020,00072,ARS-03-0057315,Essential America,Not captured,Not captured,Not captured,Passport(505754831),,,Myrte,Leanne,,01/30/1982,female,Not captured,Not captured,Not captured,Not captured,Not captured,Not captured,Not captured,Not captured,Not captured,Not captured,Not captured,Not captured,Not captured,,,Not captured,Not captured,Not captured,Not captured,7066 N. Moselle ave,,Chicago,Illinois,60646,847 485 9083,,Not captured,Not captured,lofro2011@gmail.com,Not captured,802050484,,Not captured,Not captured,Not captured,Not captured,Not captured,Not captured,
Not captured,Not captured,11/07/2020,08/31/2021,Not captured,Not captured,863949,020,00072,ARS-02-0057399,Beacon America,Not captured,Not captured,Not captured,,,,Silberman,Noach,,05/02/2000,male,Not captured,Not captured,Not captured,Not captured,Not captured,Not captured,Not captured,Not captured,Not captured,Not captured,Not captured,Not captured,Not captured,,,Not captured,Not captured,Not captured,Not captured,68 Bates Dr,,Monsey,New York,10952,,,Not captured,Not captured,my@lichtersinsuranceagency.com,Not captured,802050837,,Not captured,Not captured,Not captured,Not captured,Not captured,Not captured,
Not captured,Not captured,11/06/2020,11/07/2020,Not captured,Not captured,863949,020,00072,ARS-01-0057395,Beacon International,Not captured,Not captured,Not captured,,,,Trostyanetsky,Alla,,06/24/1985,female,Not captured,Not captured,Not captured,Not captured,Not captured,Not captured,Not captured,Not captured,Not captured,Not captured,Not captured,Not captured,Not captured,,,Not captured,Not captured,Not captured,Not captured,324 Baldwin Ave,,JERSEY CITY,New Jersey,07306,,,Not captured,Not captured,jeff.bluett@gmail.com,Not captured,802050829,,Not captured,Not captured,Not captured,Not captured,Not captured,Not captured,
Not captured,Not captured,11/06/2020,11/07/2020,Not captured,Not captured,863949,020,00072,ARS-01-0057394,Beacon International,Not captured,Not captured,Not captured,,,,Bluett,Jeffrey,D,08/26/1983,male,Not captured,Not captured,Not captured,Not captured,Not captured,Not captured,Not captured,Not captured,Not captured,Not captured,Not captured,Not captured,Not captured,,,Not captured,Not captured,Not captured,Not captured,324 Baldwin Ave,,JERSEY CITY,New Jersey,07306,,,Not captured,Not captured,jeff.bluett@gmail.com,Not captured,802050828,,Not captured,Not captured,Not captured,Not captured,Not captured,Not captured,
Not captured,Not captured,11/06/2020,03/27/2021,Not captured,Not captured,863949,020,00072,ARS-02-0057393,Beacon America,Not captured,Not captured,Not captured,Passport(U6045018),,,Kulkarni,Sanjay Shrikrishna,,06/09/1951,male,Not captured,Not captured,Not captured,Not captured,Not captured,Not captured,Not captured,Not captured,Not captured,Not captured,Not captured,Not captured,Not captured,Sameer Kulkarni,,Not captured,Not captured,Not captured,Not captured,B-101 Archit Royal Appartments,,Nashik,MH,422007,+1-4086370635,+1-4088965356,Not captured,Not captured,sanjukulkarni1951@gmail.com,Not captured,802050827,,Not captured,Not captured,Not captured,Not captured,Not captured,Not captured,
Not captured,Not captured,11/06/2020,01/15/2021,Not captured,Not captured,863949,020,00072,ARS-02-0057392,Beacon America,Not captured,Not captured,Not captured,Passport(Z2831729),,,Patel,Sanjay Shantilal,,03/23/1952,male,Not captured,Not captured,Not captured,Not captured,Not captured,Not captured,Not captured,Not captured,Not captured,Not captured,Not captured,Not captured,Not captured,Nita Patel,,Not captured,Not captured,Not captured,Not captured,31 Anandnager Society,,Vadodara,GJ,390005,+1-2037087583,+1-4072228484,Not captured,Not captured,sanjay@jrspatel.com,Not captured,802050826,,Not captured,Not captured,Not captured,Not captured,Not captured,Not captured,