EE Transaction Type,Dependent Transaction Type,Effective Date,Expiry Date,EE Signature,EE Signature Date,Control,Suffix,Account,Plan Number,Plan Name,Claim Office,Network ID Number,Customer Code,EE SSN,Dependent SSN,Dependent Relationship,Last Name,First Name,Middle Initial,DOB,Gender,Ethnicity,PCP/PCD,PCP/PCD Current Patient,Provider Cap Office Number,COB,Dep Student Indicator,Dep OOA Indicator,EE Prior Coverage Indicator,EE Late Entrant,EE Language Indicator,Hire Date,Earnings,Earnings Frequency,Beneficiary (Last Name First Name MI),Beneficiary Relationship,Continuation of Coverage Expiration Date,Continuation of Coverage Event Date,Continuation of Coverage Length of Coverage,Work Location Zip Code,Street Address Line 1,Street Address Line 2,City,State,Zip Code,Home Phone Number,Work Phone Number,Accept Code,Evidence Code,EE Email Address,Communication Disability Code,EE Alternate ID,Dep Alternate ID,Old Control,Old Suffix,Old Account,New Control,New Suffix,New Account,
Not captured,Not captured,11/04/2020,11/08/2020,Not captured,Not captured,863949,020,00072,ARS-01-0057388,Beacon International,Not captured,Not captured,Not captured,Passport(unk),,,Hammer,Ester,,06/29/1953,female,Not captured,Not captured,Not captured,Not captured,Not captured,Not captured,Not captured,Not captured,Not captured,Not captured,Not captured,Not captured,Not captured,,,Not captured,Not captured,Not captured,Not captured,1452 52nd St,,Brooklyn,New York,11219,00,,Not captured,Not captured,ehg3000@gmail.com,Not captured,802050811,,Not captured,Not captured,Not captured,Not captured,Not captured,Not captured,
Not captured,Not captured,11/04/2020,01/31/2021,Not captured,Not captured,863949,020,00072,ARS-02-0057381,Beacon America,Not captured,Not captured,Not captured,Passport(L2219326),,,Sunder Rajan,Subashree,,08/20/1961,female,Not captured,Not captured,Not captured,Not captured,Not captured,Not captured,Not captured,Not captured,Not captured,Not captured,Not captured,Not captured,Not captured,Satish Sunder Rajan Gopal,,Not captured,Not captured,Not captured,Not captured,Plot No 61 Flat NO 1 Ravi Krupa Apts,,Secunderabad,TG,500026,+1-3039562071,,Not captured,Not captured,sunderrs@colorado.edu,Not captured,802050804,,Not captured,Not captured,Not captured,Not captured,Not captured,Not captured,
Not captured,Not captured,11/04/2020,12/04/2020,Not captured,Not captured,863949,020,00072,ARS-02-0057378,Beacon America,Not captured,Not captured,Not captured,Passport(75449214),,,Chilingarian,Albina,,11/27/1984,female,Not captured,Not captured,Not captured,Not captured,Not captured,Not captured,Not captured,Not captured,Not captured,Not captured,Not captured,Not captured,Not captured,Grigoriy Fooks,,Not captured,Not captured,Not captured,Not captured,Baidukova 55,,Varenkovskay,Krasnodar,353370,+1-6468127327,,Not captured,Not captured,gregorfoux@gmail.com,Not captured,802050801,,Not captured,Not captured,Not captured,Not captured,Not captured,Not captured,
Not captured,Not captured,11/03/2020,01/31/2021,Not captured,Not captured,863949,020,00072,ARS-02-0057376,Beacon America,Not captured,Not captured,Not captured,Passport(EH7917050),,,Zhang,Shihua,,06/18/1954,female,Not captured,Not captured,Not captured,Not captured,Not captured,Not captured,Not captured,Not captured,Not captured,Not captured,Not captured,Not captured,Not captured,Qingxuan Song,,Not captured,Not captured,Not captured,Not captured,shiyunjiayuan jinghai district,,Tianjin,Tianjin,301600,+1-7348839568,,Not captured,Not captured,qsong@umich.edu,Not captured,802050589,,Not captured,Not captured,Not captured,Not captured,Not captured,Not captured,
Not captured,Not captured,11/03/2020,11/30/2020,Not captured,Not captured,863949,020,00072,ARS-02-0057375,Beacon America,Not captured,Not captured,Not captured,Passport(L3179583),,,Thakkallapally,Ravinder Rao,,03/15/1957,male,Not captured,Not captured,Not captured,Not captured,Not captured,Not captured,Not captured,Not captured,Not captured,Not captured,Not captured,Not captured,Not captured,Narsimha Rao Takallapaly,,Not captured,Not captured,Not captured,Not captured,1-9-1207/A Sahakar Nagar,,Warangal,TG,506001,+1-6787738141,,Not captured,Not captured,narsimharaot@gmail.com,Not captured,802050588,,Not captured,Not captured,Not captured,Not captured,Not captured,Not captured,
Not captured,Not captured,11/03/2020,06/18/2021,Not captured,Not captured,863949,020,00072,ARS-01-0057374,Beacon International,Not captured,Not captured,Not captured,,,,Dabkowski,Michelle,,04/20/1993,female,Not captured,Not captured,Not captured,Not captured,Not captured,Not captured,Not captured,Not captured,Not captured,Not captured,Not captured,Not captured,Not captured,,,Not captured,Not captured,Not captured,Not captured,3515 Runnymeade Deive,,Newtown Square,Pennsylvania,19073,,,Not captured,Not captured,lsdabkowski@gmail.com,Not captured,802050587,,Not captured,Not captured,Not captured,Not captured,Not captured,Not captured,
Not captured,Not captured,11/02/2020,12/20/2020,Not captured,Not captured,863949,020,00072,ARS-01-0057370,Beacon International,Not captured,Not captured,Not captured,Passport(533296835),,,Playford,Thomas Henry,,07/27/1983,male,Not captured,Not captured,Not captured,Not captured,Not captured,Not captured,Not captured,Not captured,Not captured,Not captured,Not captured,Not captured,Not captured,Jennifer Taylor,,Not captured,Not captured,Not captured,Not captured,Flat 1 25 Estelle Road,,London,England,NW3 2JX,+44-7515359860,,Not captured,Not captured,tom@playford.net,Not captured,802050546,,Not captured,Not captured,Not captured,Not captured,Not captured,Not captured,
Not captured,Not captured,10/31/2020,10/29/2021,Not captured,Not captured,863949,020,00072,ARS-03-0057341,Essential America,Not captured,Not captured,Not captured,Passport(485379432),,,Magny,Kara,Emerson,05/18/1977,female,Not captured,Not captured,Not captured,Not captured,Not captured,Not captured,Not captured,Not captured,Not captured,Not captured,Not captured,Not captured,Not captured,,,Not captured,Not captured,Not captured,Not captured,23524 NW 202 St,,High Springs,Florida,32643,352-231-4514,,Not captured,Not captured,karamagny@gmail.com,Not captured,802050510,,Not captured,Not captured,Not captured,Not captured,Not captured,Not captured,
Not captured,Not captured,10/31/2020,10/29/2021,Not captured,Not captured,863949,020,00072,ARS-03-0057341,Essential America,Not captured,Not captured,Not captured,,Passport(645640307),Spouse,Magny,Phenes,,08/18/1985,male,Not captured,Not captured,Not captured,Not captured,Not captured,Not captured,Not captured,Not captured,Not captured,Not captured,Not captured,Not captured,Not captured,,,Not captured,Not captured,Not captured,Not captured,23524 NW 202 St,,High Springs,Florida,32643,352-231-4514,,Not captured,Not captured,karamagny@gmail.com,Not captured,,802050539,Not captured,Not captured,Not captured,Not captured,Not captured,Not captured,
Not captured,Not captured,10/31/2020,10/29/2021,Not captured,Not captured,863949,020,00072,ARS-03-0057341,Essential America,Not captured,Not captured,Not captured,,Passport(663777756),Dependant,Magny,Miriam,Anniolie,02/20/2011,female,Not captured,Not captured,Not captured,Not captured,Not captured,Not captured,Not captured,Not captured,Not captured,Not captured,Not captured,Not captured,Not captured,,,Not captured,Not captured,Not captured,Not captured,23524 NW 202 St,,High Springs,Florida,32643,352-231-4514,,Not captured,Not captured,karamagny@gmail.com,Not captured,,802050540,Not captured,Not captured,Not captured,Not captured,Not captured,Not captured,
Not captured,Not captured,10/31/2020,10/29/2021,Not captured,Not captured,863949,020,00072,ARS-03-0057341,Essential America,Not captured,Not captured,Not captured,,Passport(663777757),Dependant,Magny,Jasper,Phenes,03/10/2015,male,Not captured,Not captured,Not captured,Not captured,Not captured,Not captured,Not captured,Not captured,Not captured,Not captured,Not captured,Not captured,Not captured,,,Not captured,Not captured,Not captured,Not captured,23524 NW 202 St,,High Springs,Florida,32643,352-231-4514,,Not captured,Not captured,karamagny@gmail.com,Not captured,,802050541,Not captured,Not captured,Not captured,Not captured,Not captured,Not captured,
Not captured,Not captured,11/01/2020,11/25/2020,Not captured,Not captured,863949,020,00072,ARS-02-0057369,Beacon America,Not captured,Not captured,Not captured,Passport(120415361),,,Brice,Moira,Leslie,12/24/1951,female,Not captured,Not captured,Not captured,Not captured,Not captured,Not captured,Not captured,Not captured,Not captured,Not captured,Not captured,Not captured,Not captured,,,Not captured,Not captured,Not captured,Not captured,4 Ash Tree Gardens,,Kent,England,MG14 5LB,07489274985,,Not captured,Not captured,m.brice@btlnternet.com,Not captured,802050538,,Not captured,Not captured,Not captured,Not captured,Not captured,Not captured,
Not captured,Not captured,11/03/2020,01/31/2021,Not captured,Not captured,863949,020,00072,ARS-02-0057365,Beacon America,Not captured,Not captured,Not captured,Passport(AR292038),,,Garcia Acevedo,Sandra Lorena,,02/20/1983,female,Not captured,Not captured,Not captured,Not captured,Not captured,Not captured,Not captured,Not captured,Not captured,Not captured,Not captured,Not captured,Not captured,Imad Khouri,,Not captured,Not captured,Not captured,Not captured,Calle 104 No 15-75 Barrio San Patricio Edificio casa,,Bogota,Colombia,502,+1-7063061341,,Not captured,Not captured,imadkhouri@yahoo.com,Not captured,802050534,,Not captured,Not captured,Not captured,Not captured,Not captured,Not captured,
Not captured,Not captured,11/02/2020,12/31/2020,Not captured,Not captured,863949,020,00072,ARS-02-0057364,Beacon America,Not captured,Not captured,Not captured,,,,Nagaich,Ayush,,05/19/2012,male,Not captured,Not captured,Not captured,Not captured,Not captured,Not captured,Not captured,Not captured,Not captured,Not captured,Not captured,Not captured,Not captured,Anurag Nagaich,Dependent,Not captured,Not captured,Not captured,Not captured,D1303 Kunal Aspiree Balewadi,,Pune,MH,411045,+1-6155968797,,Not captured,Not captured,anuragnagaich@gmail.com,Not captured,802050533,,Not captured,Not captured,Not captured,Not captured,Not captured,Not captured,
Not captured,Not captured,11/02/2020,12/31/2020,Not captured,Not captured,863949,020,00072,ARS-02-0057363,Beacon America,Not captured,Not captured,Not captured,Passport(U2132679),,,Nagaich,Meenakshi,,09/08/1983,female,Not captured,Not captured,Not captured,Not captured,Not captured,Not captured,Not captured,Not captured,Not captured,Not captured,Not captured,Not captured,Not captured,Anurag Nagaich,,Not captured,Not captured,Not captured,Not captured,D1303 Kunal Aspiree Balewadi,,Pune,MH,411045,+1-6155968797,,Not captured,Not captured,anuragnagaich@gmail.com,Not captured,802050532,,Not captured,Not captured,Not captured,Not captured,Not captured,Not captured,
Not captured,Not captured,11/01/2020,11/02/2020,Not captured,Not captured,863949,020,00072,ARS-01-0057361,Beacon International,Not captured,Not captured,Not captured,Passport(M2893996),,,Jain,Bhagesh,,10/04/1993,male,Not captured,Not captured,Not captured,Not captured,Not captured,Not captured,Not captured,Not captured,Not captured,Not captured,Not captured,Not captured,Not captured,Ramesh Chand Jain,,Not captured,Not captured,Not captured,Not captured,10201 Lindley Avenue,,Northridge,CA,91324,+1-7472028094,,Not captured,Not captured,jainbhagesh2020@gmail.com,Not captured,802050530,,Not captured,Not captured,Not captured,Not captured,Not captured,Not captured,
Not captured,Not captured,11/02/2020,12/02/2020,Not captured,Not captured,863949,020,00072,ARS-01-0057360,Beacon International,Not captured,Not captured,Not captured,Passport(RL1676469),,,Abou Ghaida,Rawad,,06/19/1981,male,Not captured,Not captured,Not captured,Not captured,Not captured,Not captured,Not captured,Not captured,Not captured,Not captured,Not captured,Not captured,Not captured,Chadi Abou Ghaida,,Not captured,Not captured,Not captured,Not captured,9618 Demeter Lane,,Charlotte,NC,28262,+1-7044213582,,Not captured,Not captured,rawadghaida@hotmail.com,Not captured,802050529,,Not captured,Not captured,Not captured,Not captured,Not captured,Not captured,
Not captured,Not captured,11/02/2020,01/31/2021,Not captured,Not captured,863949,020,00072,OVI-28-0057358,OverseasCare Visitors Insurance Plan,Not captured,Not captured,Not captured,Passport(523801272),,,Chaplin,Michael,J,09/19/1943,male,Not captured,Not captured,Not captured,Not captured,Not captured,Not captured,Not captured,Not captured,Not captured,Not captured,Not captured,Not captured,Not captured,JUNE CHAPLIN-RAY,SPOUSE,Not captured,Not captured,Not captured,Not captured,# 5 EAST GASTON STREE,,SAVANNAH,Georgia,31401,+447933770053,,Not captured,Not captured,mikechaplin100@hotmail.com,Not captured,802050527,,Not captured,Not captured,Not captured,Not captured,Not captured,Not captured,
Not captured,Not captured,11/02/2020,01/16/2021,Not captured,Not captured,863949,020,00072,ARS-01-0057354,Beacon International,Not captured,Not captured,Not captured,Passport(587034723),,,Gatti,Enrico,,04/17/1981,male,Not captured,Not captured,Not captured,Not captured,Not captured,Not captured,Not captured,Not captured,Not captured,Not captured,Not captured,Not captured,Not captured,Laura Gatti,Sister,Not captured,Not captured,Not captured,Not captured,794 Hart St,,Brooklyn,New York,11237,3474094997,,Not captured,Not captured,enricogatti@gmail.com,Not captured,802050523,,Not captured,Not captured,Not captured,Not captured,Not captured,Not captured,
Not captured,Not captured,11/02/2020,11/11/2020,Not captured,Not captured,863949,020,00072,ARS-01-0057353,Beacon International,Not captured,Not captured,Not captured,Passport(546012958),,,Boatman,Jim,,09/27/1956,male,Not captured,Not captured,Not captured,Not captured,Not captured,Not captured,Not captured,Not captured,Not captured,Not captured,Not captured,Not captured,Not captured,Jack Boatman,,Not captured,Not captured,Not captured,Not captured,3100 n kenmore,,chicago,IL,60657,+1-7733436322,,Not captured,Not captured,jim41234123@yahoo.com,Not captured,802050522,,Not captured,Not captured,Not captured,Not captured,Not captured,Not captured,
Not captured,Not captured,11/01/2020,03/02/2021,Not captured,Not captured,863949,020,00072,ARS-01-0057352,Beacon International,Not captured,Not captured,Not captured,,,,Andrews,Johnny,,06/24/1993,male,Not captured,Not captured,Not captured,Not captured,Not captured,Not captured,Not captured,Not captured,Not captured,Not captured,Not captured,Not captured,Not captured,,,Not captured,Not captured,Not captured,Not captured,14161 NE 171 pl,,Fort McCoy,Florida,32134,,,Not captured,Not captured,aracecar24@aol.com,Not captured,802050521,,Not captured,Not captured,Not captured,Not captured,Not captured,Not captured,
Not captured,Not captured,11/01/2020,02/02/2021,Not captured,Not captured,863949,020,00072,ARS-02-0057349,Beacon America,Not captured,Not captured,Not captured,Passport(055240537),,,csutak,esztera ,,10/18/1952,female,Not captured,Not captured,Not captured,Not captured,Not captured,Not captured,Not captured,Not captured,Not captured,Not captured,Not captured,Not captured,Not captured,RICHARD DIEHl,HUSBAND,Not captured,Not captured,Not captured,Not captured,94 FORD ROAD,,germantown,New York,12526,5185376647,5185376647,Not captured,Not captured,guardall10@aol.com,Not captured,802050518,,Not captured,Not captured,Not captured,Not captured,Not captured,Not captured,
Not captured,Not captured,11/01/2020,11/13/2020,Not captured,Not captured,863949,020,00072,OVI-41-0057348,Overseas Visitors Insurance Plan A,Not captured,Not captured,Not captured,Passport(k6098975),,,Lakhera,Kamla,,01/24/1960,female,Not captured,Not captured,Not captured,Not captured,Not captured,Not captured,Not captured,Not captured,Not captured,Not captured,Not captured,Not captured,Not captured,Vimal Lakhera,Son,Not captured,Not captured,Not captured,Not captured,5303 S. Mason Rd,,Katy,Texas,77450,832-434-0858,,Not captured,Not captured,duggu9311@gmail.com,Not captured,802050517,,Not captured,Not captured,Not captured,Not captured,Not captured,Not captured,
Not captured,Not captured,11/01/2020,11/29/2020,Not captured,Not captured,863949,020,00072,ARS-02-0057347,Beacon America,Not captured,Not captured,Not captured,Passport(S2236167),,,Gandhi,Shakuntala Ramesh,,07/17/1952,female,Not captured,Not captured,Not captured,Not captured,Not captured,Not captured,Not captured,Not captured,Not captured,Not captured,Not captured,Not captured,Not captured,Bharti Gandhi,,Not captured,Not captured,Not captured,Not captured,205 Best CHS,,Navi Mumbai,MH,400709,+1-2019720260,,Not captured,Not captured,bhartigandhi80@gmail.com,Not captured,802050516,,Not captured,Not captured,Not captured,Not captured,Not captured,Not captured,
Not captured,Not captured,10/31/2020,01/29/2021,Not captured,Not captured,863949,020,00072,ARS-02-0057345,Beacon America,Not captured,Not captured,Not captured,Passport(U3193615),,,VedapattiPachaimuthukumaravelu,Alagesan,,10/05/1953,male,Not captured,Not captured,Not captured,Not captured,Not captured,Not captured,Not captured,Not captured,Not captured,Not captured,Not captured,Not captured,Not captured,anand alagesan,,Not captured,Not captured,Not captured,Not captured,80 gaa wing 1 d gt cholayil residency,,Chennai,TN,600107,+1-8454189715,+1-8454189715,Not captured,Not captured,anand_13@hotmail.com,Not captured,802050514,,Not captured,Not captured,Not captured,Not captured,Not captured,Not captured,
Not captured,Not captured,10/30/2020,11/06/2020,Not captured,Not captured,863949,020,00072,ARS-02-0057344,Beacon America,Not captured,Not captured,Not captured,Passport(507298096),,,Gil Cardona,Sol Elena,,07/14/1963,female,Not captured,Not captured,Not captured,Not captured,Not captured,Not captured,Not captured,Not captured,Not captured,Not captured,Not captured,Not captured,Not captured,Alejandra Montes Gil,,Not captured,Not captured,Not captured,Not captured,29 Irby House,,London,England,SW2 2HJ,+1-6282024039,,Not captured,Not captured,solgil714@hotmail.com,Not captured,802050513,,Not captured,Not captured,Not captured,Not captured,Not captured,Not captured,
Not captured,Not captured,10/31/2020,12/05/2020,Not captured,Not captured,863949,020,00072,ARS-01-0057343,Beacon International,Not captured,Not captured,Not captured,Passport(NA),,,MELTON,LESLEY,,03/15/1947,female,Not captured,Not captured,Not captured,Not captured,Not captured,Not captured,Not captured,Not captured,Not captured,Not captured,Not captured,Not captured,Not captured,JONATHAN MACLOD,SON,Not captured,Not captured,Not captured,Not captured,120 COUNTRY CLUB PLACE,,EDMONTON,Alberta,T6M2H7,7802374818,,Not captured,Not captured,cjam@shaw.ca,Not captured,802050512,,Not captured,Not captured,Not captured,Not captured,Not captured,Not captured,
Not captured,Not captured,10/31/2020,04/25/2021,Not captured,Not captured,863949,020,00072,ARS-02-0057340,Beacon America,Not captured,Not captured,Not captured,Passport(P4470050),,,Ramanadhula,Premalatha,,11/29/1962,female,Not captured,Not captured,Not captured,Not captured,Not captured,Not captured,Not captured,Not captured,Not captured,Not captured,Not captured,Not captured,Not captured,Shruthi,,Not captured,Not captured,Not captured,Not captured,L1201 113-115,,Hyderabad,Andhra Pradesh,500084,+1-2622876206,,Not captured,Not captured,sureshru1207@gmail.com,Not captured,802050509,,Not captured,Not captured,Not captured,Not captured,Not captured,Not captured,
Not captured,Not captured,10/30/2020,01/01/2021,Not captured,Not captured,863949,020,00072,ARS-02-0057339,Beacon America,Not captured,Not captured,Not captured,Passport(P3879247),,,Nataraj,Prabha,,07/24/1962,female,Not captured,Not captured,Not captured,Not captured,Not captured,Not captured,Not captured,Not captured,Not captured,Not captured,Not captured,Not captured,Not captured,Dravya Nataraj,,Not captured,Not captured,Not captured,Not captured,No 120-1 1st Main Road K R Extension,,Tiptur,KA,572202,+1-6196168127,+1-6196168127,Not captured,Not captured,rahulchidanand@gmail.com,Not captured,802050508,,Not captured,Not captured,Not captured,Not captured,Not captured,Not captured,
Not captured,Not captured,11/01/2020,03/31/2021,Not captured,Not captured,863949,020,00072,ARS-02-0057338,Beacon America,Not captured,Not captured,Not captured,Passport(S3800695),,,Rani,Nagamani Sudhakar,,05/05/1955,female,Not captured,Not captured,Not captured,Not captured,Not captured,Not captured,Not captured,Not captured,Not captured,Not captured,Not captured,Not captured,Not captured,Sunil Rani,,Not captured,Not captured,Not captured,Not captured,G-D STERLING HEIGHTS REDNAM GARDENS,,VISAKHAPATNAM,AP,530002,+1-3186145963,,Not captured,Not captured,sunil5781@gmail.com,Not captured,802050507,,Not captured,Not captured,Not captured,Not captured,Not captured,Not captured,
Not captured,Not captured,10/30/2020,11/30/2020,Not captured,Not captured,863949,020,00072,ARS-01-0057334,Beacon International,Not captured,Not captured,Not captured,Passport(PAC735902),,,Canas Montoliu,Mario,,11/01/1986,male,Not captured,Not captured,Not captured,Not captured,Not captured,Not captured,Not captured,Not captured,Not captured,Not captured,Not captured,Not captured,Not captured,Alison Katherine Jenkins,,Not captured,Not captured,Not captured,Not captured,Plaza Pintor Dubon 1-30,,Valencia,Valencia,46015,+1-7092196292,+1-7092196292,Not captured,Not captured,mario.reedsmount@gmail.com,Not captured,802050503,,Not captured,Not captured,Not captured,Not captured,Not captured,Not captured,
Not captured,Not captured,11/01/2020,12/31/2020,Not captured,Not captured,863949,020,00072,ARS-02-0057333,Beacon America,Not captured,Not captured,Not captured,Passport(E97530091),,,Chen,Ying,,08/09/1979,female,Not captured,Not captured,Not captured,Not captured,Not captured,Not captured,Not captured,Not captured,Not captured,Not captured,Not captured,Not captured,Not captured,,,Not captured,Not captured,Not captured,Not captured,3049 LIVE OAK CT,,CA,,DANVILLE,6268980075,,Not captured,Not captured,QIQIBABY1979@HOTMAIL.COM,Not captured,802050502,,Not captured,Not captured,Not captured,Not captured,Not captured,Not captured,
Not captured,Not captured,11/04/2020,11/18/2020,Not captured,Not captured,863949,020,00072,ARS-01-0057328,Beacon International,Not captured,Not captured,Not captured,Passport(598838561),,,Neil,Avery Lisette,,12/06/1995,female,Not captured,Not captured,Not captured,Not captured,Not captured,Not captured,Not captured,Not captured,Not captured,Not captured,Not captured,Not captured,Not captured,Avery Neil,,Not captured,Not captured,Not captured,Not captured,223 Trinity Ave,,Kensington,CA,94708,+1-4155153218,,Not captured,Not captured,averylisneil@gmail.com,Not captured,802050497,,Not captured,Not captured,Not captured,Not captured,Not captured,Not captured,
Not captured,Not captured,11/01/2020,11/18/2020,Not captured,Not captured,863949,020,00072,ARS-01-0057327,Beacon International,Not captured,Not captured,Not captured,Passport(G20094892),,,Palau Mayrl,Felix,A,08/16/1997,male,Not captured,Not captured,Not captured,Not captured,Not captured,Not captured,Not captured,Not captured,Not captured,Not captured,Not captured,Not captured,Not captured,Felix Palau,Father,Not captured,Not captured,Not captured,Not captured,12 ROCKRIDGE RD,,ARDSLEY,New York,10502,9147035955,,Not captured,Not captured,andrespalau33@gmail.com,Not captured,802050496,,Not captured,Not captured,Not captured,Not captured,Not captured,Not captured,