EE Transaction Type,Dependent Transaction Type,Effective Date,Expiry Date,EE Signature,EE Signature Date,Control,Suffix,Account,Plan Number,Plan Name,Claim Office,Network ID Number,Customer Code,EE SSN,Dependent SSN,Dependent Relationship,Last Name,First Name,Middle Initial,DOB,Gender,Ethnicity,PCP/PCD,PCP/PCD Current Patient,Provider Cap Office Number,COB,Dep Student Indicator,Dep OOA Indicator,EE Prior Coverage Indicator,EE Late Entrant,EE Language Indicator,Hire Date,Earnings,Earnings Frequency,Beneficiary (Last Name First Name MI),Beneficiary Relationship,Continuation of Coverage Expiration Date,Continuation of Coverage Event Date,Continuation of Coverage Length of Coverage,Work Location Zip Code,Street Address Line 1,Street Address Line 2,City,State,Zip Code,Home Phone Number,Work Phone Number,Accept Code,Evidence Code,EE Email Address,Communication Disability Code,EE Alternate ID,Dep Alternate ID,Old Control,Old Suffix,Old Account,New Control,New Suffix,New Account,
Not captured,Not captured,10/25/2020,12/31/2020,Not captured,Not captured,863949,020,00072,ARS-02-0057282,Beacon America,Not captured,Not captured,Not captured,Passport(N900606),,,Mohanty,Ajantha,,07/20/1983,female,Not captured,Not captured,Not captured,Not captured,Not captured,Not captured,Not captured,Not captured,Not captured,Not captured,Not captured,Not captured,Not captured,Manas Puhan,,Not captured,Not captured,Not captured,Not captured,27 Prakruthik Vihar,,Yapral,TG,500087,+1-6467059978,,Not captured,Not captured,ajantha.m207@gmail.com,Not captured,802050424,,Not captured,Not captured,Not captured,Not captured,Not captured,Not captured,
Not captured,Not captured,10/24/2020,11/12/2020,Not captured,Not captured,863949,020,00072,ARS-01-0057279,Beacon International,Not captured,Not captured,Not captured,Passport(A3010682),,,FROST,BENJAMIN,J,06/07/1980,male,Not captured,Not captured,Not captured,Not captured,Not captured,Not captured,Not captured,Not captured,Not captured,Not captured,Not captured,Not captured,Not captured,,,Not captured,Not captured,Not captured,Not captured,1825 Summerfield st,,Ridgewood,New York,11385,2063840461,,Not captured,Not captured,info@richardmosse.com,Not captured,802050420,,Not captured,Not captured,Not captured,Not captured,Not captured,Not captured,
Not captured,Not captured,10/24/2020,11/12/2020,Not captured,Not captured,863949,020,00072,ARS-01-0057278,Beacon International,Not captured,Not captured,Not captured,Passport(549836055),,,Tweeton,Trevor,,11/20/1983,male,Not captured,Not captured,Not captured,Not captured,Not captured,Not captured,Not captured,Not captured,Not captured,Not captured,Not captured,Not captured,Not captured,,,Not captured,Not captured,Not captured,Not captured,1825 Summerfield st,,Ridgewood,New York,11385,2063840461,,Not captured,Not captured,trevor.tweeten@gmail.com,Not captured,802050419,,Not captured,Not captured,Not captured,Not captured,Not captured,Not captured,
Not captured,Not captured,10/24/2020,10/31/2020,Not captured,Not captured,863949,020,00072,ARS-02-0057277,Beacon America,Not captured,Not captured,Not captured,,,,Venkateshkumar,Ahan,,06/26/2019,male,Not captured,Not captured,Not captured,Not captured,Not captured,Not captured,Not captured,Not captured,Not captured,Not captured,Not captured,Not captured,Not captured,Malliga Manoharan,Dependent,Not captured,Not captured,Not captured,Not captured,D198A W10 Kamatchi amman Kovil Street,,Gudalur,TN,625518,+1-3127303285,+1-4084293238,Not captured,Not captured,mvenkat1903@gmail.com,Not captured,802050418,,Not captured,Not captured,Not captured,Not captured,Not captured,Not captured,
Not captured,Not captured,10/24/2020,10/31/2020,Not captured,Not captured,863949,020,00072,ARS-02-0057276,Beacon America,Not captured,Not captured,Not captured,,,,Venkateshkumar,Anya,,03/22/2016,female,Not captured,Not captured,Not captured,Not captured,Not captured,Not captured,Not captured,Not captured,Not captured,Not captured,Not captured,Not captured,Not captured,Malliga Manoharan,Dependent,Not captured,Not captured,Not captured,Not captured,D198A W10 Kamatchi amman Kovil Street,,Gudalur,TN,625518,+1-3127303285,+1-4084293238,Not captured,Not captured,mvenkat1903@gmail.com,Not captured,802050417,,Not captured,Not captured,Not captured,Not captured,Not captured,Not captured,
Not captured,Not captured,10/24/2020,10/31/2020,Not captured,Not captured,863949,020,00072,ARS-02-0057275,Beacon America,Not captured,Not captured,Not captured,,,,Vijayaram,Sruthi,,09/06/1992,female,Not captured,Not captured,Not captured,Not captured,Not captured,Not captured,Not captured,Not captured,Not captured,Not captured,Not captured,Not captured,Not captured,Malliga Manoharan,Spouse,Not captured,Not captured,Not captured,Not captured,D198A W10 Kamatchi amman Kovil Street,,Gudalur,TN,625518,+1-3127303285,+1-4084293238,Not captured,Not captured,mvenkat1903@gmail.com,Not captured,802050416,,Not captured,Not captured,Not captured,Not captured,Not captured,Not captured,
Not captured,Not captured,10/24/2020,10/31/2020,Not captured,Not captured,863949,020,00072,ARS-02-0057274,Beacon America,Not captured,Not captured,Not captured,Passport(R0892184),,,Manoharan,Venkateshkumar,,03/19/1985,male,Not captured,Not captured,Not captured,Not captured,Not captured,Not captured,Not captured,Not captured,Not captured,Not captured,Not captured,Not captured,Not captured,Malliga Manoharan,,Not captured,Not captured,Not captured,Not captured,D198A W10 Kamatchi amman Kovil Street,,Gudalur,TN,625518,+1-3127303285,+1-4084293238,Not captured,Not captured,mvenkat1903@gmail.com,Not captured,802050415,,Not captured,Not captured,Not captured,Not captured,Not captured,Not captured,
Not captured,Not captured,10/25/2020,04/19/2021,Not captured,Not captured,863949,020,00072,ARS-02-0057271,Beacon America,Not captured,Not captured,Not captured,Passport(Z4603464),,,Naim,Mohammed Abdul,,08/13/1942,male,Not captured,Not captured,Not captured,Not captured,Not captured,Not captured,Not captured,Not captured,Not captured,Not captured,Not captured,Not captured,Not captured,Aasim Mohammed Khan,,Not captured,Not captured,Not captured,Not captured,8-3-833/30 Plot 30 Phase 1,,Hyderabad,TG,500073,+1-4156401745,,Not captured,Not captured,jeweloscoorders@gmail.com,Not captured,802050412,,Not captured,Not captured,Not captured,Not captured,Not captured,Not captured,
Not captured,Not captured,10/24/2020,12/20/2020,Not captured,Not captured,863949,020,00072,ARS-01-0057270,Beacon International,Not captured,Not captured,Not captured,Passport(531273158),,,Sheer,Khristina,,12/28/1995,female,Not captured,Not captured,Not captured,Not captured,Not captured,Not captured,Not captured,Not captured,Not captured,Not captured,Not captured,Not captured,Not captured,Noah Sheer,,Not captured,Not captured,Not captured,Not captured,3350 SW 27th St,,Miami,FL,33133,+1-3234210169,,Not captured,Not captured,khristinasar@gmail.com,Not captured,802050411,,Not captured,Not captured,Not captured,Not captured,Not captured,Not captured,
Not captured,Not captured,10/22/2020,01/18/2021,Not captured,Not captured,863949,020,00072,ARS-02-0057267,Beacon America,Not captured,Not captured,Not captured,Passport(CB065949),,,Leal Jovchelevitch,Flavio,,01/30/1990,male,Not captured,Not captured,Not captured,Not captured,Not captured,Not captured,Not captured,Not captured,Not captured,Not captured,Not captured,Not captured,Not captured,Eulogio Lalu Eclarinal III,,Not captured,Not captured,Not captured,Not captured,16 Kerfield Pl,,London,England,SE5 8SX,+1-2135058697,,Not captured,Not captured,flavio.jov@gmail.com,Not captured,802050408,,Not captured,Not captured,Not captured,Not captured,Not captured,Not captured,
Not captured,Not captured,10/22/2020,02/03/2021,Not captured,Not captured,863949,020,00072,ARS-01-0057266,Beacon International,Not captured,Not captured,Not captured,,,,spitzer,elchonon,,10/17/1999,male,Not captured,Not captured,Not captured,Not captured,Not captured,Not captured,Not captured,Not captured,Not captured,Not captured,Not captured,Not captured,Not captured,,,Not captured,Not captured,Not captured,Not captured,1340 59 street,,brooklyn,New York,11219,,,Not captured,Not captured,a4264878@gmail.com,Not captured,802050407,,Not captured,Not captured,Not captured,Not captured,Not captured,Not captured,
Not captured,Not captured,10/22/2020,10/24/2020,Not captured,Not captured,863949,020,00072,ARS-01-0057264,Beacon International,Not captured,Not captured,Not captured,Passport(A09764199),,,Shehu,Yushau Umar,,06/30/1996,male,Not captured,Not captured,Not captured,Not captured,Not captured,Not captured,Not captured,Not captured,Not captured,Not captured,Not captured,Not captured,Not captured,Yusuf Shehu,,Not captured,Not captured,Not captured,Not captured,King Faisal street,,Abuja,Abuja,900231,+234-09074721111,,Not captured,Not captured,yoosha3059@gmail.com,Not captured,802050405,,Not captured,Not captured,Not captured,Not captured,Not captured,Not captured,
Not captured,Not captured,10/21/2020,10/19/2021,Not captured,Not captured,863949,020,00072,ARS-03-0057227,Essential International,Not captured,Not captured,Not captured,Passport(643002454),,,Dyer,Samuel,Todd,08/26/1977,male,Not captured,Not captured,Not captured,Not captured,Not captured,Not captured,Not captured,Not captured,Not captured,Not captured,Not captured,Not captured,Not captured,,,Not captured,Not captured,Not captured,Not captured,Gerbermühlstr. 45,,Frankfurt,,,+49 (0) 157 702 39842,,Not captured,Not captured,sdd337@pmbx.net,Not captured,802050360,,Not captured,Not captured,Not captured,Not captured,Not captured,Not captured,
Not captured,Not captured,10/21/2020,10/19/2021,Not captured,Not captured,863949,020,00072,ARS-03-0057227,Essential International,Not captured,Not captured,Not captured,,Passport(566138201),Spouse,Dyer,Desiree,Nicole,04/28/1983,female,Not captured,Not captured,Not captured,Not captured,Not captured,Not captured,Not captured,Not captured,Not captured,Not captured,Not captured,Not captured,Not captured,,,Not captured,Not captured,Not captured,Not captured,Gerbermühlstr. 45,,Frankfurt,,,+49 (0) 157 702 39842,,Not captured,Not captured,sdd337@pmbx.net,Not captured,,802050402,Not captured,Not captured,Not captured,Not captured,Not captured,Not captured,
Not captured,Not captured,10/21/2020,10/19/2021,Not captured,Not captured,863949,020,00072,ARS-03-0057227,Essential International,Not captured,Not captured,Not captured,,Passport(539486199),Dependant,Dyer,Ezra,Knox,02/16/2011,male,Not captured,Not captured,Not captured,Not captured,Not captured,Not captured,Not captured,Not captured,Not captured,Not captured,Not captured,Not captured,Not captured,,,Not captured,Not captured,Not captured,Not captured,Gerbermühlstr. 45,,Frankfurt,,,+49 (0) 157 702 39842,,Not captured,Not captured,sdd337@pmbx.net,Not captured,,802050403,Not captured,Not captured,Not captured,Not captured,Not captured,Not captured,
Not captured,Not captured,10/21/2020,10/19/2021,Not captured,Not captured,863949,020,00072,ARS-03-0057227,Essential International,Not captured,Not captured,Not captured,,Passport(567382940),Dependant,Dyer,Salem,Michal,06/11/2013,female,Not captured,Not captured,Not captured,Not captured,Not captured,Not captured,Not captured,Not captured,Not captured,Not captured,Not captured,Not captured,Not captured,,,Not captured,Not captured,Not captured,Not captured,Gerbermühlstr. 45,,Frankfurt,,,+49 (0) 157 702 39842,,Not captured,Not captured,sdd337@pmbx.net,Not captured,,802050404,Not captured,Not captured,Not captured,Not captured,Not captured,Not captured,
Not captured,Not captured,10/23/2020,02/17/2021,Not captured,Not captured,863949,020,00072,ARS-02-0057263,Beacon America,Not captured,Not captured,Not captured,,,,Ural,Mehmet,,01/09/1952,male,Not captured,Not captured,Not captured,Not captured,Not captured,Not captured,Not captured,Not captured,Not captured,Not captured,Not captured,Not captured,Not captured,Ahmet Engin Ural,Spouse,Not captured,Not captured,Not captured,Not captured,261 sok no 8 daire 4 hatay,,izmir,izmir,35550,+1-3473098480,,Not captured,Not captured,aeural@gmail.com,Not captured,802050401,,Not captured,Not captured,Not captured,Not captured,Not captured,Not captured,
Not captured,Not captured,10/23/2020,02/17/2021,Not captured,Not captured,863949,020,00072,ARS-02-0057262,Beacon America,Not captured,Not captured,Not captured,Passport(S20206214),,,Ural,Hediye,,11/25/1958,female,Not captured,Not captured,Not captured,Not captured,Not captured,Not captured,Not captured,Not captured,Not captured,Not captured,Not captured,Not captured,Not captured,Ahmet Engin Ural,,Not captured,Not captured,Not captured,Not captured,261 sok no 8 daire 4 hatay,,izmir,izmir,35550,+1-3473098480,,Not captured,Not captured,aeural@gmail.com,Not captured,802050400,,Not captured,Not captured,Not captured,Not captured,Not captured,Not captured,
Not captured,Not captured,10/23/2020,11/06/2020,Not captured,Not captured,863949,020,00072,ARS-02-0057258,Beacon America,Not captured,Not captured,Not captured,Passport(E85884495),,,XIA,GUIXIN,,10/23/1937,female,Not captured,Not captured,Not captured,Not captured,Not captured,Not captured,Not captured,Not captured,Not captured,Not captured,Not captured,Not captured,Not captured,XIN LIU,,Not captured,Not captured,Not captured,Not captured,bei bin 1 Road Chun Sen Bi An,,Chongqing,Chongqing,400022,+1-5187727121,,Not captured,Not captured,carson.sunj@gmail.com,Not captured,802050396,,Not captured,Not captured,Not captured,Not captured,Not captured,Not captured,
Not captured,Not captured,10/24/2020,10/30/2020,Not captured,Not captured,863949,020,00072,ARS-01-0057257,Beacon International,Not captured,Not captured,Not captured,Passport(542884029),,,Mosby,Noelle,,11/07/2000,female,Not captured,Not captured,Not captured,Not captured,Not captured,Not captured,Not captured,Not captured,Not captured,Not captured,Not captured,Not captured,Not captured,Mark OConnor,,Not captured,Not captured,Not captured,Not captured,3209 HOBBS LANDING CT,,GREENSBORO,NC,27410-4846,+1-9193458558,,Not captured,Not captured,oconnorm@us.ibm.com,Not captured,802050395,,Not captured,Not captured,Not captured,Not captured,Not captured,Not captured,
Not captured,Not captured,10/24/2020,10/30/2020,Not captured,Not captured,863949,020,00072,ARS-01-0057256,Beacon International,Not captured,Not captured,Not captured,Passport(483161089),,,OConnor,Kelli Marie,,08/20/1993,female,Not captured,Not captured,Not captured,Not captured,Not captured,Not captured,Not captured,Not captured,Not captured,Not captured,Not captured,Not captured,Not captured,Mark OConnor,,Not captured,Not captured,Not captured,Not captured,3209 HOBBS LANDING CT,,GREENSBORO,NC,27410-4846,+1-9193458558,,Not captured,Not captured,oconnorm@us.ibm.com,Not captured,802050394,,Not captured,Not captured,Not captured,Not captured,Not captured,Not captured,
Not captured,Not captured,10/24/2020,10/30/2020,Not captured,Not captured,863949,020,00072,ARS-01-0057255,Beacon International,Not captured,Not captured,Not captured,Passport(576466665),,,Gaskell,Allen Reid,,03/17/2001,male,Not captured,Not captured,Not captured,Not captured,Not captured,Not captured,Not captured,Not captured,Not captured,Not captured,Not captured,Not captured,Not captured,Crystal OConnor,,Not captured,Not captured,Not captured,Not captured,3209 HOBBS LANDING CT,,GREENSBORO,NC,27410-4846,+1-9193458558,,Not captured,Not captured,oconnorm@us.ibm.com,Not captured,802050393,,Not captured,Not captured,Not captured,Not captured,Not captured,Not captured,
Not captured,Not captured,10/24/2020,10/30/2020,Not captured,Not captured,863949,020,00072,ARS-01-0057254,Beacon International,Not captured,Not captured,Not captured,,,,OConnor,Crystal Pulliam,,03/31/1971,female,Not captured,Not captured,Not captured,Not captured,Not captured,Not captured,Not captured,Not captured,Not captured,Not captured,Not captured,Not captured,Not captured,Crystal OConnor,Spouse,Not captured,Not captured,Not captured,Not captured,3209 HOBBS LANDING CT,,GREENSBORO,NC,27410-4846,+1-9193458558,,Not captured,Not captured,oconnorm@us.ibm.com,Not captured,802050392,,Not captured,Not captured,Not captured,Not captured,Not captured,Not captured,
Not captured,Not captured,10/24/2020,10/30/2020,Not captured,Not captured,863949,020,00072,ARS-01-0057253,Beacon International,Not captured,Not captured,Not captured,Passport(559519854),,,OConnor,Mark Patrick,,06/27/1959,male,Not captured,Not captured,Not captured,Not captured,Not captured,Not captured,Not captured,Not captured,Not captured,Not captured,Not captured,Not captured,Not captured,Crystal OConnor,,Not captured,Not captured,Not captured,Not captured,3209 HOBBS LANDING CT,,GREENSBORO,NC,27410-4846,+1-9193458558,,Not captured,Not captured,oconnorm@us.ibm.com,Not captured,802050391,,Not captured,Not captured,Not captured,Not captured,Not captured,Not captured,
Not captured,Not captured,10/21/2020,10/28/2020,Not captured,Not captured,863949,020,00072,ARS-01-0057251,Beacon International,Not captured,Not captured,Not captured,Passport(Ak337974),,,Varga,Christopher Daniel,,08/09/1993,male,Not captured,Not captured,Not captured,Not captured,Not captured,Not captured,Not captured,Not captured,Not captured,Not captured,Not captured,Not captured,Not captured,Adam Varga,,Not captured,Not captured,Not captured,Not captured,6630 Gilley Ave,,Burnaby,BC,V5h3w9,+1-2509274043,,Not captured,Not captured,chrvarga@gmail.com,Not captured,802050389,,Not captured,Not captured,Not captured,Not captured,Not captured,Not captured,
Not captured,Not captured,10/21/2020,12/31/2020,Not captured,Not captured,863949,020,00072,ARS-01-0057250,Beacon International,Not captured,Not captured,Not captured,,,,Moskowitz,Abe,,07/01/2000,male,Not captured,Not captured,Not captured,Not captured,Not captured,Not captured,Not captured,Not captured,Not captured,Not captured,Not captured,Not captured,Not captured,,,Not captured,Not captured,Not captured,Not captured,2 park Slope terrace,,Lakewood,,08701,347-406-1502,,Not captured,Not captured,mmonticarlo@aol.com,Not captured,802050388,,Not captured,Not captured,Not captured,Not captured,Not captured,Not captured,
Not captured,Not captured,10/22/2020,02/20/2021,Not captured,Not captured,863949,020,00072,ARS-01-0057245,Beacon International,Not captured,Not captured,Not captured,Passport(547050540),,,Webster,Thomas Conrad,,12/23/1997,male,Not captured,Not captured,Not captured,Not captured,Not captured,Not captured,Not captured,Not captured,Not captured,Not captured,Not captured,Not captured,Not captured,Alison Webster,,Not captured,Not captured,Not captured,Not captured,103 Monks Road,,Exeter,England,EX4 7BQ,+44-7517506398,,Not captured,Not captured,tomwebster2@yahoo.co.uk,Not captured,802050383,,Not captured,Not captured,Not captured,Not captured,Not captured,Not captured,
Not captured,Not captured,10/25/2020,10/29/2020,Not captured,Not captured,863949,020,00072,ARS-01-0057242,Beacon International,Not captured,Not captured,Not captured,,,,Bar Horin,Menachem,M,06/28/1989,male,Not captured,Not captured,Not captured,Not captured,Not captured,Not captured,Not captured,Not captured,Not captured,Not captured,Not captured,Not captured,Not captured,,,Not captured,Not captured,Not captured,Not captured,6160,,Montreal,Quebec,H2V4C2,,,Not captured,Not captured,mendybarhorin@gmail.com,Not captured,802050378,,Not captured,Not captured,Not captured,Not captured,Not captured,Not captured,
Not captured,Not captured,10/20/2020,09/30/2021,Not captured,Not captured,863949,020,00072,ARS-01-0057241,Beacon International,Not captured,Not captured,Not captured,,,,Shapiro,Yehuda Y,,03/04/1998,male,Not captured,Not captured,Not captured,Not captured,Not captured,Not captured,Not captured,Not captured,Not captured,Not captured,Not captured,Not captured,Not captured,,,Not captured,Not captured,Not captured,Not captured,116 hudson st,,lakewood,,08701,732-370,,Not captured,Not captured,shaya@primeins.com,Not captured,802050377,,Not captured,Not captured,Not captured,Not captured,Not captured,Not captured,
Not captured,Not captured,10/20/2020,03/25/2021,Not captured,Not captured,863949,020,00072,ARS-02-0057237,Beacon America,Not captured,Not captured,Not captured,,,,fogel,shmuel,S,04/20/1971,male,Not captured,Not captured,Not captured,Not captured,Not captured,Not captured,Not captured,Not captured,Not captured,Not captured,Not captured,Not captured,Not captured,,,Not captured,Not captured,Not captured,Not captured,2 OVADIA ST.,,JERUSALEM,,95509,,,Not captured,Not captured,bjacob11211@yahoo.com,Not captured,802050372,,Not captured,Not captured,Not captured,Not captured,Not captured,Not captured,
Not captured,Not captured,10/22/2020,10/22/2020,Not captured,Not captured,863949,020,00072,ARS-02-0057236,Beacon America,Not captured,Not captured,Not captured,Passport(P3764834A),,,Panizares,Amelia,,10/30/1950,female,Not captured,Not captured,Not captured,Not captured,Not captured,Not captured,Not captured,Not captured,Not captured,Not captured,Not captured,Not captured,Not captured,Eduardo Pascual Jr,,Not captured,Not captured,Not captured,Not captured,Blk 10 Lot 3 Villa de Prima Rosa,,Bacoor,Cavite,4103,+1-09212138193,+1-4076192742,Not captured,Not captured,pascualaretha@yahoo.com,Not captured,802050371,,Not captured,Not captured,Not captured,Not captured,Not captured,Not captured,
Not captured,Not captured,10/19/2020,11/18/2020,Not captured,Not captured,863949,020,00072,ARS-02-0057235,Beacon America,Not captured,Not captured,Not captured,,,,May de Paula,Milena Elaine,,10/11/1988,female,Not captured,Not captured,Not captured,Not captured,Not captured,Not captured,Not captured,Not captured,Not captured,Not captured,Not captured,Not captured,Not captured,Jose Valdomiro de Paula,Spouse,Not captured,Not captured,Not captured,Not captured,Rua Augusto Batista Marson 448,,Sumare,Sao Paulp,13172693,+1-3214244693,+1-3214244352,Not captured,Not captured,rdipauly@live.com,Not captured,802050370,,Not captured,Not captured,Not captured,Not captured,Not captured,Not captured,
Not captured,Not captured,10/19/2020,11/18/2020,Not captured,Not captured,863949,020,00072,ARS-02-0057234,Beacon America,Not captured,Not captured,Not captured,Passport(FT784981),,,De paula,Rafael Thiago,,05/05/1981,male,Not captured,Not captured,Not captured,Not captured,Not captured,Not captured,Not captured,Not captured,Not captured,Not captured,Not captured,Not captured,Not captured,Jose Valdomiro de Paula,,Not captured,Not captured,Not captured,Not captured,Rua Augusto Batista Marson 448,,Sumare,Sao Paulp,13172693,+1-3214244693,+1-3214244352,Not captured,Not captured,rdipauly@live.com,Not captured,802050369,,Not captured,Not captured,Not captured,Not captured,Not captured,Not captured,
Not captured,Not captured,10/22/2020,01/31/2021,Not captured,Not captured,863949,020,00072,ARS-01-0057233,Beacon International,Not captured,Not captured,Not captured,Passport(596103265),,,Levin,Jack,P,08/17/1946,male,Not captured,Not captured,Not captured,Not captured,Not captured,Not captured,Not captured,Not captured,Not captured,Not captured,Not captured,Not captured,Not captured,Marise Gomes,Partner,Not captured,Not captured,Not captured,Not captured,21 Garden Place,,Brooklyn,New York,11201,01-917-806-6736,,Not captured,Not captured,levin@levinadr.com,Not captured,802050368,,Not captured,Not captured,Not captured,Not captured,Not captured,Not captured,