EE Transaction Type,Dependent Transaction Type,Effective Date,Expiry Date,EE Signature,EE Signature Date,Control,Suffix,Account,Plan Number,Plan Name,Claim Office,Network ID Number,Customer Code,EE SSN,Dependent SSN,Dependent Relationship,Last Name,First Name,Middle Initial,DOB,Gender,Ethnicity,PCP/PCD,PCP/PCD Current Patient,Provider Cap Office Number,COB,Dep Student Indicator,Dep OOA Indicator,EE Prior Coverage Indicator,EE Late Entrant,EE Language Indicator,Hire Date,Earnings,Earnings Frequency,Beneficiary (Last Name First Name MI),Beneficiary Relationship,Continuation of Coverage Expiration Date,Continuation of Coverage Event Date,Continuation of Coverage Length of Coverage,Work Location Zip Code,Street Address Line 1,Street Address Line 2,City,State,Zip Code,Home Phone Number,Work Phone Number,Accept Code,Evidence Code,EE Email Address,Communication Disability Code,EE Alternate ID,Dep Alternate ID,Old Control,Old Suffix,Old Account,New Control,New Suffix,New Account,
Not captured,Not captured,10/09/2020,10/07/2021,Not captured,Not captured,863949,020,00072,ARS-03-0057044,Essential America,Not captured,Not captured,Not captured,Passport(522515191),,,Klaus,Keith,Anthony,07/21/1973,male,Not captured,Not captured,Not captured,Not captured,Not captured,Not captured,Not captured,Not captured,Not captured,Not captured,Not captured,Not captured,Not captured,,,Not captured,Not captured,Not captured,Not captured,Triftstr. 34,,Laaber,,93164,+12052236720,,Not captured,Not captured,keithaklaus@googlemail.com,Not captured,802050030,,Not captured,Not captured,Not captured,Not captured,Not captured,Not captured,
Not captured,Not captured,10/09/2020,10/07/2021,Not captured,Not captured,863949,020,00072,ARS-03-0057044,Essential America,Not captured,Not captured,Not captured,,Passport(509312870),Spouse,Klaus,Julia,Michelle,09/04/1971,female,Not captured,Not captured,Not captured,Not captured,Not captured,Not captured,Not captured,Not captured,Not captured,Not captured,Not captured,Not captured,Not captured,,,Not captured,Not captured,Not captured,Not captured,Triftstr. 34,,Laaber,,93164,+12052236720,,Not captured,Not captured,keithaklaus@googlemail.com,Not captured,,802050219,Not captured,Not captured,Not captured,Not captured,Not captured,Not captured,
Not captured,Not captured,10/11/2020,10/17/2020,Not captured,Not captured,863949,020,00072,ARS-01-0057143,Beacon International,Not captured,Not captured,Not captured,,,,Tannenbaum,William,B,02/06/1964,male,Not captured,Not captured,Not captured,Not captured,Not captured,Not captured,Not captured,Not captured,Not captured,Not captured,Not captured,Not captured,Not captured,,,Not captured,Not captured,Not captured,Not captured,12165 conifer ridge,,Conifer,Colorado,80433,,,Not captured,Not captured,wtannenbaum@aol.com,Not captured,802050189,,Not captured,Not captured,Not captured,Not captured,Not captured,Not captured,
Not captured,Not captured,10/11/2020,10/24/2020,Not captured,Not captured,863949,020,00072,ARS-01-0057140,Beacon International,Not captured,Not captured,Not captured,Passport(583577811),,,Quiros,Carlos,,10/21/1950,male,Not captured,Not captured,Not captured,Not captured,Not captured,Not captured,Not captured,Not captured,Not captured,Not captured,Not captured,Not captured,Not captured,Lillian,,Not captured,Not captured,Not captured,Not captured,3963 Petrified Forest Ct,,Pleasanton,CA,94588,+1-9259895311,+1-9259895310,Not captured,Not captured,carloseeuu@comcast.net,Not captured,802050186,,Not captured,Not captured,Not captured,Not captured,Not captured,Not captured,
Not captured,Not captured,10/11/2020,11/12/2020,Not captured,Not captured,863949,020,00072,ARS-02-0057139,Beacon America,Not captured,Not captured,Not captured,Passport(J7420842),,,DSouza,Carol,,09/04/1968,female,Not captured,Not captured,Not captured,Not captured,Not captured,Not captured,Not captured,Not captured,Not captured,Not captured,Not captured,Not captured,Not captured,Scott Shapiro,,Not captured,Not captured,Not captured,Not captured,35 Prasanna,,Mumbai,MH,400010,+1-6177060127,,Not captured,Not captured,scottscrlyn@gmail.com,Not captured,802050185,,Not captured,Not captured,Not captured,Not captured,Not captured,Not captured,
Not captured,Not captured,10/09/2020,10/07/2021,Not captured,Not captured,863949,020,00072,ARS-05-0057063,Clear America,Not captured,Not captured,Not captured,Passport(561557132),,,Hart,Shawn,Charles,04/09/1972,male,Not captured,Not captured,Not captured,Not captured,Not captured,Not captured,Not captured,Not captured,Not captured,Not captured,Not captured,Not captured,Not captured,,,Not captured,Not captured,Not captured,Not captured,100 Lake Frankston,,Frankston,Texas,75763,9369002189,,Not captured,Not captured,shawn@overlandmissions.com,Not captured,802050078,,Not captured,Not captured,Not captured,Not captured,Not captured,Not captured,
Not captured,Not captured,10/09/2020,10/07/2021,Not captured,Not captured,863949,020,00072,ARS-03-0056184,Essential America,Not captured,Not captured,Not captured,Passport(549992646),,,Hart,Lauren,Marie,02/06/1985,female,Not captured,Not captured,Not captured,Not captured,Not captured,Not captured,Not captured,Not captured,Not captured,Not captured,Not captured,Not captured,Not captured,,,Not captured,Not captured,Not captured,Not captured,100 Frankston,,Frankston,Texas,75763,9369002189,,Not captured,Not captured,shawn@overlandmissions.com,Not captured,802048813,,Not captured,Not captured,Not captured,Not captured,Not captured,Not captured,
Not captured,Not captured,10/09/2020,10/07/2021,Not captured,Not captured,863949,020,00072,ARS-03-0056184,Essential America,Not captured,Not captured,Not captured,,Passport(561686649),Spouse,Hart,Charlie,Jo,03/03/2011,female,Not captured,Not captured,Not captured,Not captured,Not captured,Not captured,Not captured,Not captured,Not captured,Not captured,Not captured,Not captured,Not captured,,,Not captured,Not captured,Not captured,Not captured,100 Frankston,,Frankston,Texas,75763,9369002189,,Not captured,Not captured,shawn@overlandmissions.com,Not captured,,802048814,Not captured,Not captured,Not captured,Not captured,Not captured,Not captured,
Not captured,Not captured,10/09/2020,10/07/2021,Not captured,Not captured,863949,020,00072,ARS-03-0056184,Essential America,Not captured,Not captured,Not captured,,Passport(561686648),Dependant,Hart,Jackson,Eli,11/12/2012,male,Not captured,Not captured,Not captured,Not captured,Not captured,Not captured,Not captured,Not captured,Not captured,Not captured,Not captured,Not captured,Not captured,,,Not captured,Not captured,Not captured,Not captured,100 Frankston,,Frankston,Texas,75763,9369002189,,Not captured,Not captured,shawn@overlandmissions.com,Not captured,,802048815,Not captured,Not captured,Not captured,Not captured,Not captured,Not captured,
Not captured,Not captured,10/09/2020,10/07/2021,Not captured,Not captured,863949,020,00072,ARS-03-0057118,Essential International,Not captured,Not captured,Not captured,Passport(NA),,,GARCIA,HOSSDANA,GIMENEZ AVILES,06/15/1973,female,Not captured,Not captured,Not captured,Not captured,Not captured,Not captured,Not captured,Not captured,Not captured,Not captured,Not captured,Not captured,Not captured,,,Not captured,Not captured,Not captured,Not captured,BELLA VISTA LOTE 14,,CABO SAN LUCAS,Baja California Sur,23450,011526241824374,,Not captured,Not captured,CABOWERNER@GMAIL.COM,Not captured,802050163,,Not captured,Not captured,Not captured,Not captured,Not captured,Not captured,
Not captured,Not captured,10/09/2020,01/13/2021,Not captured,Not captured,863949,020,00072,ARS-02-0057129,Beacon America,Not captured,Not captured,Not captured,Passport(E12426463),,,Wang,Mingxiu,,10/04/1962,female,Not captured,Not captured,Not captured,Not captured,Not captured,Not captured,Not captured,Not captured,Not captured,Not captured,Not captured,Not captured,Not captured,Xiang Qiu,,Not captured,Not captured,Not captured,Not captured,2-408 168 Fumalu Jinan District,,Fuzhou,Fujian,350011,+1-2194871178,,Not captured,Not captured,qiux90@gmail.com,Not captured,802050174,,Not captured,Not captured,Not captured,Not captured,Not captured,Not captured,
Not captured,Not captured,10/10/2020,10/25/2020,Not captured,Not captured,863949,020,00072,ARS-01-0057123,Beacon International,Not captured,Not captured,Not captured,Passport(507954297),,,Padula,Andrew Joseph,,11/02/1993,male,Not captured,Not captured,Not captured,Not captured,Not captured,Not captured,Not captured,Not captured,Not captured,Not captured,Not captured,Not captured,Not captured,Jackie Barbiere Padula,,Not captured,Not captured,Not captured,Not captured,159 Bleecker St,,New York,NY,10012,+1-5089444476,,Not captured,Not captured,andrewpadula23@gmail.com,Not captured,802050168,,Not captured,Not captured,Not captured,Not captured,Not captured,Not captured,
Not captured,Not captured,10/11/2020,11/08/2020,Not captured,Not captured,863949,020,00072,ARS-01-0057122,Beacon International,Not captured,Not captured,Not captured,Passport(HB2355959),,,Vladymtseva,Galina,,07/21/1955,female,Not captured,Not captured,Not captured,Not captured,Not captured,Not captured,Not captured,Not captured,Not captured,Not captured,Not captured,Not captured,Not captured,Veranika Cruz,,Not captured,Not captured,Not captured,Not captured,Sennaya str. 14,,Gomel,Belarus,246050,+44-7940105433,+1-7575348031,Not captured,Not captured,usanikki@hotmail.com,Not captured,802050167,,Not captured,Not captured,Not captured,Not captured,Not captured,Not captured,
Not captured,Not captured,10/11/2020,11/08/2020,Not captured,Not captured,863949,020,00072,ARS-01-0057121,Beacon International,Not captured,Not captured,Not captured,Passport(HB3397789),,,Vladymtsev,Petr,,11/23/1948,male,Not captured,Not captured,Not captured,Not captured,Not captured,Not captured,Not captured,Not captured,Not captured,Not captured,Not captured,Not captured,Not captured,Veranika Cruz,,Not captured,Not captured,Not captured,Not captured,Sennaya str. 14,,Gomel,Belarus,246050,+44-7940105433,+1-7575348031,Not captured,Not captured,usanikki@hotmail.com,Not captured,802050166,,Not captured,Not captured,Not captured,Not captured,Not captured,Not captured,
Not captured,Not captured,10/09/2020,11/30/2020,Not captured,Not captured,863949,020,00072,ARS-02-0057120,Beacon America,Not captured,Not captured,Not captured,Passport(120373600),,,Thompson,Jenni,,09/27/1984,female,Not captured,Not captured,Not captured,Not captured,Not captured,Not captured,Not captured,Not captured,Not captured,Not captured,Not captured,Not captured,Not captured,carol Thompson,mother,Not captured,Not captured,Not captured,Not captured,750 N Hayworth Ave Apt 5,,LOS ANGELES,CA,90046,6467072442,,Not captured,Not captured,jenni@jennithompson.co.uk,Not captured,802050165,,Not captured,Not captured,Not captured,Not captured,Not captured,Not captured,
Not captured,Not captured,10/08/2020,10/31/2020,Not captured,Not captured,863949,020,00072,ARS-02-0057117,Beacon America,Not captured,Not captured,Not captured,Passport(EH7615104),,,Wu,Xin,,05/27/1976,male,Not captured,Not captured,Not captured,Not captured,Not captured,Not captured,Not captured,Not captured,Not captured,Not captured,Not captured,Not captured,Not captured,Xiaoyan Huang,,Not captured,Not captured,Not captured,Not captured,Building 3 Wuzheng Garden Longzhu 6th Road,,Shenzhen,Guangdong,518000,+1-9293172699,,Not captured,Not captured,xz2370@columbia.edu,Not captured,802050162,,Not captured,Not captured,Not captured,Not captured,Not captured,Not captured,
Not captured,Not captured,10/08/2020,12/20/2020,Not captured,Not captured,863949,020,00072,ARS-02-0057115,Beacon America,Not captured,Not captured,Not captured,,,,Pai,Seema Satyanath,,04/12/1963,male,Not captured,Not captured,Not captured,Not captured,Not captured,Not captured,Not captured,Not captured,Not captured,Not captured,Not captured,Not captured,Not captured,Megha Pai,Spouse,Not captured,Not captured,Not captured,Not captured,601 Sabari Basera Diamond Garden,,Mumbai,MH,400071,+1-6179222588,,Not captured,Not captured,vinay4uv@gmail.com,Not captured,802050149,,Not captured,Not captured,Not captured,Not captured,Not captured,Not captured,
Not captured,Not captured,10/08/2020,12/20/2020,Not captured,Not captured,863949,020,00072,ARS-02-0057114,Beacon America,Not captured,Not captured,Not captured,Passport(L6519740),,,Pai,Satyanath Ramesh,,09/02/1957,male,Not captured,Not captured,Not captured,Not captured,Not captured,Not captured,Not captured,Not captured,Not captured,Not captured,Not captured,Not captured,Not captured,Megha Pai,,Not captured,Not captured,Not captured,Not captured,601 Sabari Basera Diamond Garden,,Mumbai,MH,400071,+1-6179222588,,Not captured,Not captured,vinay4uv@gmail.com,Not captured,802050148,,Not captured,Not captured,Not captured,Not captured,Not captured,Not captured,
Not captured,Not captured,10/11/2020,10/31/2020,Not captured,Not captured,863949,020,00072,ARS-02-0057112,Beacon America,Not captured,Not captured,Not captured,,,,Lindback Larsson,Pia,Maria,05/01/1976,female,Not captured,Not captured,Not captured,Not captured,Not captured,Not captured,Not captured,Not captured,Not captured,Not captured,Not captured,Not captured,Not captured,Pia Larsson Lindback,Spouse,Not captured,Not captured,Not captured,Not captured,54 W Hubbard,,Chicago,Illinois,60654,3128220888,,Not captured,Not captured,TLindback@carbonvfx.com,Not captured,802050146,,Not captured,Not captured,Not captured,Not captured,Not captured,Not captured,
Not captured,Not captured,10/11/2020,10/31/2020,Not captured,Not captured,863949,020,00072,ARS-02-0057111,Beacon America,Not captured,Not captured,Not captured,Passport(92823686),,,Lindback,Bengt,Torbjorn,04/12/1982,male,Not captured,Not captured,Not captured,Not captured,Not captured,Not captured,Not captured,Not captured,Not captured,Not captured,Not captured,Not captured,Not captured,Pia Larsson Lindback,Spouse,Not captured,Not captured,Not captured,Not captured,54 W Hubbard,,Chicago,Illinois,60654,3128220888,,Not captured,Not captured,TLindback@carbonvfx.com,Not captured,802050145,,Not captured,Not captured,Not captured,Not captured,Not captured,Not captured,
Not captured,Not captured,10/07/2020,12/31/2020,Not captured,Not captured,863949,020,00072,ARS-02-0057106,Beacon America,Not captured,Not captured,Not captured,Passport(u3209022),,,yadav,ravindra dattu,,03/24/1985,male,Not captured,Not captured,Not captured,Not captured,Not captured,Not captured,Not captured,Not captured,Not captured,Not captured,Not captured,Not captured,Not captured,Padmaja Yadav,,Not captured,Not captured,Not captured,Not captured,45/a somnath Nagar ,,pune,MH,411014,+1-9408820164,,Not captured,Not captured,ravi.yadav4u@gmail.com,Not captured,802050134,,Not captured,Not captured,Not captured,Not captured,Not captured,Not captured,
Not captured,Not captured,10/06/2020,10/31/2020,Not captured,Not captured,863949,020,00072,ARS-02-0057105,Beacon America,Not captured,Not captured,Not captured,Passport(n/a),,,Jorgenson,Loui,S,09/28/2005,male,Not captured,Not captured,Not captured,Not captured,Not captured,Not captured,Not captured,Not captured,Not captured,Not captured,Not captured,Not captured,Not captured,,,Not captured,Not captured,Not captured,Not captured,Esrumvej 435A,,Plejett,Nordjylland,3230,954-304-7688,,Not captured,Not captured,bubbasand444@gmail.com,Not captured,802050133,,Not captured,Not captured,Not captured,Not captured,Not captured,Not captured,
Not captured,Not captured,10/06/2020,10/31/2020,Not captured,Not captured,863949,020,00072,ARS-02-0057104,Beacon America,Not captured,Not captured,Not captured,Passport(n/a),,,Hjort,Johnny,,05/10/1965,male,Not captured,Not captured,Not captured,Not captured,Not captured,Not captured,Not captured,Not captured,Not captured,Not captured,Not captured,Not captured,Not captured,,,Not captured,Not captured,Not captured,Not captured,Esrumvej 435A,,Plejett,Nordjylland,3230,954-304-7688,,Not captured,Not captured,bubbasand444@gmail.com,Not captured,802050132,,Not captured,Not captured,Not captured,Not captured,Not captured,Not captured,
Not captured,Not captured,10/06/2020,10/31/2020,Not captured,Not captured,863949,020,00072,ARS-02-0057103,Beacon America,Not captured,Not captured,Not captured,Passport(207657562),,,Jorgenson,Michala,S,03/04/1968,female,Not captured,Not captured,Not captured,Not captured,Not captured,Not captured,Not captured,Not captured,Not captured,Not captured,Not captured,Not captured,Not captured,,,Not captured,Not captured,Not captured,Not captured,Esrumvej 435A,,Plejett,Nordjylland,3230,954-304-7688,,Not captured,Not captured,bubbasand444@gmail.com,Not captured,802050131,,Not captured,Not captured,Not captured,Not captured,Not captured,Not captured,
Not captured,Not captured,10/06/2020,01/06/2021,Not captured,Not captured,863949,020,00072,ARS-02-0057101,Beacon America,Not captured,Not captured,Not captured,Passport(M5266127),,,Dharmavaram Krishnamachari,Vasu,,02/15/1940,male,Not captured,Not captured,Not captured,Not captured,Not captured,Not captured,Not captured,Not captured,Not captured,Not captured,Not captured,Not captured,Not captured,Shanthi Vasu,Wife,Not captured,Not captured,Not captured,Not captured,30 Pine Crest Drive,,Robins,Iowa,52328,7324767297,3198009279,Not captured,Not captured,divya.vasu2012@gmail.com,Not captured,802050129,,Not captured,Not captured,Not captured,Not captured,Not captured,Not captured,
Not captured,Not captured,10/06/2020,01/06/2021,Not captured,Not captured,863949,020,00072,ARS-02-0057100,Beacon America,Not captured,Not captured,Not captured,Passport(M5266984),,,Vasu,Shanthi ,,08/23/1947,female,Not captured,Not captured,Not captured,Not captured,Not captured,Not captured,Not captured,Not captured,Not captured,Not captured,Not captured,Not captured,Not captured,D.K Vasu,Husband,Not captured,Not captured,Not captured,Not captured,30 Pine Crest Drive,,Robins,Iowa,52328,7324767297,3198009279,Not captured,Not captured,divya.vasu2012@gmail.com,Not captured,802050128,,Not captured,Not captured,Not captured,Not captured,Not captured,Not captured,
Not captured,Not captured,10/08/2020,01/05/2021,Not captured,Not captured,863949,020,00072,ARS-01-0057099,Beacon International,Not captured,Not captured,Not captured,,,,Smallcombe,Gail,L,03/17/1952,female,Not captured,Not captured,Not captured,Not captured,Not captured,Not captured,Not captured,Not captured,Not captured,Not captured,Not captured,Not captured,Not captured,Gail L Smallcombe,Wife,Not captured,Not captured,Not captured,Not captured,400 Cypress Ave,,South San Francisco,California,94080,4154077494,4154077495,Not captured,Not captured,mark@marriagecoach.co,Not captured,802050127,,Not captured,Not captured,Not captured,Not captured,Not captured,Not captured,
Not captured,Not captured,10/08/2020,01/05/2021,Not captured,Not captured,863949,020,00072,ARS-01-0057098,Beacon International,Not captured,Not captured,Not captured,Passport(506156211),,,Smallcombe,Mark,,07/21/1953,male,Not captured,Not captured,Not captured,Not captured,Not captured,Not captured,Not captured,Not captured,Not captured,Not captured,Not captured,Not captured,Not captured,Gail L Smallcombe,Wife,Not captured,Not captured,Not captured,Not captured,400 Cypress Ave,,South San Francisco,California,94080,4154077494,4154077495,Not captured,Not captured,mark@marriagecoach.co,Not captured,802050126,,Not captured,Not captured,Not captured,Not captured,Not captured,Not captured,
Not captured,Not captured,10/06/2020,10/12/2020,Not captured,Not captured,863949,020,00072,ARS-02-0057090,Beacon America,Not captured,Not captured,Not captured,Passport(T6213236),,,ROZARIO AROKIARAJ,JACINTHA,,12/11/1959,female,Not captured,Not captured,Not captured,Not captured,Not captured,Not captured,Not captured,Not captured,Not captured,Not captured,Not captured,Not captured,Not captured,ROZARIO AROKIARAJ BENJAMIN,,Not captured,Not captured,Not captured,Not captured,THIRUVALLUVAR NAGAR,,CHENNAI,TN,600075,+1-5706774199,,Not captured,Not captured,rozarioarokia@gmail.com,Not captured,802050105,,Not captured,Not captured,Not captured,Not captured,Not captured,Not captured,
Not captured,Not captured,10/07/2020,11/02/2020,Not captured,Not captured,863949,020,00072,ARS-01-0057089,Beacon International,Not captured,Not captured,Not captured,Passport(A12710447),,,ABDELSAMAD,ISRAA MOHAMED RAGAB,,08/25/1994,female,Not captured,Not captured,Not captured,Not captured,Not captured,Not captured,Not captured,Not captured,Not captured,Not captured,Not captured,Not captured,Not captured,OSSAMA MOHAMED MOHAMED AHMED ABDALLA,,Not captured,Not captured,Not captured,Not captured,AZIZLR ST,,ISTANBUL,ISTANBUL,4700,+252-633140239,,Not captured,Not captured,drama2501@gmail.com,Not captured,802050104,,Not captured,Not captured,Not captured,Not captured,Not captured,Not captured,
Not captured,Not captured,10/07/2020,11/02/2020,Not captured,Not captured,863949,020,00072,ARS-01-0057088,Beacon International,Not captured,Not captured,Not captured,Passport(A16355535),,,ABDALLA,OSSAMA MOHAMED MOHAMED AHMED,,04/27/1994,male,Not captured,Not captured,Not captured,Not captured,Not captured,Not captured,Not captured,Not captured,Not captured,Not captured,Not captured,Not captured,Not captured,israa mohamed ragab abdelsamad,,Not captured,Not captured,Not captured,Not captured,azizlr st,,istanbul,istanbul,4700,+252-633140239,,Not captured,Not captured,drama2501@gmail.com,Not captured,802050103,,Not captured,Not captured,Not captured,Not captured,Not captured,Not captured,
Not captured,Not captured,10/05/2020,12/31/2020,Not captured,Not captured,863949,020,00072,ARS-01-0057085,Beacon International,Not captured,Not captured,Not captured,Passport(574891961),,,Pike,Courtney Lauren,,06/17/1985,female,Not captured,Not captured,Not captured,Not captured,Not captured,Not captured,Not captured,Not captured,Not captured,Not captured,Not captured,Not captured,Not captured,Glenda Pike,,Not captured,Not captured,Not captured,Not captured,317 Biscayne Drive,,Mascoutah,IL,62258,+593-983687208,,Not captured,Not captured,courtney.l.pike@gmail.com,Not captured,802050100,,Not captured,Not captured,Not captured,Not captured,Not captured,Not captured,
Not captured,Not captured,10/05/2020,12/05/2020,Not captured,Not captured,863949,020,00072,ARS-02-0057084,Beacon America,Not captured,Not captured,Not captured,Passport(753972769),,,Deviatkova,Angelina,,01/27/2006,female,Not captured,Not captured,Not captured,Not captured,Not captured,Not captured,Not captured,Not captured,Not captured,Not captured,Not captured,Not captured,Not captured,Indira Dyachuk,,Not captured,Not captured,Not captured,Not captured,3 Arkadiya Gaydara street apt. 30,,Perm,Perm region,614077,+1-2679169862,+1-2679169862,Not captured,Not captured,ira.dv1984@gmail.com,Not captured,802050099,,Not captured,Not captured,Not captured,Not captured,Not captured,Not captured,
Not captured,Not captured,10/05/2020,01/03/2021,Not captured,Not captured,863949,020,00072,ARS-02-0057080,Beacon America,Not captured,Not captured,Not captured,Passport(S1466665),,,Kanagala,Lakshminarayana,,05/01/1962,male,Not captured,Not captured,Not captured,Not captured,Not captured,Not captured,Not captured,Not captured,Not captured,Not captured,Not captured,Not captured,Not captured,Purna Kanagala,,Not captured,Not captured,Not captured,Not captured,H.no 1-256/2 raja peta near tdp office,,Mylavaram,AP,521230,+1-2149127897,,Not captured,Not captured,purna.kanagala@gmail.com,Not captured,802050095,,Not captured,Not captured,Not captured,Not captured,Not captured,Not captured,