EE Transaction Type,Dependent Transaction Type,Effective Date,Expiry Date,EE Signature,EE Signature Date,Control,Suffix,Account,Plan Number,Plan Name,Claim Office,Network ID Number,Customer Code,EE SSN,Dependent SSN,Dependent Relationship,Last Name,First Name,Middle Initial,DOB,Gender,Ethnicity,PCP/PCD,PCP/PCD Current Patient,Provider Cap Office Number,COB,Dep Student Indicator,Dep OOA Indicator,EE Prior Coverage Indicator,EE Late Entrant,EE Language Indicator,Hire Date,Earnings,Earnings Frequency,Beneficiary (Last Name First Name MI),Beneficiary Relationship,Continuation of Coverage Expiration Date,Continuation of Coverage Event Date,Continuation of Coverage Length of Coverage,Work Location Zip Code,Street Address Line 1,Street Address Line 2,City,State,Zip Code,Home Phone Number,Work Phone Number,Accept Code,Evidence Code,EE Email Address,Communication Disability Code,EE Alternate ID,Dep Alternate ID,Old Control,Old Suffix,Old Account,New Control,New Suffix,New Account,
Not captured,Not captured,09/28/2020,10/30/2020,Not captured,Not captured,863949,020,00072,ARS-02-0056983,Beacon America,Not captured,Not captured,Not captured,,,,Durairaj,Jayanthi,,12/10/1955,female,Not captured,Not captured,Not captured,Not captured,Not captured,Not captured,Not captured,Not captured,Not captured,Not captured,Not captured,Not captured,Not captured,Preethi Rajakumari,Spouse,Not captured,Not captured,Not captured,Not captured,Flat no:F2 Plot no.16 Pvs Nagar,,Chennai,TN,600097,+1-8572223490,,Not captured,Not captured,kar722@gmail.com,Not captured,802049946,,Not captured,Not captured,Not captured,Not captured,Not captured,Not captured,
Not captured,Not captured,09/28/2020,10/30/2020,Not captured,Not captured,863949,020,00072,ARS-02-0056982,Beacon America,Not captured,Not captured,Not captured,Passport(R0275990),,,Abraham Ebenazer,Sathiyamoorthy,,06/06/1958,male,Not captured,Not captured,Not captured,Not captured,Not captured,Not captured,Not captured,Not captured,Not captured,Not captured,Not captured,Not captured,Not captured,Preethi Rajakumari,,Not captured,Not captured,Not captured,Not captured,Flat no:F2 Plot no.16 Pvs Nagar,,Chennai,TN,600097,+1-8572223490,,Not captured,Not captured,kar722@gmail.com,Not captured,802049945,,Not captured,Not captured,Not captured,Not captured,Not captured,Not captured,
Not captured,Not captured,09/27/2020,10/02/2020,Not captured,Not captured,863949,020,00072,ARS-02-0056980,Beacon America,Not captured,Not captured,Not captured,Passport(l7344520),,,SHAH,PRITIBEN,,03/16/1966,female,Not captured,Not captured,Not captured,Not captured,Not captured,Not captured,Not captured,Not captured,Not captured,Not captured,Not captured,Not captured,Not captured,ASHIT SHAH,,Not captured,Not captured,Not captured,Not captured,4 Gitanagar Soc,,nadiad,GJ,387001,+1-2817349424,,Not captured,Not captured,kunalce4u@gmail.com,Not captured,802049943,,Not captured,Not captured,Not captured,Not captured,Not captured,Not captured,
Not captured,Not captured,09/27/2020,10/12/2020,Not captured,Not captured,863949,020,00072,ARS-01-0056976,Beacon International,Not captured,Not captured,Not captured,Passport(557249441),,,legrande,janet,s,06/03/1958,male,Not captured,Not captured,Not captured,Not captured,Not captured,Not captured,Not captured,Not captured,Not captured,Not captured,Not captured,Not captured,Not captured,Steven Legrande,son,Not captured,Not captured,Not captured,Not captured,2360 McCleary Road,,Sevierville,Tennessee,37876,8656604944,,Not captured,Not captured,jslntn@yahoo.com,Not captured,802049936,,Not captured,Not captured,Not captured,Not captured,Not captured,Not captured,
Not captured,Not captured,09/26/2020,11/30/2020,Not captured,Not captured,863949,020,00072,ARS-02-0056975,Beacon America,Not captured,Not captured,Not captured,Passport(P7439816),,,Chokshi,Rita Dilipbhai,,09/10/1958,female,Not captured,Not captured,Not captured,Not captured,Not captured,Not captured,Not captured,Not captured,Not captured,Not captured,Not captured,Not captured,Not captured,Saurabh Chokshi,,Not captured,Not captured,Not captured,Not captured,B 1305 Sambhavnath Tower Sudha Park,,Mumbai,MH,400077,+1-4092010624,,Not captured,Not captured,saurabhchokshi@gmail.com,Not captured,802049935,,Not captured,Not captured,Not captured,Not captured,Not captured,Not captured,
Not captured,Not captured,09/26/2020,10/25/2020,Not captured,Not captured,863949,020,00072,ARS-02-0056974,Beacon America,Not captured,Not captured,Not captured,Passport(P3925709),,,Gorantla,Jyothi,,04/24/1964,female,Not captured,Not captured,Not captured,Not captured,Not captured,Not captured,Not captured,Not captured,Not captured,Not captured,Not captured,Not captured,Not captured,Roseline Gorantla,,Not captured,Not captured,Not captured,Not captured,Reliance Elegance,,Hyderabad,TG,500084,+1-7346354718,,Not captured,Not captured,akarshahari@gmail.com,Not captured,802049934,,Not captured,Not captured,Not captured,Not captured,Not captured,Not captured,
Not captured,Not captured,09/25/2020,10/16/2020,Not captured,Not captured,863949,020,00072,ARS-02-0056969,Beacon America,Not captured,Not captured,Not captured,Passport(U21568605),,,zengin,bugra,,04/05/1994,male,Not captured,Not captured,Not captured,Not captured,Not captured,Not captured,Not captured,Not captured,Not captured,Not captured,Not captured,Not captured,Not captured,suzan,,Not captured,Not captured,Not captured,Not captured,refahiye mahallesi 272.sokak feyza apt,,sanliurfa,sanliurfa,63000,+90-5076048776,,Not captured,Not captured,bugra-zengin@hotmail.com,Not captured,802049929,,Not captured,Not captured,Not captured,Not captured,Not captured,Not captured,
Not captured,Not captured,09/25/2020,09/28/2020,Not captured,Not captured,863949,020,00072,ARS-01-0056968,Beacon International,Not captured,Not captured,Not captured,Passport(XW1159882),,,AHMAD,SALEEM,,01/02/1973,male,Not captured,Not captured,Not captured,Not captured,Not captured,Not captured,Not captured,Not captured,Not captured,Not captured,Not captured,Not captured,Not captured,SALEEM AHMAD,,Not captured,Not captured,Not captured,Not captured,420 EAST 23RD STREET,,NEW YORK,NY,10010,+1-9174286846,+1-2128107637,Not captured,Not captured,saleem.ahmad@gmail.com,Not captured,802049928,,Not captured,Not captured,Not captured,Not captured,Not captured,Not captured,
Not captured,Not captured,09/25/2020,10/31/2020,Not captured,Not captured,863949,020,00072,ARS-01-0056966,Beacon International,Not captured,Not captured,Not captured,Passport(567640201),,,Sievers,Nathan,W,01/13/1993,male,Not captured,Not captured,Not captured,Not captured,Not captured,Not captured,Not captured,Not captured,Not captured,Not captured,Not captured,Not captured,Not captured,Patricia Sievers,Mother,Not captured,Not captured,Not captured,Not captured,1200 Third Street,,Manhattan Beach,California,90266,3102614265,,Not captured,Not captured,nate@shelljump.com,Not captured,802049926,,Not captured,Not captured,Not captured,Not captured,Not captured,Not captured,
Not captured,Not captured,09/24/2020,10/06/2020,Not captured,Not captured,863949,020,00072,ARS-02-0056964,Beacon America,Not captured,Not captured,Not captured,Passport(34465445),,,Sharon,Shelley,,07/04/1962,female,Not captured,Not captured,Not captured,Not captured,Not captured,Not captured,Not captured,Not captured,Not captured,Not captured,Not captured,Not captured,Not captured,Liam Sharon,,Not captured,Not captured,Not captured,Not captured,10 Shay Agnon,,Raanana,Raanana,4338010,+972-548800418,,Not captured,Not captured,shelleysharon11@gmail.com,Not captured,802049922,,Not captured,Not captured,Not captured,Not captured,Not captured,Not captured,
Not captured,Not captured,09/25/2020,10/24/2020,Not captured,Not captured,863949,020,00072,ARS-02-0056961,Beacon America,Not captured,Not captured,Not captured,,,,torka,shyam,,10/20/1954,male,Not captured,Not captured,Not captured,Not captured,Not captured,Not captured,Not captured,Not captured,Not captured,Not captured,Not captured,Not captured,Not captured,pallawi torka,Spouse,Not captured,Not captured,Not captured,Not captured,4B-Kailasha apartments,,ranchi,JS,834002,+1-6463881362,+1-6463881362,Not captured,Not captured,pallawit@yahoo.com,Not captured,802049918,,Not captured,Not captured,Not captured,Not captured,Not captured,Not captured,
Not captured,Not captured,09/25/2020,10/24/2020,Not captured,Not captured,863949,020,00072,ARS-02-0056960,Beacon America,Not captured,Not captured,Not captured,Passport(k6379813),,,torka,vimla,,11/05/1956,female,Not captured,Not captured,Not captured,Not captured,Not captured,Not captured,Not captured,Not captured,Not captured,Not captured,Not captured,Not captured,Not captured,pallawi torka,,Not captured,Not captured,Not captured,Not captured,4B-Kailasha apartments,,ranchi,JS,834002,+1-6463881362,+1-6463881362,Not captured,Not captured,pallawit@yahoo.com,Not captured,802049917,,Not captured,Not captured,Not captured,Not captured,Not captured,Not captured,
Not captured,Not captured,09/25/2020,10/03/2020,Not captured,Not captured,863949,020,00072,ARS-01-0056959,Beacon International,Not captured,Not captured,Not captured,Passport(C02184929),,,Hodgson,Roberto Malcolm,,10/23/1983,male,Not captured,Not captured,Not captured,Not captured,Not captured,Not captured,Not captured,Not captured,Not captured,Not captured,Not captured,Not captured,Not captured,Vianji De la Cruz,,Not captured,Not captured,Not captured,Not captured,4108 Mattole RD,,Antioch,CA,94531,+1-6504444371,,Not captured,Not captured,biggshodgson@gmail.com,Not captured,802049916,,Not captured,Not captured,Not captured,Not captured,Not captured,Not captured,
Not captured,Not captured,09/25/2020,11/21/2020,Not captured,Not captured,863949,020,00072,ARS-01-0056956,Beacon International,Not captured,Not captured,Not captured,,,,Gross,David,,05/02/1983,male,Not captured,Not captured,Not captured,Not captured,Not captured,Not captured,Not captured,Not captured,Not captured,Not captured,Not captured,Not captured,Not captured,,,Not captured,Not captured,Not captured,Not captured,551 N. Loma Drive,,Lodi,California,95242,,,Not captured,Not captured,HydraKnight21@outlook.com,Not captured,802049903,,Not captured,Not captured,Not captured,Not captured,Not captured,Not captured,
Not captured,Not captured,09/25/2020,11/21/2020,Not captured,Not captured,863949,020,00072,ARS-01-0056955,Beacon International,Not captured,Not captured,Not captured,,,,Gross,Roy,,10/04/1960,male,Not captured,Not captured,Not captured,Not captured,Not captured,Not captured,Not captured,Not captured,Not captured,Not captured,Not captured,Not captured,Not captured,,,Not captured,Not captured,Not captured,Not captured,551 N. Loma Drove,,Lodi,California,95242,,,Not captured,Not captured,Pastorroygross@gmail.com,Not captured,802049902,,Not captured,Not captured,Not captured,Not captured,Not captured,Not captured,
Not captured,Not captured,09/23/2020,09/21/2021,Not captured,Not captured,863949,020,00072,ARS-03-0056944,Essential International,Not captured,Not captured,Not captured,Passport(HP912849),,,LEUENBERGER,WERNER,,08/23/1963,male,Not captured,Not captured,Not captured,Not captured,Not captured,Not captured,Not captured,Not captured,Not captured,Not captured,Not captured,Not captured,Not captured,,,Not captured,Not captured,Not captured,Not captured,WARDNER FORT STEEL RD,,WARDNER,British Columbia,V0B2J0,2502764404,,Not captured,Not captured,cabowerner@gmail.com,Not captured,802049871,,Not captured,Not captured,Not captured,Not captured,Not captured,Not captured,
Not captured,Not captured,09/23/2020,09/21/2021,Not captured,Not captured,863949,020,00072,ARS-02-0056953,Beacon America,Not captured,Not captured,Not captured,Passport(Z3607494),,,Shukla,Tanmay,,11/28/1995,male,Not captured,Not captured,Not captured,Not captured,Not captured,Not captured,Not captured,Not captured,Not captured,Not captured,Not captured,Not captured,Not captured,Shirish Shukla,,Not captured,Not captured,Not captured,Not captured,A-4 Pradhan Sagar Jiv daya lane,,Mumbai,MH,400086,+1-5188985246,+1-5305705636,Not captured,Not captured,tuhintshukla@gmail.com,Not captured,802049900,,Not captured,Not captured,Not captured,Not captured,Not captured,Not captured,
Not captured,Not captured,09/23/2020,09/27/2020,Not captured,Not captured,863949,020,00072,ARS-02-0056949,Beacon America,Not captured,Not captured,Not captured,Passport(EF4885617),,,Chen,Jianhong,,04/24/1991,male,Not captured,Not captured,Not captured,Not captured,Not captured,Not captured,Not captured,Not captured,Not captured,Not captured,Not captured,Not captured,Not captured,Siyun Yu,,Not captured,Not captured,Not captured,Not captured,Hongmei Jiedao Qinjiang Road 28,,Shanghai,Shanghai,200233,+1-9199374599,+1-7327893947,Not captured,Not captured,siyunyu122@gmail.com,Not captured,802049876,,Not captured,Not captured,Not captured,Not captured,Not captured,Not captured,
Not captured,Not captured,09/24/2020,09/27/2020,Not captured,Not captured,863949,020,00072,ARS-01-0056948,Beacon International,Not captured,Not captured,Not captured,,,,BarHorin,Menachem,M,06/28/1989,male,Not captured,Not captured,Not captured,Not captured,Not captured,Not captured,Not captured,Not captured,Not captured,Not captured,Not captured,Not captured,Not captured,,,Not captured,Not captured,Not captured,Not captured,6160 Hutchison,,Outremont,Quebec,H2V4C2,,,Not captured,Not captured,mendybarhorin@gmail.com,Not captured,802049875,,Not captured,Not captured,Not captured,Not captured,Not captured,Not captured,
Not captured,Not captured,09/22/2020,09/30/2020,Not captured,Not captured,863949,020,00072,ARS-02-0056947,Beacon America,Not captured,Not captured,Not captured,Passport(E57681489),,,XUE,YANFEI,,03/26/1997,male,Not captured,Not captured,Not captured,Not captured,Not captured,Not captured,Not captured,Not captured,Not captured,Not captured,Not captured,Not captured,Not captured,Liu Dan,,Not captured,Not captured,Not captured,Not captured,Fengtai Xiaoqu 78-1-10 YEDA,,Yantai,Shandong,264006,+1-6464215612,,Not captured,Not captured,yx2066@nyu.edu,Not captured,802049874,,Not captured,Not captured,Not captured,Not captured,Not captured,Not captured,
Not captured,Not captured,09/25/2020,03/24/2021,Not captured,Not captured,863949,020,00072,ARS-01-0056946,Beacon International,Not captured,Not captured,Not captured,Passport(537743386),,,wolfe,cathy,,02/15/1956,female,Not captured,Not captured,Not captured,Not captured,Not captured,Not captured,Not captured,Not captured,Not captured,Not captured,Not captured,Not captured,Not captured,lynn wolfe,sister,Not captured,Not captured,Not captured,Not captured,4360 E Winter Dr,,Flagstaff,Arizona,86004,9163901521,,Not captured,Not captured,cwfnic@gmail.com,Not captured,802049873,,Not captured,Not captured,Not captured,Not captured,Not captured,Not captured,
Not captured,Not captured,09/27/2020,03/29/2021,Not captured,Not captured,863949,020,00072,ARS-01-0056937,Beacon International,Not captured,Not captured,Not captured,,,,Joshua,David,,04/05/1956,male,Not captured,Not captured,Not captured,Not captured,Not captured,Not captured,Not captured,Not captured,Not captured,Not captured,Not captured,Not captured,Not captured,,,Not captured,Not captured,Not captured,Not captured,1373 Minnehaha Avenue East,,Saint Paul,Minnesota,55106,,,Not captured,Not captured,joebar@q.com,Not captured,802049864,,Not captured,Not captured,Not captured,Not captured,Not captured,Not captured,
Not captured,Not captured,09/22/2020,10/22/2020,Not captured,Not captured,863949,020,00072,ARS-01-0056934,Beacon International,Not captured,Not captured,Not captured,,,,Williams,Gregory,,03/01/1985,male,Not captured,Not captured,Not captured,Not captured,Not captured,Not captured,Not captured,Not captured,Not captured,Not captured,Not captured,Not captured,Not captured,,,Not captured,Not captured,Not captured,Not captured,967 Skyline Dr,,Pismo Beach,California,93449,,,Not captured,Not captured,llfesaver@outlook.com,Not captured,802049861,,Not captured,Not captured,Not captured,Not captured,Not captured,Not captured,
Not captured,Not captured,09/24/2020,09/30/2020,Not captured,Not captured,863949,020,00072,ARS-01-0056933,Beacon International,Not captured,Not captured,Not captured,Passport(E78953492),,,TIAN,XUEMEI,,04/09/1968,female,Not captured,Not captured,Not captured,Not captured,Not captured,Not captured,Not captured,Not captured,Not captured,Not captured,Not captured,Not captured,Not captured,XUESONG TIAN,,Not captured,Not captured,Not captured,Not captured,8D HAOTING BUILDING 7 UNIT ZHONGZHAO GARDEN BUJI,,SHENZHEN,GD,518000,+52-9983229918,,Not captured,Not captured,foryuding2015@gmail.com,Not captured,802049860,,Not captured,Not captured,Not captured,Not captured,Not captured,Not captured,
Not captured,Not captured,09/28/2020,01/28/2021,Not captured,Not captured,863949,020,00072,OVI-28-0056926,OverseasCare Visitors Insurance Plan,Not captured,Not captured,Not captured,Passport(383439908),,,Spasova,Tatyana,,11/10/1946,female,Not captured,Not captured,Not captured,Not captured,Not captured,Not captured,Not captured,Not captured,Not captured,Not captured,Not captured,Not captured,Not captured,Nikolay Spasov,Child,Not captured,Not captured,Not captured,Not captured,12068 Narrowleaf Ct,,Jacksonville,Florida,32225,9045254097,,Not captured,Not captured,nikolay.spasov@gmail.com,Not captured,802049853,,Not captured,Not captured,Not captured,Not captured,Not captured,Not captured,
Not captured,Not captured,09/28/2020,10/07/2020,Not captured,Not captured,863949,020,00072,ARS-01-0056885,Beacon International,Not captured,Not captured,Not captured,Passport(L5051938),,,SIDHU,KULWINDER SINGH,,11/12/1992,male,Not captured,Not captured,Not captured,Not captured,Not captured,Not captured,Not captured,Not captured,Not captured,Not captured,Not captured,Not captured,Not captured,DARSHAN SINGH,,Not captured,Not captured,Not captured,Not captured,HOUSE NO 239,,BATHINDA,PB,151103,+357-96941348,,Not captured,Not captured,kulwindersidhu108@gmail.com,Not captured,802049811,,Not captured,Not captured,Not captured,Not captured,Not captured,Not captured,
Not captured,Not captured,09/26/2020,10/23/2020,Not captured,Not captured,863949,020,00072,ARS-02-0056847,Beacon America,Not captured,Not captured,Not captured,Passport(N8545564),,,Phadke,Vinay,,05/22/1967,male,Not captured,Not captured,Not captured,Not captured,Not captured,Not captured,Not captured,Not captured,Not captured,Not captured,Not captured,Not captured,Not captured,Ameya Phadke,,Not captured,Not captured,Not captured,Not captured,Flat No 302 DMR Govind Kuti Lingampalli Kachiguda,,Hyderabad,TG,500027,+1-4082397288,,Not captured,Not captured,ameyavphadke@gmail.com,Not captured,802049705,,Not captured,Not captured,Not captured,Not captured,Not captured,Not captured,
Not captured,Not captured,09/24/2020,09/22/2021,Not captured,Not captured,863949,020,00072,ARS-01-0056832,Beacon International,Not captured,Not captured,Not captured,,,,Cutbill,Aibgail,CK,12/21/2019,female,Not captured,Not captured,Not captured,Not captured,Not captured,Not captured,Not captured,Not captured,Not captured,Not captured,Not captured,Not captured,Not captured,Luke Edward George Cutbill,Brother,Not captured,Not captured,Not captured,Not captured,6421 Nevilane Drive,,Duncan,British Columbia,V9l5s6,250 2520066,,Not captured,Not captured,jessecutbill@gmail.com,Not captured,802049688,,Not captured,Not captured,Not captured,Not captured,Not captured,Not captured,
Not captured,Not captured,09/24/2020,09/22/2021,Not captured,Not captured,863949,020,00072,ARS-01-0056831,Beacon International,Not captured,Not captured,Not captured,,,,Cutbill,Maria,,12/17/1992,female,Not captured,Not captured,Not captured,Not captured,Not captured,Not captured,Not captured,Not captured,Not captured,Not captured,Not captured,Not captured,Not captured,Luke Edward George Cutbill,Brother,Not captured,Not captured,Not captured,Not captured,6421 Nevilane Drive,,Duncan,British Columbia,V9l5s6,250 2520066,,Not captured,Not captured,jessecutbill@gmail.com,Not captured,802049687,,Not captured,Not captured,Not captured,Not captured,Not captured,Not captured,
Not captured,Not captured,09/24/2020,09/22/2021,Not captured,Not captured,863949,020,00072,ARS-01-0056830,Beacon International,Not captured,Not captured,Not captured,Passport(GC020111),,,Cutbill,Jesse ,E R,01/15/1992,male,Not captured,Not captured,Not captured,Not captured,Not captured,Not captured,Not captured,Not captured,Not captured,Not captured,Not captured,Not captured,Not captured,Luke Edward George Cutbill,Brother,Not captured,Not captured,Not captured,Not captured,6421 Nevilane Drive,,Duncan,British Columbia,V9l5s6,250 2520066,,Not captured,Not captured,jessecutbill@gmail.com,Not captured,802049686,,Not captured,Not captured,Not captured,Not captured,Not captured,Not captured,
Not captured,Not captured,09/25/2020,10/04/2020,Not captured,Not captured,863949,020,00072,ARS-01-0056783,Beacon International,Not captured,Not captured,Not captured,Passport(A07282654),,,Abioye,Taiwo Olushola,,06/28/1982,male,Not captured,Not captured,Not captured,Not captured,Not captured,Not captured,Not captured,Not captured,Not captured,Not captured,Not captured,Not captured,Not captured,Tubosun Abioye,,Not captured,Not captured,Not captured,Not captured,1521 Boyd Pointe Way,,Tysons Corner,VA,22182,+1-2408258151,,Not captured,Not captured,tyewoh@yahoo.com,Not captured,802049612,,Not captured,Not captured,Not captured,Not captured,Not captured,Not captured,
Not captured,Not captured,09/25/2020,10/04/2020,Not captured,Not captured,863949,020,00072,ARS-01-0056782,Beacon International,Not captured,Not captured,Not captured,Passport(A07574519),,,Adebo,Adelola Omonike,,09/26/1994,female,Not captured,Not captured,Not captured,Not captured,Not captured,Not captured,Not captured,Not captured,Not captured,Not captured,Not captured,Not captured,Not captured,Adetola Adebo,,Not captured,Not captured,Not captured,Not captured,BDF4 Al-Gamji Estate Aliyu Mustapha Boulevard Phase 4,,Wuye,Abuja,902101,+353-894992551,,Not captured,Not captured,adelolaadebo@gmail.com,Not captured,802049611,,Not captured,Not captured,Not captured,Not captured,Not captured,Not captured,
Not captured,Not captured,09/27/2020,01/24/2021,Not captured,Not captured,863949,020,00072,ARS-01-0056438,Beacon International,Not captured,Not captured,Not captured,Passport(578765992),,,Zormeier,Ariana Helene,,04/23/1998,female,Not captured,Not captured,Not captured,Not captured,Not captured,Not captured,Not captured,Not captured,Not captured,Not captured,Not captured,Not captured,Not captured,Danica Zormeier,,Not captured,Not captured,Not captured,Not captured,417 Eve Circle,,Placentia,CA,92870,+1-7148644282,+1-7149962741,Not captured,Not captured,azormeier@gmail.com,Not captured,802049177,,Not captured,Not captured,Not captured,Not captured,Not captured,Not captured,
Not captured,Not captured,10/14/2020,10/19/2020,Not captured,Not captured,863949,020,00072,BG001030-23-d481a714,International Assurance,Not captured,Not captured,Not captured,-,-,,Molyneaux,Craig,W,06/13/1969,male,Not captured,Not captured,Not captured,Not captured,Not captured,Not captured,Not captured,Not captured,Not captured,Not captured,Not captured,Not captured,Not captured,,,Not captured,Not captured,Not captured,Not captured,4001 Trimmier Rd,,Killeen,Texas,76542,2543688438,,Not captured,Not captured,craig@membc.org,Not captured,802049947,,Not captured,Not captured,Not captured,Not captured,Not captured,Not captured,