EE Transaction Type,Dependent Transaction Type,Effective Date,Expiry Date,EE Signature,EE Signature Date,Control,Suffix,Account,Plan Number,Plan Name,Claim Office,Network ID Number,Customer Code,EE SSN,Dependent SSN,Dependent Relationship,Last Name,First Name,Middle Initial,DOB,Gender,Ethnicity,PCP/PCD,PCP/PCD Current Patient,Provider Cap Office Number,COB,Dep Student Indicator,Dep OOA Indicator,EE Prior Coverage Indicator,EE Late Entrant,EE Language Indicator,Hire Date,Earnings,Earnings Frequency,Beneficiary (Last Name First Name MI),Beneficiary Relationship,Continuation of Coverage Expiration Date,Continuation of Coverage Event Date,Continuation of Coverage Length of Coverage,Work Location Zip Code,Street Address Line 1,Street Address Line 2,City,State,Zip Code,Home Phone Number,Work Phone Number,Accept Code,Evidence Code,EE Email Address,Communication Disability Code,EE Alternate ID,Dep Alternate ID,Old Control,Old Suffix,Old Account,New Control,New Suffix,New Account,
Not captured,Not captured,09/21/2020,12/31/2020,Not captured,Not captured,863949,020,00072,OVI-28-0056932,OverseasCare Visitors Insurance Plan,Not captured,Not captured,Not captured,Passport(N5454608),,,Kamarajugadda,Pratyusha,,03/23/1996,female,Not captured,Not captured,Not captured,Not captured,Not captured,Not captured,Not captured,Not captured,Not captured,Not captured,Not captured,Not captured,Not captured,Nagavenkata Velagaleti,Brother in law,Not captured,Not captured,Not captured,Not captured,2402 Long Meadow Way,,Lewisville,Texas,75056,9403958482,,Not captured,Not captured,mohan5sep@gmail.com,Not captured,802049859,,Not captured,Not captured,Not captured,Not captured,Not captured,Not captured,
Not captured,Not captured,09/21/2020,12/31/2020,Not captured,Not captured,863949,020,00072,ARS-02-0056928,Beacon America,Not captured,Not captured,Not captured,Passport(R3755630),,,Saviour Mathuram,Sushila Rajkumar,,06/09/1948,female,Not captured,Not captured,Not captured,Not captured,Not captured,Not captured,Not captured,Not captured,Not captured,Not captured,Not captured,Not captured,Not captured,Samuel R Santhoshkumar,,Not captured,Not captured,Not captured,Not captured,12/122 2nd Main Road M R Nagar,,Chennai,TN,600 118,+1-612-860-2680,,Not captured,Not captured,samsanthosh@yahoo.com,Not captured,802049855,,Not captured,Not captured,Not captured,Not captured,Not captured,Not captured,
Not captured,Not captured,09/21/2020,10/20/2020,Not captured,Not captured,863949,020,00072,ARS-02-0056923,Beacon America,Not captured,Not captured,Not captured,,,,Gumidelli,Vimala,,02/16/1962,female,Not captured,Not captured,Not captured,Not captured,Not captured,Not captured,Not captured,Not captured,Not captured,Not captured,Not captured,Not captured,Not captured,Srinivas Gumdelli,Spouse,Not captured,Not captured,Not captured,Not captured,Flat No 414 Vasavi Grand Vista Apt,,Secunderabad,TG,500015,+1-3474134827,,Not captured,Not captured,srinivasgumdelli@gmail.com,Not captured,802049850,,Not captured,Not captured,Not captured,Not captured,Not captured,Not captured,
Not captured,Not captured,09/21/2020,10/20/2020,Not captured,Not captured,863949,020,00072,ARS-02-0056922,Beacon America,Not captured,Not captured,Not captured,Passport(K415595),,,Gumidelli,Hanumanth Rao,,05/04/1955,male,Not captured,Not captured,Not captured,Not captured,Not captured,Not captured,Not captured,Not captured,Not captured,Not captured,Not captured,Not captured,Not captured,Srinivas Gumdelli,,Not captured,Not captured,Not captured,Not captured,Flat No 414 Vasavi Grand Vista Apt,,Secunderabad,TG,500015,+1-3474134827,,Not captured,Not captured,srinivasgumdelli@gmail.com,Not captured,802049849,,Not captured,Not captured,Not captured,Not captured,Not captured,Not captured,
Not captured,Not captured,09/21/2020,06/30/2021,Not captured,Not captured,863949,020,00072,ARS-02-0056921,Beacon America,Not captured,Not captured,Not captured,Passport(E40878361),,,Zhao,Hongtu,,01/04/2011,male,Not captured,Not captured,Not captured,Not captured,Not captured,Not captured,Not captured,Not captured,Not captured,Not captured,Not captured,Not captured,Not captured,Alice Leehan Chong,,Not captured,Not captured,Not captured,Not captured,1801 #6 Building #2 Section Dayunchengbang,,Dongguan,Guangdong,523705,+1-8609856449,,Not captured,Not captured,tjc860@gmail.com,Not captured,802049848,,Not captured,Not captured,Not captured,Not captured,Not captured,Not captured,
Not captured,Not captured,09/20/2020,09/28/2020,Not captured,Not captured,863949,020,00072,ARS-01-0056919,Beacon International,Not captured,Not captured,Not captured,,,,Hubbard,Wesley,,04/21/1978,male,Not captured,Not captured,Not captured,Not captured,Not captured,Not captured,Not captured,Not captured,Not captured,Not captured,Not captured,Not captured,Not captured,,,Not captured,Not captured,Not captured,Not captured,77 62nd Pl,,Long Beach,California,90803,,,Not captured,Not captured,wesleyhubbard@gmail.com,Not captured,802049846,,Not captured,Not captured,Not captured,Not captured,Not captured,Not captured,
Not captured,Not captured,09/20/2020,09/26/2020,Not captured,Not captured,863949,020,00072,ARS-01-0056918,Beacon International,Not captured,Not captured,Not captured,,,,Sturges III,Thomas,J,03/22/1992,male,Not captured,Not captured,Not captured,Not captured,Not captured,Not captured,Not captured,Not captured,Not captured,Not captured,Not captured,Not captured,Not captured,,,Not captured,Not captured,Not captured,Not captured,7949 Caroline Court,,Dublin,California,94568,,,Not captured,Not captured,sturges_t@yahoo.com,Not captured,802049845,,Not captured,Not captured,Not captured,Not captured,Not captured,Not captured,
Not captured,Not captured,09/19/2020,10/03/2020,Not captured,Not captured,863949,020,00072,ARS-01-0056916,Beacon International,Not captured,Not captured,Not captured,,,,Bell,Brian,,06/15/1985,male,Not captured,Not captured,Not captured,Not captured,Not captured,Not captured,Not captured,Not captured,Not captured,Not captured,Not captured,Not captured,Not captured,,,Not captured,Not captured,Not captured,Not captured,14364 Stablestone Ct,,Chesterfield,Missouri,63017,,,Not captured,Not captured,brianbellnyc@gmail.com,Not captured,802049843,,Not captured,Not captured,Not captured,Not captured,Not captured,Not captured,
Not captured,Not captured,09/20/2020,04/02/2021,Not captured,Not captured,863949,020,00072,ARS-02-0056915,Beacon America,Not captured,Not captured,Not captured,Passport(ED9421369),,,GONG,MIN,,07/12/1963,female,Not captured,Not captured,Not captured,Not captured,Not captured,Not captured,Not captured,Not captured,Not captured,Not captured,Not captured,Not captured,Not captured,ZHENYING JIANG,,Not captured,Not captured,Not captured,Not captured,1555 North Kaixuan Road Building 65,,Shanghai,Shanghai,200063,+86-13817809197,+1-2026403802,Not captured,Not captured,michaelilee18@gmail.com,Not captured,802049842,,Not captured,Not captured,Not captured,Not captured,Not captured,Not captured,
Not captured,Not captured,09/19/2020,11/18/2020,Not captured,Not captured,863949,020,00072,ARS-02-0056914,Beacon America,Not captured,Not captured,Not captured,,,,Gunti,Lalitha,,06/18/1969,female,Not captured,Not captured,Not captured,Not captured,Not captured,Not captured,Not captured,Not captured,Not captured,Not captured,Not captured,Not captured,Not captured,Nagajyothi Gunti,Spouse,Not captured,Not captured,Not captured,Not captured,Mayflower Grande E 005,,Hyderabad,TG,500076,+1-7165363988,,Not captured,Not captured,sravanreddy001@gmail.com,Not captured,802049841,,Not captured,Not captured,Not captured,Not captured,Not captured,Not captured,
Not captured,Not captured,09/19/2020,11/18/2020,Not captured,Not captured,863949,020,00072,ARS-02-0056913,Beacon America,Not captured,Not captured,Not captured,Passport(J9826784),,,Gunti,Manohar,,04/18/1966,male,Not captured,Not captured,Not captured,Not captured,Not captured,Not captured,Not captured,Not captured,Not captured,Not captured,Not captured,Not captured,Not captured,Nagajyothi Gunti,,Not captured,Not captured,Not captured,Not captured,Mayflower Grande E 005,,Hyderabad,TG,500076,+1-7165363988,,Not captured,Not captured,sravanreddy001@gmail.com,Not captured,802049840,,Not captured,Not captured,Not captured,Not captured,Not captured,Not captured,
Not captured,Not captured,09/21/2020,10/16/2020,Not captured,Not captured,863949,020,00072,ARS-01-0056910,Beacon International,Not captured,Not captured,Not captured,,,,Villeza,Jushua Romero,,06/30/2000,male,Not captured,Not captured,Not captured,Not captured,Not captured,Not captured,Not captured,Not captured,Not captured,Not captured,Not captured,Not captured,Not captured,,,Not captured,Not captured,Not captured,Not captured,1 Johnson Way,,Arundel,England,BN18 0TD,091472648,,Not captured,Not captured,luke.ironside@yahoo.com,Not captured,802049837,,Not captured,Not captured,Not captured,Not captured,Not captured,Not captured,
Not captured,Not captured,09/20/2020,09/26/2020,Not captured,Not captured,863949,020,00072,ARS-01-0056901,Beacon International,Not captured,Not captured,Not captured,Passport(A24691050),,,TORKI,SOHAILA,,05/10/2001,female,Not captured,Not captured,Not captured,Not captured,Not captured,Not captured,Not captured,Not captured,Not captured,Not captured,Not captured,Not captured,Not captured,KHALED TORKI,,Not captured,Not captured,Not captured,Not captured,STAR AREA ST.,,HARGEISA,HARGEISA,00252,+252-633140239,,Not captured,Not captured,drama2501@gmail.com,Not captured,802049828,,Not captured,Not captured,Not captured,Not captured,Not captured,Not captured,
Not captured,Not captured,09/18/2020,10/23/2020,Not captured,Not captured,863949,020,00072,ARS-02-0056900,Beacon America,Not captured,Not captured,Not captured,,,,VIJAYARAGHAVAN,SOUNDARAVALLI,,05/09/1955,female,Not captured,Not captured,Not captured,Not captured,Not captured,Not captured,Not captured,Not captured,Not captured,Not captured,Not captured,Not captured,Not captured,GOKUL VIJAYARAGHAVAN,Spouse,Not captured,Not captured,Not captured,Not captured,22 MG Nagar Phase 1 shakthi vinayagar kovil street,,Urapakkam,Uttaranchal,603210,+1-3212308468,,Not captured,Not captured,loyolagokul@gmail.com,Not captured,802049827,,Not captured,Not captured,Not captured,Not captured,Not captured,Not captured,
Not captured,Not captured,09/18/2020,10/23/2020,Not captured,Not captured,863949,020,00072,ARS-02-0056899,Beacon America,Not captured,Not captured,Not captured,Passport(T6993111),,,RANGACHARI,VIJAYARAGHAVAN,,06/24/1953,male,Not captured,Not captured,Not captured,Not captured,Not captured,Not captured,Not captured,Not captured,Not captured,Not captured,Not captured,Not captured,Not captured,GOKUL VIJAYARAGHAVAN,,Not captured,Not captured,Not captured,Not captured,22 MG Nagar Phase 1 shakthi vinayagar kovil street,,Urapakkam,Uttaranchal,603210,+1-3212308468,,Not captured,Not captured,loyolagokul@gmail.com,Not captured,802049826,,Not captured,Not captured,Not captured,Not captured,Not captured,Not captured,
Not captured,Not captured,09/21/2020,09/19/2021,Not captured,Not captured,863949,020,00072,ARS-01-0056898,Beacon International,Not captured,Not captured,Not captured,Passport(487249663),,,Lord,Timothy,,10/26/1986,male,Not captured,Not captured,Not captured,Not captured,Not captured,Not captured,Not captured,Not captured,Not captured,Not captured,Not captured,Not captured,Not captured,,,Not captured,Not captured,Not captured,Not captured,194 SW Wester Dr,,Lake City,Florida,32024,3862884197,,Not captured,Not captured,cassietim@gmail.com,Not captured,802049825,,Not captured,Not captured,Not captured,Not captured,Not captured,Not captured,
Not captured,Not captured,09/19/2020,10/01/2020,Not captured,Not captured,863949,020,00072,ARS-01-0056893,Beacon International,Not captured,Not captured,Not captured,Passport(499808515),,,Santos,Dennis L,,03/22/1968,male,Not captured,Not captured,Not captured,Not captured,Not captured,Not captured,Not captured,Not captured,Not captured,Not captured,Not captured,Not captured,Not captured,Dawn A Anthony,,Not captured,Not captured,Not captured,Not captured,49 Ferncliff Road,,Morris Plains,NJ,07950,+1-9734767849,,Not captured,Not captured,deepthinker@optonline.net,Not captured,802049819,,Not captured,Not captured,Not captured,Not captured,Not captured,Not captured,
Not captured,Not captured,09/18/2020,10/17/2020,Not captured,Not captured,863949,020,00072,ARS-01-0056892,Beacon International,Not captured,Not captured,Not captured,Passport(491777642),,,Reid,Nathaniel Emmons,,02/01/1972,male,Not captured,Not captured,Not captured,Not captured,Not captured,Not captured,Not captured,Not captured,Not captured,Not captured,Not captured,Not captured,Not captured,Gavin Reid,,Not captured,Not captured,Not captured,Not captured,2482 Pleasant View,,Rochester Hills,MI,48306,+1-2484250550,,Not captured,Not captured,natereid@protonmail.com,Not captured,802049818,,Not captured,Not captured,Not captured,Not captured,Not captured,Not captured,
Not captured,Not captured,09/18/2020,09/28/2020,Not captured,Not captured,863949,020,00072,ARS-01-0056891,Beacon International,Not captured,Not captured,Not captured,,,,Ervin,Lawrence,,03/06/1983,male,Not captured,Not captured,Not captured,Not captured,Not captured,Not captured,Not captured,Not captured,Not captured,Not captured,Not captured,Not captured,Not captured,,,Not captured,Not captured,Not captured,Not captured,723 Brambling Way,,Stockbridge,Georgia,30281,,,Not captured,Not captured,dr.ervinlc@gmail.com,Not captured,802049817,,Not captured,Not captured,Not captured,Not captured,Not captured,Not captured,
Not captured,Not captured,09/20/2020,11/14/2020,Not captured,Not captured,863949,020,00072,ARS-01-0056889,Beacon International,Not captured,Not captured,Not captured,Passport(507656782),,,Gracie,Jenifer Oliver,,05/07/1984,female,Not captured,Not captured,Not captured,Not captured,Not captured,Not captured,Not captured,Not captured,Not captured,Not captured,Not captured,Not captured,Not captured,Miles Pickens,,Not captured,Not captured,Not captured,Not captured,21383 Nolan Ct,,Bend,OR,97701,+1-7142067218,+1-7144788780,Not captured,Not captured,gracie.jenifer@gmail.com,Not captured,802049815,,Not captured,Not captured,Not captured,Not captured,Not captured,Not captured,
Not captured,Not captured,09/17/2020,10/17/2020,Not captured,Not captured,863949,020,00072,ARS-02-0056887,Beacon America,Not captured,Not captured,Not captured,Passport(32736062),,,gruzman,israel josef,,10/24/2000,male,Not captured,Not captured,Not captured,Not captured,Not captured,Not captured,Not captured,Not captured,Not captured,Not captured,Not captured,Not captured,Not captured,devirah gruzman,,Not captured,Not captured,Not captured,Not captured,Shlomo Molcho St. # 6,,Rishon LeZion,ISRAEL,7533006,+1-+17187744920,,Not captured,Not captured,devirah@gmail.com,Not captured,802049813,,Not captured,Not captured,Not captured,Not captured,Not captured,Not captured,
Not captured,Not captured,09/17/2020,10/31/2020,Not captured,Not captured,863949,020,00072,ARS-01-0056886,Beacon International,Not captured,Not captured,Not captured,Passport(488313670),,,Mosse,Richard,,06/01/1980,male,Not captured,Not captured,Not captured,Not captured,Not captured,Not captured,Not captured,Not captured,Not captured,Not captured,Not captured,Not captured,Not captured,Susan,,Not captured,Not captured,Not captured,Not captured,1666 Summerfield St,,Ridgwood,NY,11385,+1-2063840461,,Not captured,Not captured,info@strange-edition.com,Not captured,802049812,,Not captured,Not captured,Not captured,Not captured,Not captured,Not captured,
Not captured,Not captured,09/16/2020,09/22/2020,Not captured,Not captured,863949,020,00072,ARS-01-0056883,Beacon International,Not captured,Not captured,Not captured,,,,hammer,solomon,,04/18/2002,male,Not captured,Not captured,Not captured,Not captured,Not captured,Not captured,Not captured,Not captured,Not captured,Not captured,Not captured,Not captured,Not captured,,,Not captured,Not captured,Not captured,Not captured,1354 51st street,,Brooklyn,New York,11219,,,Not captured,Not captured,shloimyhammer@gmail.com,Not captured,802049763,,Not captured,Not captured,Not captured,Not captured,Not captured,Not captured,
Not captured,Not captured,09/18/2020,11/19/2020,Not captured,Not captured,863949,020,00072,OVI-41-0056881,Overseas Visitors Insurance Plan A,Not captured,Not captured,Not captured,,,,Chadha,Ripla,,07/25/1948,female,Not captured,Not captured,Not captured,Not captured,Not captured,Not captured,Not captured,Not captured,Not captured,Not captured,Not captured,Not captured,Not captured,,,Not captured,Not captured,Not captured,Not captured,105 Marco Polo Dr,,Morgantown,West Virginia,26508,202-489-6278,,Not captured,Not captured,pradeepchadha1@gmail.com,Not captured,802049761,,Not captured,Not captured,Not captured,Not captured,Not captured,Not captured,
Not captured,Not captured,09/16/2020,10/15/2020,Not captured,Not captured,863949,020,00072,ARS-02-0056877,Beacon America,Not captured,Not captured,Not captured,Passport(E49996526),,,Gong,Yan,,04/24/1980,female,Not captured,Not captured,Not captured,Not captured,Not captured,Not captured,Not captured,Not captured,Not captured,Not captured,Not captured,Not captured,Not captured,Zhe Jin,,Not captured,Not captured,Not captured,Not captured,GuoShuiXiaoQu,,WuZhong,NingXia,750000,+1-5807320129,,Not captured,Not captured,youngygong@gmail.com,Not captured,802049757,,Not captured,Not captured,Not captured,Not captured,Not captured,Not captured,
Not captured,Not captured,09/15/2020,09/13/2021,Not captured,Not captured,863949,020,00072,ARS-03-0056781,Essential International,Not captured,Not captured,Not captured,Passport(2183124),,,Kipkirui ,Hezron ,,05/04/1993,male,Not captured,Not captured,Not captured,Not captured,Not captured,Not captured,Not captured,Not captured,Not captured,Not captured,Not captured,Not captured,Not captured,,,Not captured,Not captured,Not captured,Not captured,179 Montrose drive,,Montrose,Colorado,81401,+19707871908,,Not captured,Not captured,kipkiruihezron@gmail.com,Not captured,802049610,,Not captured,Not captured,Not captured,Not captured,Not captured,Not captured,
Not captured,Not captured,09/18/2020,09/13/2021,Not captured,Not captured,863949,020,00072,ARS-01-0056875,Beacon International,Not captured,Not captured,Not captured,Passport(AE287204),,,Mellhi,Taranjit Kaur,,10/12/1995,female,Not captured,Not captured,Not captured,Not captured,Not captured,Not captured,Not captured,Not captured,Not captured,Not captured,Not captured,Not captured,Not captured,Tajinder Mellhi,,Not captured,Not captured,Not captured,Not captured,3473 Okanagan Drive,,Abbotsford,BC,V2T4Z3,+1-7785368543,,Not captured,Not captured,taranmellhi@hotmail.com,Not captured,802049755,,Not captured,Not captured,Not captured,Not captured,Not captured,Not captured,
Not captured,Not captured,09/15/2020,09/18/2020,Not captured,Not captured,863949,020,00072,ARS-01-0056874,Beacon International,Not captured,Not captured,Not captured,,,,Lundquist,Landon,L,11/26/1991,male,Not captured,Not captured,Not captured,Not captured,Not captured,Not captured,Not captured,Not captured,Not captured,Not captured,Not captured,Not captured,Not captured,,,Not captured,Not captured,Not captured,Not captured,3137 Armstrongs Drive,,Corona,California,92881,,,Not captured,Not captured,lundquistlandon@gmail.com,Not captured,802049735,,Not captured,Not captured,Not captured,Not captured,Not captured,Not captured,
Not captured,Not captured,09/17/2020,03/08/2021,Not captured,Not captured,863949,020,00072,ARS-02-0056872,Beacon America,Not captured,Not captured,Not captured,Passport(R0622751),,,Akkineni,Jyothi Krishna,,06/02/1959,female,Not captured,Not captured,Not captured,Not captured,Not captured,Not captured,Not captured,Not captured,Not captured,Not captured,Not captured,Not captured,Not captured,Praneeth Uppalapati,,Not captured,Not captured,Not captured,Not captured,17-1-391/S/459 Singareni colony,,Hyderabad,TG,500059,+1-6083814936,,Not captured,Not captured,luvupran@gmail.com,Not captured,802049733,,Not captured,Not captured,Not captured,Not captured,Not captured,Not captured,
Not captured,Not captured,09/14/2020,10/14/2020,Not captured,Not captured,863949,020,00072,ARS-02-0056870,Beacon America,Not captured,Not captured,Not captured,Passport(G26551883),,,Juarez Nieto,Sofia,,09/27/1997,female,Not captured,Not captured,Not captured,Not captured,Not captured,Not captured,Not captured,Not captured,Not captured,Not captured,Not captured,Not captured,Not captured,Laura Georgina Nieto Uribe,,Not captured,Not captured,Not captured,Not captured,Sierra de Bucareli 138,,Queretaro,Queretaro,76046,+52-4426680645,,Not captured,Not captured,sofinieto1@gmail.com,Not captured,802049731,,Not captured,Not captured,Not captured,Not captured,Not captured,Not captured,
Not captured,Not captured,09/14/2020,09/25/2020,Not captured,Not captured,863949,020,00072,ARS-01-0056868,Beacon International,Not captured,Not captured,Not captured,Passport(584393475),,,Martz Jr,William Arthur,,06/27/1979,male,Not captured,Not captured,Not captured,Not captured,Not captured,Not captured,Not captured,Not captured,Not captured,Not captured,Not captured,Not captured,Not captured,Chris martz,,Not captured,Not captured,Not captured,Not captured,1512 cranberry Rockland rs,,Kennerdell,Pennsylvania,16374,+1-8146733028,,Not captured,Not captured,wil2279@yahoo.com,Not captured,802049729,,Not captured,Not captured,Not captured,Not captured,Not captured,Not captured,
Not captured,Not captured,09/14/2020,05/31/2021,Not captured,Not captured,863949,020,00072,ARS-01-0056863,Beacon International,Not captured,Not captured,Not captured,Passport(519454648),,,Florakis,Christina,,12/08/1996,female,Not captured,Not captured,Not captured,Not captured,Not captured,Not captured,Not captured,Not captured,Not captured,Not captured,Not captured,Not captured,Not captured,,,Not captured,Not captured,Not captured,Not captured,329 Stuart Drive,,New Rochelle,New York,10804,914-523-5055,01130-698-938-2245,Not captured,Not captured,christina.florakis@gmail.com,Not captured,802049723,,Not captured,Not captured,Not captured,Not captured,Not captured,Not captured,
Not captured,Not captured,09/16/2020,10/16/2020,Not captured,Not captured,863949,020,00072,ARS-02-0056862,Beacon America,Not captured,Not captured,Not captured,,,,Kruger,Tziporah,,08/13/1998,female,Not captured,Not captured,Not captured,Not captured,Not captured,Not captured,Not captured,Not captured,Not captured,Not captured,Not captured,Not captured,Not captured,,,Not captured,Not captured,Not captured,Not captured,1321 Georgian terr,,Lakewood,New Jersey,08701,732-886-5751,,Not captured,Not captured,tzippycensor@gmail.com,Not captured,802049722,,Not captured,Not captured,Not captured,Not captured,Not captured,Not captured,
Not captured,Not captured,09/16/2020,10/16/2020,Not captured,Not captured,863949,020,00072,ARS-02-0056861,Beacon America,Not captured,Not captured,Not captured,,,,Censor,Zev W ,,04/11/1999,male,Not captured,Not captured,Not captured,Not captured,Not captured,Not captured,Not captured,Not captured,Not captured,Not captured,Not captured,Not captured,Not captured,,,Not captured,Not captured,Not captured,Not captured,1321 Georgian terr,,Lakewood,New Jersey,08701,732-886-5751,,Not captured,Not captured,tzippycensor@gmail.com,Not captured,802049721,,Not captured,Not captured,Not captured,Not captured,Not captured,Not captured,