EE Transaction Type,Dependent Transaction Type,Effective Date,Expiry Date,EE Signature,EE Signature Date,Control,Suffix,Account,Plan Number,Plan Name,Claim Office,Network ID Number,Customer Code,EE SSN,Dependent SSN,Dependent Relationship,Last Name,First Name,Middle Initial,DOB,Gender,Ethnicity,PCP/PCD,PCP/PCD Current Patient,Provider Cap Office Number,COB,Dep Student Indicator,Dep OOA Indicator,EE Prior Coverage Indicator,EE Late Entrant,EE Language Indicator,Hire Date,Earnings,Earnings Frequency,Beneficiary (Last Name First Name MI),Beneficiary Relationship,Continuation of Coverage Expiration Date,Continuation of Coverage Event Date,Continuation of Coverage Length of Coverage,Work Location Zip Code,Street Address Line 1,Street Address Line 2,City,State,Zip Code,Home Phone Number,Work Phone Number,Accept Code,Evidence Code,EE Email Address,Communication Disability Code,EE Alternate ID,Dep Alternate ID,Old Control,Old Suffix,Old Account,New Control,New Suffix,New Account,
Not captured,Not captured,09/17/2020,10/31/2020,Not captured,Not captured,863949,020,00072,ARS-01-0056886,Beacon International,Not captured,Not captured,Not captured,Passport(488313670),,,Mosse,Richard,,06/01/1980,male,Not captured,Not captured,Not captured,Not captured,Not captured,Not captured,Not captured,Not captured,Not captured,Not captured,Not captured,Not captured,Not captured,Susan,,Not captured,Not captured,Not captured,Not captured,1666 Summerfield St,,Ridgwood,NY,11385,+1-2063840461,,Not captured,Not captured,info@strange-edition.com,Not captured,802049812,,Not captured,Not captured,Not captured,Not captured,Not captured,Not captured,
Not captured,Not captured,09/16/2020,09/22/2020,Not captured,Not captured,863949,020,00072,ARS-01-0056883,Beacon International,Not captured,Not captured,Not captured,,,,hammer,solomon,,04/18/2002,male,Not captured,Not captured,Not captured,Not captured,Not captured,Not captured,Not captured,Not captured,Not captured,Not captured,Not captured,Not captured,Not captured,,,Not captured,Not captured,Not captured,Not captured,1354 51st street,,Brooklyn,New York,11219,,,Not captured,Not captured,shloimyhammer@gmail.com,Not captured,802049763,,Not captured,Not captured,Not captured,Not captured,Not captured,Not captured,
Not captured,Not captured,09/16/2020,10/15/2020,Not captured,Not captured,863949,020,00072,ARS-02-0056877,Beacon America,Not captured,Not captured,Not captured,Passport(E49996526),,,Gong,Yan,,04/24/1980,female,Not captured,Not captured,Not captured,Not captured,Not captured,Not captured,Not captured,Not captured,Not captured,Not captured,Not captured,Not captured,Not captured,Zhe Jin,,Not captured,Not captured,Not captured,Not captured,GuoShuiXiaoQu,,WuZhong,NingXia,750000,+1-5807320129,,Not captured,Not captured,youngygong@gmail.com,Not captured,802049757,,Not captured,Not captured,Not captured,Not captured,Not captured,Not captured,
Not captured,Not captured,09/15/2020,09/13/2021,Not captured,Not captured,863949,020,00072,ARS-03-0056781,Essential International,Not captured,Not captured,Not captured,Passport(2183124),,,Kipkirui ,Hezron ,,05/04/1993,male,Not captured,Not captured,Not captured,Not captured,Not captured,Not captured,Not captured,Not captured,Not captured,Not captured,Not captured,Not captured,Not captured,,,Not captured,Not captured,Not captured,Not captured,179 Montrose drive,,Montrose,Colorado,81401,+19707871908,,Not captured,Not captured,kipkiruihezron@gmail.com,Not captured,802049610,,Not captured,Not captured,Not captured,Not captured,Not captured,Not captured,
Not captured,Not captured,09/15/2020,09/18/2020,Not captured,Not captured,863949,020,00072,ARS-01-0056874,Beacon International,Not captured,Not captured,Not captured,,,,Lundquist,Landon,L,11/26/1991,male,Not captured,Not captured,Not captured,Not captured,Not captured,Not captured,Not captured,Not captured,Not captured,Not captured,Not captured,Not captured,Not captured,,,Not captured,Not captured,Not captured,Not captured,3137 Armstrongs Drive,,Corona,California,92881,,,Not captured,Not captured,lundquistlandon@gmail.com,Not captured,802049735,,Not captured,Not captured,Not captured,Not captured,Not captured,Not captured,
Not captured,Not captured,09/17/2020,03/08/2021,Not captured,Not captured,863949,020,00072,ARS-02-0056872,Beacon America,Not captured,Not captured,Not captured,Passport(R0622751),,,Akkineni,Jyothi Krishna,,06/02/1959,female,Not captured,Not captured,Not captured,Not captured,Not captured,Not captured,Not captured,Not captured,Not captured,Not captured,Not captured,Not captured,Not captured,Praneeth Uppalapati,,Not captured,Not captured,Not captured,Not captured,17-1-391/S/459 Singareni colony,,Hyderabad,TG,500059,+1-6083814936,,Not captured,Not captured,luvupran@gmail.com,Not captured,802049733,,Not captured,Not captured,Not captured,Not captured,Not captured,Not captured,
Not captured,Not captured,09/14/2020,10/14/2020,Not captured,Not captured,863949,020,00072,ARS-02-0056870,Beacon America,Not captured,Not captured,Not captured,Passport(G26551883),,,Juarez Nieto,Sofia,,09/27/1997,female,Not captured,Not captured,Not captured,Not captured,Not captured,Not captured,Not captured,Not captured,Not captured,Not captured,Not captured,Not captured,Not captured,Laura Georgina Nieto Uribe,,Not captured,Not captured,Not captured,Not captured,Sierra de Bucareli 138,,Queretaro,Queretaro,76046,+52-4426680645,,Not captured,Not captured,sofinieto1@gmail.com,Not captured,802049731,,Not captured,Not captured,Not captured,Not captured,Not captured,Not captured,
Not captured,Not captured,09/14/2020,09/25/2020,Not captured,Not captured,863949,020,00072,ARS-01-0056868,Beacon International,Not captured,Not captured,Not captured,Passport(584393475),,,Martz Jr,William Arthur,,06/27/1979,male,Not captured,Not captured,Not captured,Not captured,Not captured,Not captured,Not captured,Not captured,Not captured,Not captured,Not captured,Not captured,Not captured,Chris martz,,Not captured,Not captured,Not captured,Not captured,1512 cranberry Rockland rs,,Kennerdell,Pennsylvania,16374,+1-8146733028,,Not captured,Not captured,wil2279@yahoo.com,Not captured,802049729,,Not captured,Not captured,Not captured,Not captured,Not captured,Not captured,
Not captured,Not captured,09/14/2020,05/31/2021,Not captured,Not captured,863949,020,00072,ARS-01-0056863,Beacon International,Not captured,Not captured,Not captured,Passport(519454648),,,Florakis,Christina,,12/08/1996,female,Not captured,Not captured,Not captured,Not captured,Not captured,Not captured,Not captured,Not captured,Not captured,Not captured,Not captured,Not captured,Not captured,,,Not captured,Not captured,Not captured,Not captured,329 Stuart Drive,,New Rochelle,New York,10804,914-523-5055,01130-698-938-2245,Not captured,Not captured,christina.florakis@gmail.com,Not captured,802049723,,Not captured,Not captured,Not captured,Not captured,Not captured,Not captured,
Not captured,Not captured,09/16/2020,10/16/2020,Not captured,Not captured,863949,020,00072,ARS-02-0056862,Beacon America,Not captured,Not captured,Not captured,,,,Kruger,Tziporah,,08/13/1998,female,Not captured,Not captured,Not captured,Not captured,Not captured,Not captured,Not captured,Not captured,Not captured,Not captured,Not captured,Not captured,Not captured,,,Not captured,Not captured,Not captured,Not captured,1321 Georgian terr,,Lakewood,New Jersey,08701,732-886-5751,,Not captured,Not captured,tzippycensor@gmail.com,Not captured,802049722,,Not captured,Not captured,Not captured,Not captured,Not captured,Not captured,
Not captured,Not captured,09/16/2020,10/16/2020,Not captured,Not captured,863949,020,00072,ARS-02-0056861,Beacon America,Not captured,Not captured,Not captured,,,,Censor,Zev W ,,04/11/1999,male,Not captured,Not captured,Not captured,Not captured,Not captured,Not captured,Not captured,Not captured,Not captured,Not captured,Not captured,Not captured,Not captured,,,Not captured,Not captured,Not captured,Not captured,1321 Georgian terr,,Lakewood,New Jersey,08701,732-886-5751,,Not captured,Not captured,tzippycensor@gmail.com,Not captured,802049721,,Not captured,Not captured,Not captured,Not captured,Not captured,Not captured,
Not captured,Not captured,09/13/2020,10/13/2020,Not captured,Not captured,863949,020,00072,ARS-02-0056856,Beacon America,Not captured,Not captured,Not captured,Passport(H3261586),,,Pendkar,Minal Ravindra,,09/08/1959,female,Not captured,Not captured,Not captured,Not captured,Not captured,Not captured,Not captured,Not captured,Not captured,Not captured,Not captured,Not captured,Not captured,Chetana Pendkar,,Not captured,Not captured,Not captured,Not captured,9 Prakash Opp Brahman sahayah Sangh,,Mumbai,MH,400028,+1-6183534187,,Not captured,Not captured,chetanapendkar@gmail.com,Not captured,802049714,,Not captured,Not captured,Not captured,Not captured,Not captured,Not captured,
Not captured,Not captured,09/13/2020,09/23/2020,Not captured,Not captured,863949,020,00072,ARS-01-0056855,Beacon International,Not captured,Not captured,Not captured,,,,Breines,Jacob,,06/21/1973,male,Not captured,Not captured,Not captured,Not captured,Not captured,Not captured,Not captured,Not captured,Not captured,Not captured,Not captured,Not captured,Not captured,,,Not captured,Not captured,Not captured,Not captured,8 Laura place,,Spring valley,New York,10977,,,Not captured,Not captured,chanabreines@gmail.com,Not captured,802049713,,Not captured,Not captured,Not captured,Not captured,Not captured,Not captured,
Not captured,Not captured,09/13/2020,09/23/2020,Not captured,Not captured,863949,020,00072,ARS-01-0056854,Beacon International,Not captured,Not captured,Not captured,,,,Breines,Yosef,,06/03/1998,male,Not captured,Not captured,Not captured,Not captured,Not captured,Not captured,Not captured,Not captured,Not captured,Not captured,Not captured,Not captured,Not captured,,,Not captured,Not captured,Not captured,Not captured,8 Laura place,,Spring valley,New York,10977,,,Not captured,Not captured,chanabreines@gmail.com,Not captured,802049712,,Not captured,Not captured,Not captured,Not captured,Not captured,Not captured,
Not captured,Not captured,09/13/2020,09/21/2020,Not captured,Not captured,863949,020,00072,ARS-01-0056853,Beacon International,Not captured,Not captured,Not captured,,,,Koronfel,Safya,,11/26/2016,female,Not captured,Not captured,Not captured,Not captured,Not captured,Not captured,Not captured,Not captured,Not captured,Not captured,Not captured,Not captured,Not captured,,,Not captured,Not captured,Not captured,Not captured,3257 ALCOVY CLUB CT,,DACULA,Georgia,30019,,,Not captured,Not captured,maminfekry@yahoo.com,Not captured,802049711,,Not captured,Not captured,Not captured,Not captured,Not captured,Not captured,
Not captured,Not captured,09/13/2020,09/21/2020,Not captured,Not captured,863949,020,00072,ARS-01-0056852,Beacon International,Not captured,Not captured,Not captured,,,,Koronfel,Mohamed,,07/15/1986,male,Not captured,Not captured,Not captured,Not captured,Not captured,Not captured,Not captured,Not captured,Not captured,Not captured,Not captured,Not captured,Not captured,,,Not captured,Not captured,Not captured,Not captured,3257 ALCOVY CLUB CT,,DACULA,Georgia,30019,,,Not captured,Not captured,maminfekry@yahoo.com,Not captured,802049710,,Not captured,Not captured,Not captured,Not captured,Not captured,Not captured,
Not captured,Not captured,09/13/2020,09/21/2020,Not captured,Not captured,863949,020,00072,ARS-01-0056851,Beacon International,Not captured,Not captured,Not captured,,,,Pineiro,Johanna,,09/03/1985,female,Not captured,Not captured,Not captured,Not captured,Not captured,Not captured,Not captured,Not captured,Not captured,Not captured,Not captured,Not captured,Not captured,,,Not captured,Not captured,Not captured,Not captured,3257 ALCOVY CLUB CT,,DACULA,Georgia,30019,,,Not captured,Not captured,maminfekry@yahoo.com,Not captured,802049709,,Not captured,Not captured,Not captured,Not captured,Not captured,Not captured,
Not captured,Not captured,09/13/2020,12/13/2020,Not captured,Not captured,863949,020,00072,ARS-02-0056850,Beacon America,Not captured,Not captured,Not captured,Passport(E59348029),,,HOU,DATONG,,11/06/1981,male,Not captured,Not captured,Not captured,Not captured,Not captured,Not captured,Not captured,Not captured,Not captured,Not captured,Not captured,Not captured,Not captured,,,Not captured,Not captured,Not captured,Not captured,65 Hickory Ct,,Danville,California,94506,(925) 856-2778,,Not captured,Not captured,lilichen11@yahoo.com,Not captured,802049708,,Not captured,Not captured,Not captured,Not captured,Not captured,Not captured,
Not captured,Not captured,09/13/2020,09/22/2020,Not captured,Not captured,863949,020,00072,ARS-01-0056849,Beacon International,Not captured,Not captured,Not captured,,,,Goldberg,Eli,,10/23/1990,male,Not captured,Not captured,Not captured,Not captured,Not captured,Not captured,Not captured,Not captured,Not captured,Not captured,Not captured,Not captured,Not captured,,,Not captured,Not captured,Not captured,Not captured,977 East 28th Street,,Brooklyn,New York,11210-3729,,,Not captured,Not captured,elig613@gmail.com,Not captured,802049707,,Not captured,Not captured,Not captured,Not captured,Not captured,Not captured,
Not captured,Not captured,09/14/2020,11/30/2020,Not captured,Not captured,863949,020,00072,ARS-02-0056848,Beacon America,Not captured,Not captured,Not captured,Passport(J3138181),,,Udayashankar,Tarur Sudha,,05/30/1965,female,Not captured,Not captured,Not captured,Not captured,Not captured,Not captured,Not captured,Not captured,Not captured,Not captured,Not captured,Not captured,Not captured,Nanda Sasi,,Not captured,Not captured,Not captured,Not captured,9A Narayana,,Coimbatore,TN,641008,+1-5178983278,,Not captured,Not captured,nkumarvit@gmail.com,Not captured,802049706,,Not captured,Not captured,Not captured,Not captured,Not captured,Not captured,
Not captured,Not captured,09/13/2020,10/27/2020,Not captured,Not captured,863949,020,00072,ARS-01-0056846,Beacon International,Not captured,Not captured,Not captured,,,,Flores,Michael,,10/13/1983,male,Not captured,Not captured,Not captured,Not captured,Not captured,Not captured,Not captured,Not captured,Not captured,Not captured,Not captured,Not captured,Not captured,,,Not captured,Not captured,Not captured,Not captured,1453 Lookout Springs Drive,,Colordo Springs,Colorado,80921,,,Not captured,Not captured,chris@wayporttravel.com,Not captured,802049704,,Not captured,Not captured,Not captured,Not captured,Not captured,Not captured,
Not captured,Not captured,09/13/2020,09/24/2020,Not captured,Not captured,863949,020,00072,ARS-01-0056845,Beacon International,Not captured,Not captured,Not captured,,,,schwartz,aron,,06/27/1991,male,Not captured,Not captured,Not captured,Not captured,Not captured,Not captured,Not captured,Not captured,Not captured,Not captured,Not captured,Not captured,Not captured,,,Not captured,Not captured,Not captured,Not captured,246 lynch st #5D,,brooklyn,New York,11206,,,Not captured,Not captured,aronschw@gmail.com,Not captured,802049703,,Not captured,Not captured,Not captured,Not captured,Not captured,Not captured,
Not captured,Not captured,09/15/2020,09/19/2020,Not captured,Not captured,863949,020,00072,ARS-01-0056844,Beacon International,Not captured,Not captured,Not captured,,,,Mayer,Vincent,,04/11/1988,male,Not captured,Not captured,Not captured,Not captured,Not captured,Not captured,Not captured,Not captured,Not captured,Not captured,Not captured,Not captured,Not captured,Joan Rickman,Spouse,Not captured,Not captured,Not captured,Not captured,6386 14th st,,Sacramento,CA,95820,+1-9018337935,,Not captured,Not captured,kaitlynmvincent@gmail.com,Not captured,802049701,,Not captured,Not captured,Not captured,Not captured,Not captured,Not captured,
Not captured,Not captured,09/15/2020,09/19/2020,Not captured,Not captured,863949,020,00072,ARS-01-0056843,Beacon International,Not captured,Not captured,Not captured,Passport(564683329),,,Vincent,Kaitlyn,,05/16/1993,female,Not captured,Not captured,Not captured,Not captured,Not captured,Not captured,Not captured,Not captured,Not captured,Not captured,Not captured,Not captured,Not captured,Joan Rickman,,Not captured,Not captured,Not captured,Not captured,6386 14th st,,Sacramento,CA,95820,+1-9018337935,,Not captured,Not captured,kaitlynmvincent@gmail.com,Not captured,802049700,,Not captured,Not captured,Not captured,Not captured,Not captured,Not captured,
Not captured,Not captured,09/12/2020,09/19/2020,Not captured,Not captured,863949,020,00072,ARS-02-0056842,Beacon America,Not captured,Not captured,Not captured,Passport(AJ687615),,,Wilson,Tehya,,03/14/2000,female,Not captured,Not captured,Not captured,Not captured,Not captured,Not captured,Not captured,Not captured,Not captured,Not captured,Not captured,Not captured,Not captured,Melissa wilson,,Not captured,Not captured,Not captured,Not captured,558 Klassen Ave,,Gretna,MB,R0G 0V0,+1-2184074848,+1-2184074848,Not captured,Not captured,wilsont-a15@outlook.com,Not captured,802049699,,Not captured,Not captured,Not captured,Not captured,Not captured,Not captured,
Not captured,Not captured,09/12/2020,09/18/2020,Not captured,Not captured,863949,020,00072,ARS-01-0056839,Beacon International,Not captured,Not captured,Not captured,Passport(482672992),,,Geslak,Adam,,02/10/1990,male,Not captured,Not captured,Not captured,Not captured,Not captured,Not captured,Not captured,Not captured,Not captured,Not captured,Not captured,Not captured,Not captured,Gloria Geslak,,Not captured,Not captured,Not captured,Not captured,2545 Marine Place,,Bellmore,NY,11710,+1-5162976904,,Not captured,Not captured,stephparra96@gmail.com,Not captured,802049696,,Not captured,Not captured,Not captured,Not captured,Not captured,Not captured,
Not captured,Not captured,09/12/2020,09/18/2020,Not captured,Not captured,863949,020,00072,ARS-01-0056838,Beacon International,Not captured,Not captured,Not captured,Passport(489912112),,,Parra,Stephanie,,09/06/1991,female,Not captured,Not captured,Not captured,Not captured,Not captured,Not captured,Not captured,Not captured,Not captured,Not captured,Not captured,Not captured,Not captured,Gloria Parra,,Not captured,Not captured,Not captured,Not captured,2545 Marine Place,,Bellmore,NY,11710,+1-5164131340,,Not captured,Not captured,stephparra96@gmail.com,Not captured,802049695,,Not captured,Not captured,Not captured,Not captured,Not captured,Not captured,
Not captured,Not captured,09/13/2020,03/09/2021,Not captured,Not captured,863949,020,00072,ARS-02-0056837,Beacon America,Not captured,Not captured,Not captured,Passport(R9275668),,,Biviji,Abazer Siraj,,11/25/1954,male,Not captured,Not captured,Not captured,Not captured,Not captured,Not captured,Not captured,Not captured,Not captured,Not captured,Not captured,Not captured,Not captured,Rizwana Biviji,,Not captured,Not captured,Not captured,Not captured,B 12 302 Vaishali Nagar,,Mumbai,MH,400102,+1-3177021275,,Not captured,Not captured,saurabh.lfme@gmail.com,Not captured,802049694,,Not captured,Not captured,Not captured,Not captured,Not captured,Not captured,
Not captured,Not captured,09/12/2020,09/10/2021,Not captured,Not captured,863949,020,00072,ARS-03-0056813,Essential America,Not captured,Not captured,Not captured,Passport(565530755),,,DOSHI,RIA,,04/20/1993,female,Not captured,Not captured,Not captured,Not captured,Not captured,Not captured,Not captured,Not captured,Not captured,Not captured,Not captured,Not captured,Not captured,,,Not captured,Not captured,Not captured,Not captured,245 E 54TH STREET,,NEW YORK,New York,10022,+919820022200,,Not captured,Not captured,MICKEYDOSHI@GMAIL.COM,Not captured,802049643,,Not captured,Not captured,Not captured,Not captured,Not captured,Not captured,
Not captured,Not captured,09/12/2020,09/10/2021,Not captured,Not captured,863949,020,00072,ARS-03-0056812,Essential America,Not captured,Not captured,Not captured,Passport(567116979),,,DOSHI,MIRAI,,02/20/1990,female,Not captured,Not captured,Not captured,Not captured,Not captured,Not captured,Not captured,Not captured,Not captured,Not captured,Not captured,Not captured,Not captured,,,Not captured,Not captured,Not captured,Not captured,245 E 54TH STREET,,NEW YORK,New York,10022,011919820270765,,Not captured,Not captured,MICKEYDOSHI@GMAIL.COM,Not captured,802049642,,Not captured,Not captured,Not captured,Not captured,Not captured,Not captured,
Not captured,Not captured,09/11/2020,12/11/2020,Not captured,Not captured,863949,020,00072,ARS-02-0056827,Beacon America,Not captured,Not captured,Not captured,,,,Sahota,Balwinder,K,06/26/1949,female,Not captured,Not captured,Not captured,Not captured,Not captured,Not captured,Not captured,Not captured,Not captured,Not captured,Not captured,Not captured,Not captured,,,Not captured,Not captured,Not captured,Not captured,5308 Laguna Cliff Ln,,Austin,Texas,78734,9163351666,,Not captured,Not captured,malliemmbee@gmail.com,Not captured,802049679,,Not captured,Not captured,Not captured,Not captured,Not captured,Not captured,
Not captured,Not captured,09/10/2020,09/16/2020,Not captured,Not captured,863949,020,00072,ARS-01-0056825,Beacon International,Not captured,Not captured,Not captured,Passport(652770522),,,Jones,Christin,,08/20/1998,female,Not captured,Not captured,Not captured,Not captured,Not captured,Not captured,Not captured,Not captured,Not captured,Not captured,Not captured,Not captured,Not captured,Theresa Parker,,Not captured,Not captured,Not captured,Not captured,14550 Maverick pl,,Victorville,CA,92394,+1-4243356132,,Not captured,Not captured,christinjones1998@gmail.com,Not captured,802049655,,Not captured,Not captured,Not captured,Not captured,Not captured,Not captured,
Not captured,Not captured,09/10/2020,09/15/2020,Not captured,Not captured,863949,020,00072,ARS-01-0056824,Beacon International,Not captured,Not captured,Not captured,,,,Rutner,Shlomy,,06/03/2004,male,Not captured,Not captured,Not captured,Not captured,Not captured,Not captured,Not captured,Not captured,Not captured,Not captured,Not captured,Not captured,Not captured,,,Not captured,Not captured,Not captured,Not captured,221 Skillman Street,,Brooklyn,New York,11205,,,Not captured,Not captured,israelrutner@cwsma.com,Not captured,802049654,,Not captured,Not captured,Not captured,Not captured,Not captured,Not captured,
Not captured,Not captured,09/10/2020,09/15/2020,Not captured,Not captured,863949,020,00072,ARS-01-0056823,Beacon International,Not captured,Not captured,Not captured,,,,Rutner,Israel,,09/06/1977,male,Not captured,Not captured,Not captured,Not captured,Not captured,Not captured,Not captured,Not captured,Not captured,Not captured,Not captured,Not captured,Not captured,,,Not captured,Not captured,Not captured,Not captured,221 Skillman Street,,Brooklyn,New York,11205,,,Not captured,Not captured,israelrutner@cwsma.com,Not captured,802049653,,Not captured,Not captured,Not captured,Not captured,Not captured,Not captured,
Not captured,Not captured,09/10/2020,09/15/2020,Not captured,Not captured,863949,020,00072,ARS-01-0056822,Beacon International,Not captured,Not captured,Not captured,,,,Goldhirsch,Yosef,,12/10/1996,male,Not captured,Not captured,Not captured,Not captured,Not captured,Not captured,Not captured,Not captured,Not captured,Not captured,Not captured,Not captured,Not captured,,,Not captured,Not captured,Not captured,Not captured,221 Skillman Street,,Brooklyn,New York,11205,,,Not captured,Not captured,israelrutner@cwsma.com,Not captured,802049652,,Not captured,Not captured,Not captured,Not captured,Not captured,Not captured,