EE Transaction Type,Dependent Transaction Type,Effective Date,Expiry Date,EE Signature,EE Signature Date,Control,Suffix,Account,Plan Number,Plan Name,Claim Office,Network ID Number,Customer Code,EE SSN,Dependent SSN,Dependent Relationship,Last Name,First Name,Middle Initial,DOB,Gender,Ethnicity,PCP/PCD,PCP/PCD Current Patient,Provider Cap Office Number,COB,Dep Student Indicator,Dep OOA Indicator,EE Prior Coverage Indicator,EE Late Entrant,EE Language Indicator,Hire Date,Earnings,Earnings Frequency,Beneficiary (Last Name First Name MI),Beneficiary Relationship,Continuation of Coverage Expiration Date,Continuation of Coverage Event Date,Continuation of Coverage Length of Coverage,Work Location Zip Code,Street Address Line 1,Street Address Line 2,City,State,Zip Code,Home Phone Number,Work Phone Number,Accept Code,Evidence Code,EE Email Address,Communication Disability Code,EE Alternate ID,Dep Alternate ID,Old Control,Old Suffix,Old Account,New Control,New Suffix,New Account,
Not captured,Not captured,08/30/2020,02/07/2021,Not captured,Not captured,863949,020,00072,ARS-02-0056650,Beacon America,Not captured,Not captured,Not captured,Passport(M7643597),,,Gadiraju,Savitri,,03/12/1967,female,Not captured,Not captured,Not captured,Not captured,Not captured,Not captured,Not captured,Not captured,Not captured,Not captured,Not captured,Not captured,Not captured,Aruna kumari gadiraju,,Not captured,Not captured,Not captured,Not captured,3-5-125,,Hyderabad,TG,500074,+1-6692385402,,Not captured,Not captured,aruna9.kumari@gmail.com,Not captured,802049474,,Not captured,Not captured,Not captured,Not captured,Not captured,Not captured,
Not captured,Not captured,08/29/2020,09/03/2020,Not captured,Not captured,863949,020,00072,ARS-02-0056643,Beacon America,Not captured,Not captured,Not captured,,,,Hartman,Jonathan,M,01/04/1956,male,Not captured,Not captured,Not captured,Not captured,Not captured,Not captured,Not captured,Not captured,Not captured,Not captured,Not captured,Not captured,Not captured,,,Not captured,Not captured,Not captured,Not captured,238 Ft. Washington Ave,,New York,New York,10032,,,Not captured,Not captured,jonmath@hotmail.com,Not captured,802049467,,Not captured,Not captured,Not captured,Not captured,Not captured,Not captured,
Not captured,Not captured,08/29/2020,02/24/2021,Not captured,Not captured,863949,020,00072,ARS-02-0056642,Beacon America,Not captured,Not captured,Not captured,Passport(U3282379),,,ARURU,LAKSHMI KUMARI,,07/26/1966,female,Not captured,Not captured,Not captured,Not captured,Not captured,Not captured,Not captured,Not captured,Not captured,Not captured,Not captured,Not captured,Not captured,DEVI SREEKANTH ARURU,,Not captured,Not captured,Not captured,Not captured,JEELAPATURU VILL POST,,NELLORE DT,AP,524129,+1-9073028166,,Not captured,Not captured,devisreekanth.apps@gmail.com,Not captured,802049466,,Not captured,Not captured,Not captured,Not captured,Not captured,Not captured,
Not captured,Not captured,08/28/2020,12/09/2020,Not captured,Not captured,863949,020,00072,ARS-36-0056634,Beacon Student Elite,Not captured,Not captured,Not captured,Passport(072257957),,,MATHEUS GAMEZ,RAFAEL,J,07/09/2003,male,Not captured,Not captured,Not captured,Not captured,Not captured,Not captured,Not captured,Not captured,Not captured,Not captured,Not captured,Not captured,Not captured,HECTOR MATHEUS,FAther,Not captured,Not captured,Not captured,Not captured,STA. FE AVE. LEOPOLDO AGUERREYERE RESD. VILLA DEL ESTE PISO 14. APT.14-3.,,CARACAS,Federal District,0000,7865541076,,Not captured,Not captured,hectormatheus787@gmail.com,Not captured,802049443,,Not captured,Not captured,Not captured,Not captured,Not captured,Not captured,
Not captured,Not captured,08/30/2020,09/03/2020,Not captured,Not captured,863949,020,00072,ARS-01-0056633,Beacon International,Not captured,Not captured,Not captured,Passport(C1797610),,,NIVARD,FRANSISKA,,06/04/1983,female,Not captured,Not captured,Not captured,Not captured,Not captured,Not captured,Not captured,Not captured,Not captured,Not captured,Not captured,Not captured,Not captured,JEAN CHRISTOPHE NIVARD,,Not captured,Not captured,Not captured,Not captured,12 ELGIN ROAD,,DUBLIN 4,BALLSBRIDGE,D04 X2T4,+353-894320645,+353-894642196,Not captured,Not captured,me@jcn50.com,Not captured,802049442,,Not captured,Not captured,Not captured,Not captured,Not captured,Not captured,
Not captured,Not captured,08/27/2020,08/31/2020,Not captured,Not captured,863949,020,00072,ARS-01-0056631,Beacon International,Not captured,Not captured,Not captured,Passport(549580985),,,Flores,Lydia,,08/31/1965,female,Not captured,Not captured,Not captured,Not captured,Not captured,Not captured,Not captured,Not captured,Not captured,Not captured,Not captured,Not captured,Not captured,Lydia Flores,,Not captured,Not captured,Not captured,Not captured,634 Shenandoah Dr.,,Shanandoah,TX,77381,+1-8323262627,,Not captured,Not captured,lydia.casa@yahoo.com,Not captured,802049440,,Not captured,Not captured,Not captured,Not captured,Not captured,Not captured,
Not captured,Not captured,08/27/2020,09/30/2020,Not captured,Not captured,863949,020,00072,ARS-02-0056630,Beacon America,Not captured,Not captured,Not captured,Passport(R3013640),,,tullimilli,srinivas,,05/06/1965,male,Not captured,Not captured,Not captured,Not captured,Not captured,Not captured,Not captured,Not captured,Not captured,Not captured,Not captured,Not captured,Not captured,Srinath Tullimilli,,Not captured,Not captured,Not captured,Not captured,16-15-273 7A,,Guntur,AP,522001,+1-8509014134,+1-8509014134,Not captured,Not captured,tullimilli@outlook.com,Not captured,802049439,,Not captured,Not captured,Not captured,Not captured,Not captured,Not captured,
Not captured,Not captured,08/27/2020,02/27/2021,Not captured,Not captured,863949,020,00072,ARS-02-0056628,Beacon America,Not captured,Not captured,Not captured,Passport(P8828394),,,Nagavalli,VijayaLakshmi,,11/10/1952,female,Not captured,Not captured,Not captured,Not captured,Not captured,Not captured,Not captured,Not captured,Not captured,Not captured,Not captured,Not captured,Not captured,sailaja,,Not captured,Not captured,Not captured,Not captured,ramasai residency flatno 202,,hyderabad,TG,500059,+1-2676936234,,Not captured,Not captured,bsailaja2006@yahoo.com,Not captured,802049437,,Not captured,Not captured,Not captured,Not captured,Not captured,Not captured,
Not captured,Not captured,08/27/2020,08/30/2020,Not captured,Not captured,863949,020,00072,ARS-01-0056627,Beacon International,Not captured,Not captured,Not captured,,,,Mcallister,Jonathan,,03/07/1992,male,Not captured,Not captured,Not captured,Not captured,Not captured,Not captured,Not captured,Not captured,Not captured,Not captured,Not captured,Not captured,Not captured,,,Not captured,Not captured,Not captured,Not captured,14 Tar Heels rd.,,Hamilton,New Jersey,08619,,,Not captured,Not captured,mcallisterjon18@gmail.com,Not captured,802049436,,Not captured,Not captured,Not captured,Not captured,Not captured,Not captured,
Not captured,Not captured,08/27/2020,08/30/2020,Not captured,Not captured,863949,020,00072,ARS-01-0056626,Beacon International,Not captured,Not captured,Not captured,,,,Gomez,Angelica,,10/29/1993,female,Not captured,Not captured,Not captured,Not captured,Not captured,Not captured,Not captured,Not captured,Not captured,Not captured,Not captured,Not captured,Not captured,,,Not captured,Not captured,Not captured,Not captured,14 Tar Heels rd.,,Hamilton,New Jersey,08619,,,Not captured,Not captured,mcallisterjon18@gmail.com,Not captured,802049435,,Not captured,Not captured,Not captured,Not captured,Not captured,Not captured,
Not captured,Not captured,08/27/2020,10/15/2020,Not captured,Not captured,863949,020,00072,ARS-01-0056624,Beacon International,Not captured,Not captured,Not captured,,,,Wittig,Desiree,,02/04/1978,female,Not captured,Not captured,Not captured,Not captured,Not captured,Not captured,Not captured,Not captured,Not captured,Not captured,Not captured,Not captured,Not captured,,,Not captured,Not captured,Not captured,Not captured,53 Clay Street,,Brooklyn,New York,11222,,,Not captured,Not captured,desireewittig@gmail.com,Not captured,802049414,,Not captured,Not captured,Not captured,Not captured,Not captured,Not captured,
Not captured,Not captured,08/27/2020,09/23/2020,Not captured,Not captured,863949,020,00072,ARS-02-0056623,Beacon America,Not captured,Not captured,Not captured,,,,Majed,Layal,,05/15/1973,female,Not captured,Not captured,Not captured,Not captured,Not captured,Not captured,Not captured,Not captured,Not captured,Not captured,Not captured,Not captured,Not captured,Jad Abbas Saad,Spouse,Not captured,Not captured,Not captured,Not captured,Oasis Broumana Apt E8,,Broumana,NA,NA,+1-6508501337,+1-6508502863,Not captured,Not captured,mohamed.saad@khatibalami.com,Not captured,802049413,,Not captured,Not captured,Not captured,Not captured,Not captured,Not captured,
Not captured,Not captured,08/27/2020,09/23/2020,Not captured,Not captured,863949,020,00072,ARS-02-0056622,Beacon America,Not captured,Not captured,Not captured,Passport(LR1764251),,,Saad,Mohamad,,10/28/1966,male,Not captured,Not captured,Not captured,Not captured,Not captured,Not captured,Not captured,Not captured,Not captured,Not captured,Not captured,Not captured,Not captured,Jad Abbas Saad,,Not captured,Not captured,Not captured,Not captured,Oasis Broumana Apt E8,,Broumana,NA,NA,+1-6508501337,+1-6508502863,Not captured,Not captured,mohamed.saad@khatibalami.com,Not captured,802049412,,Not captured,Not captured,Not captured,Not captured,Not captured,Not captured,
Not captured,Not captured,08/27/2020,07/31/2021,Not captured,Not captured,863949,020,00072,ARS-01-0056620,Beacon International,Not captured,Not captured,Not captured,Passport(598647463),,,Tauber,Tzvi Meir,,07/23/2006,male,Not captured,Not captured,Not captured,Not captured,Not captured,Not captured,Not captured,Not captured,Not captured,Not captured,Not captured,Not captured,Not captured,Nechama Tauber,,Not captured,Not captured,Not captured,Not captured,20615 NW 14th PL,,Miami,FL,33169,+1-3054694603,+1-3054696964,Not captured,Not captured,rabbitauber@gmail.com,Not captured,802049410,,Not captured,Not captured,Not captured,Not captured,Not captured,Not captured,
Not captured,Not captured,08/27/2020,09/16/2020,Not captured,Not captured,863949,020,00072,ARS-02-0056618,Beacon America,Not captured,Not captured,Not captured,Passport(AC001747),,,Devlin,Claire Rutherford,,07/14/1994,female,Not captured,Not captured,Not captured,Not captured,Not captured,Not captured,Not captured,Not captured,Not captured,Not captured,Not captured,Not captured,Not captured,Allison Burik,,Not captured,Not captured,Not captured,Not captured,911 Ave Duluth E,,Montreal,QC,H2L 1B7,+1-5147998868,,Not captured,Not captured,claire.devlin@hotmail.com,Not captured,802049408,,Not captured,Not captured,Not captured,Not captured,Not captured,Not captured,
Not captured,Not captured,08/26/2020,02/20/2021,Not captured,Not captured,863949,020,00072,ARS-02-0056616,Beacon America,Not captured,Not captured,Not captured,Passport(7738048813),,,PATEL,NIKUNJ,,08/10/1986,male,Not captured,Not captured,Not captured,Not captured,Not captured,Not captured,Not captured,Not captured,Not captured,Not captured,Not captured,Not captured,Not captured,LATASHA L CASEY,,Not captured,Not captured,Not captured,Not captured,M4 KALPATARU FLATS II MIRAMBIKA RD NARANPURA,,AHMEDABAD,GJ,380013,+1-7738048813,,Not captured,Not captured,nick_8886@yahoo.com,Not captured,802049406,,Not captured,Not captured,Not captured,Not captured,Not captured,Not captured,
Not captured,Not captured,08/25/2020,08/23/2021,Not captured,Not captured,863949,020,00072,ARS-03-0056080,Essential America,Not captured,Not captured,Not captured,Passport(118415581),,,Vargas Pareja,Antonio,Luis,10/20/1985,male,Not captured,Not captured,Not captured,Not captured,Not captured,Not captured,Not captured,Not captured,Not captured,Not captured,Not captured,Not captured,Not captured,,,Not captured,Not captured,Not captured,Not captured,4699 Kittredge st building 10 apt 1023,,Denver,Colorado,,7209260835,,Not captured,Not captured,vargashaps@gmail.com,Not captured,802048606,,Not captured,Not captured,Not captured,Not captured,Not captured,Not captured,
Not captured,Not captured,08/26/2020,09/01/2020,Not captured,Not captured,863949,020,00072,ARS-01-0056610,Beacon International,Not captured,Not captured,Not captured,,,,Teitelbaum,Yocheved,,01/09/1972,female,Not captured,Not captured,Not captured,Not captured,Not captured,Not captured,Not captured,Not captured,Not captured,Not captured,Not captured,Not captured,Not captured,,,Not captured,Not captured,Not captured,Not captured,17 Yosef Ziv Street,,Jerusalem,,95309,,,Not captured,Not captured,chevyt12@gmail.com,Not captured,802049400,,Not captured,Not captured,Not captured,Not captured,Not captured,Not captured,
Not captured,Not captured,08/26/2020,09/01/2020,Not captured,Not captured,863949,020,00072,ARS-01-0056609,Beacon International,Not captured,Not captured,Not captured,,,,Teitelbaum,Menachem,,06/26/1973,male,Not captured,Not captured,Not captured,Not captured,Not captured,Not captured,Not captured,Not captured,Not captured,Not captured,Not captured,Not captured,Not captured,,,Not captured,Not captured,Not captured,Not captured,17 Yosef Ziv Street,,Jerusalem,,95309,,,Not captured,Not captured,chevyt12@gmail.com,Not captured,802049399,,Not captured,Not captured,Not captured,Not captured,Not captured,Not captured,
Not captured,Not captured,08/26/2020,06/01/2021,Not captured,Not captured,863949,020,00072,ARS-38-0056608,Beacon Student Choice,Not captured,Not captured,Not captured,Passport(4525525452),,,Li,Zehuan,,08/12/2002,male,Not captured,Not captured,Not captured,Not captured,Not captured,Not captured,Not captured,Not captured,Not captured,Not captured,Not captured,Not captured,Not captured,,,Not captured,Not captured,Not captured,Not captured,2826 N. Elm Ln.,,Arlington Heights,Illinois,60004,8476304188,,Not captured,Not captured,family@jonkhans.net,Not captured,802049398,,Not captured,Not captured,Not captured,Not captured,Not captured,Not captured,
Not captured,Not captured,08/25/2020,09/02/2020,Not captured,Not captured,863949,020,00072,ARS-02-0056607,Beacon America,Not captured,Not captured,Not captured,,,,TOUBIN,ABRAHAM,Z,07/08/1979,male,Not captured,Not captured,Not captured,Not captured,Not captured,Not captured,Not captured,Not captured,Not captured,Not captured,Not captured,Not captured,Not captured,,,Not captured,Not captured,Not captured,Not captured,BEN ZAKAI 101,,ELAD,,4083645,,,Not captured,Not captured,avi@apcell26.com,Not captured,802049397,,Not captured,Not captured,Not captured,Not captured,Not captured,Not captured,
Not captured,Not captured,08/24/2020,09/25/2020,Not captured,Not captured,863949,020,00072,OVI-41-0056604,Overseas Visitors Insurance Plan A,Not captured,Not captured,Not captured,Passport(L8438084),,,Shah,Madhuri,H,03/02/1954,female,Not captured,Not captured,Not captured,Not captured,Not captured,Not captured,Not captured,Not captured,Not captured,Not captured,Not captured,Not captured,Not captured,Kalpesh Harendra Shah,Son,Not captured,Not captured,Not captured,Not captured,8537 Sandpiper Ridge Ave,,Tampa,Florida,33647,+1-813-943-1007,,Not captured,Not captured,kalpeshmail@gmail.com,Not captured,802049394,,Not captured,Not captured,Not captured,Not captured,Not captured,Not captured,
Not captured,Not captured,08/24/2020,09/25/2020,Not captured,Not captured,863949,020,00072,OVI-41-0056603,Overseas Visitors Insurance Plan A,Not captured,Not captured,Not captured,Passport(L9723625),,,Shah,Harendra,B,03/10/1949,male,Not captured,Not captured,Not captured,Not captured,Not captured,Not captured,Not captured,Not captured,Not captured,Not captured,Not captured,Not captured,Not captured,Kalpesh Harendra Shah,Son,Not captured,Not captured,Not captured,Not captured,8537 Sandpiper Ridge Ave,,Tampa,Florida,33647,+1-813-943-1007,,Not captured,Not captured,kalpeshmail@gmail.com,Not captured,802049393,,Not captured,Not captured,Not captured,Not captured,Not captured,Not captured,
Not captured,Not captured,08/24/2020,02/24/2021,Not captured,Not captured,863949,020,00072,ARS-01-0056602,Beacon International,Not captured,Not captured,Not captured,Passport(486621094),,,Gallegos,Daisy,J,05/27/1994,female,Not captured,Not captured,Not captured,Not captured,Not captured,Not captured,Not captured,Not captured,Not captured,Not captured,Not captured,Not captured,Not captured,,,Not captured,Not captured,Not captured,Not captured,PO Box 771139,,Wichita,Kansas,67277,6169512726,,Not captured,Not captured,mzoller@friendsmission.com,Not captured,802049392,,Not captured,Not captured,Not captured,Not captured,Not captured,Not captured,
Not captured,Not captured,08/26/2020,08/23/2021,Not captured,Not captured,863949,020,00072,ARS-01-0056601,Beacon International,Not captured,Not captured,Not captured,,,,Rosenberg,Abraham,,06/07/2001,male,Not captured,Not captured,Not captured,Not captured,Not captured,Not captured,Not captured,Not captured,Not captured,Not captured,Not captured,Not captured,Not captured,,,Not captured,Not captured,Not captured,Not captured,1106 53rd street,,Brooklyn,New York,11219,,,Not captured,Not captured,shari@isaacinsurance.net,Not captured,802049391,,Not captured,Not captured,Not captured,Not captured,Not captured,Not captured,
Not captured,Not captured,08/24/2020,10/31/2020,Not captured,Not captured,863949,020,00072,ARS-02-0056600,Beacon America,Not captured,Not captured,Not captured,,,,Wilkinson,Charlotte,,08/11/1993,female,Not captured,Not captured,Not captured,Not captured,Not captured,Not captured,Not captured,Not captured,Not captured,Not captured,Not captured,Not captured,Not captured,,,Not captured,Not captured,Not captured,Not captured,14 Fife Street,,Lancashire,,BB96DD,,,Not captured,Not captured,charlottewilkinson93@hotmail.co.uk,Not captured,802049390,,Not captured,Not captured,Not captured,Not captured,Not captured,Not captured,
Not captured,Not captured,08/24/2020,09/06/2020,Not captured,Not captured,863949,020,00072,ARS-02-0056599,Beacon America,Not captured,Not captured,Not captured,,,,Mehta,Shefali,H,10/30/1992,female,Not captured,Not captured,Not captured,Not captured,Not captured,Not captured,Not captured,Not captured,Not captured,Not captured,Not captured,Not captured,Not captured,,,Not captured,Not captured,Not captured,Not captured,10835 64 Th Ave,,Forest Hills,New York,11375,,,Not captured,Not captured,pramodini84@gmail.com,Not captured,802049389,,Not captured,Not captured,Not captured,Not captured,Not captured,Not captured,
Not captured,Not captured,08/24/2020,08/22/2021,Not captured,Not captured,863949,020,00072,ARS-03-0056587,Essential America,Not captured,Not captured,Not captured,SSN(649831976),,,Mota Avila,Sergio,,10/03/1997,male,Not captured,Not captured,Not captured,Not captured,Not captured,Not captured,Not captured,Not captured,Not captured,Not captured,Not captured,Not captured,Not captured,,,Not captured,Not captured,Not captured,Not captured,2486 Rainbow Drive Unit 154,,Denver,Colorado,80229,3037099104,,Not captured,Not captured,sermota14@gmail.com,Not captured,802049375,,Not captured,Not captured,Not captured,Not captured,Not captured,Not captured,
Not captured,Not captured,08/23/2020,09/23/2020,Not captured,Not captured,863949,020,00072,ARS-01-0056595,Beacon International,Not captured,Not captured,Not captured,,,,Meade,Lily,,08/19/1992,female,Not captured,Not captured,Not captured,Not captured,Not captured,Not captured,Not captured,Not captured,Not captured,Not captured,Not captured,Not captured,Not captured,,,Not captured,Not captured,Not captured,Not captured,5 Pleasant Hill Road,,Hopewell Junction,New York,12533,,,Not captured,Not captured,lilysmeade@gmail.com,Not captured,802049384,,Not captured,Not captured,Not captured,Not captured,Not captured,Not captured,
Not captured,Not captured,08/23/2020,07/31/2021,Not captured,Not captured,863949,020,00072,ARS-02-0056594,Beacon America,Not captured,Not captured,Not captured,Passport(A07779818),,,Abioye,Abiodun Joseph,,12/07/1995,male,Not captured,Not captured,Not captured,Not captured,Not captured,Not captured,Not captured,Not captured,Not captured,Not captured,Not captured,Not captured,Not captured,Nneamaka Augusta Okorafor,,Not captured,Not captured,Not captured,Not captured,25 muyibat oyefusi,,Ikeja,Lagos,00010,+1-8322961069,,Not captured,Not captured,abiodunjj@yahoo.com,Not captured,802049383,,Not captured,Not captured,Not captured,Not captured,Not captured,Not captured,
Not captured,Not captured,08/23/2020,08/29/2020,Not captured,Not captured,863949,020,00072,ARS-01-0056593,Beacon International,Not captured,Not captured,Not captured,Passport(544455227),,,wright,John andrew,,08/19/1965,male,Not captured,Not captured,Not captured,Not captured,Not captured,Not captured,Not captured,Not captured,Not captured,Not captured,Not captured,Not captured,Not captured,joshua wright,,Not captured,Not captured,Not captured,Not captured,2451 yester oaks dr,,germantown,TN,38139,+1-9014844683,,Not captured,Not captured,jawright1965@yahoo.com,Not captured,802049382,,Not captured,Not captured,Not captured,Not captured,Not captured,Not captured,
Not captured,Not captured,08/23/2020,12/31/2020,Not captured,Not captured,863949,020,00072,ARS-02-0056592,Beacon America,Not captured,Not captured,Not captured,Passport(P3756877A),,,Mendrez,Mae,,08/13/1975,female,Not captured,Not captured,Not captured,Not captured,Not captured,Not captured,Not captured,Not captured,Not captured,Not captured,Not captured,Not captured,Not captured,Mildred Mangubat,,Not captured,Not captured,Not captured,Not captured,Mabigo,,Canlaon City,Negros Oriental,6223,+63-09176312370,+63-09176312370,Not captured,Not captured,m.smile2@yahoo.com,Not captured,802049381,,Not captured,Not captured,Not captured,Not captured,Not captured,Not captured,
Not captured,Not captured,08/26/2020,02/15/2021,Not captured,Not captured,863949,020,00072,ARS-02-0056591,Beacon America,Not captured,Not captured,Not captured,Passport(L1260801),,,Kamarajugadda,Parvathi,,07/15/1951,female,Not captured,Not captured,Not captured,Not captured,Not captured,Not captured,Not captured,Not captured,Not captured,Not captured,Not captured,Not captured,Not captured,Sri Harsha Uppaluri,,Not captured,Not captured,Not captured,Not captured,Flat No 102 Bird of Paradise Kakatiya Hills,,Hyderabad,TS,500081,+1-7753359053,+1-7753359053,Not captured,Not captured,anusha.uppaluri@gmail.com,Not captured,802049380,,Not captured,Not captured,Not captured,Not captured,Not captured,Not captured,
Not captured,Not captured,08/29/2020,06/26/2021,Not captured,Not captured,863949,020,00072,ARS-01-0056588,Beacon International,Not captured,Not captured,Not captured,Passport(522422788),,,Spillane,Daniel,T,06/30/1998,male,Not captured,Not captured,Not captured,Not captured,Not captured,Not captured,Not captured,Not captured,Not captured,Not captured,Not captured,Not captured,Not captured,Daniella Guadalupe Marquez Lopez,Wife,Not captured,Not captured,Not captured,Not captured,487 W CADY ST,,Northville,Michigan,48167,2487046108,,Not captured,Not captured,alkerione2@gmail.com,Not captured,802049376,,Not captured,Not captured,Not captured,Not captured,Not captured,Not captured,