EE Transaction Type,Dependent Transaction Type,Effective Date,Expiry Date,EE Signature,EE Signature Date,Control,Suffix,Account,Plan Number,Plan Name,Claim Office,Network ID Number,Customer Code,EE SSN,Dependent SSN,Dependent Relationship,Last Name,First Name,Middle Initial,DOB,Gender,Ethnicity,PCP/PCD,PCP/PCD Current Patient,Provider Cap Office Number,COB,Dep Student Indicator,Dep OOA Indicator,EE Prior Coverage Indicator,EE Late Entrant,EE Language Indicator,Hire Date,Earnings,Earnings Frequency,Beneficiary (Last Name First Name MI),Beneficiary Relationship,Continuation of Coverage Expiration Date,Continuation of Coverage Event Date,Continuation of Coverage Length of Coverage,Work Location Zip Code,Street Address Line 1,Street Address Line 2,City,State,Zip Code,Home Phone Number,Work Phone Number,Accept Code,Evidence Code,EE Email Address,Communication Disability Code,EE Alternate ID,Dep Alternate ID,Old Control,Old Suffix,Old Account,New Control,New Suffix,New Account,
Not captured,Not captured,08/23/2020,09/23/2020,Not captured,Not captured,863949,020,00072,ARS-01-0056595,Beacon International,Not captured,Not captured,Not captured,,,,Meade,Lily,,08/19/1992,female,Not captured,Not captured,Not captured,Not captured,Not captured,Not captured,Not captured,Not captured,Not captured,Not captured,Not captured,Not captured,Not captured,,,Not captured,Not captured,Not captured,Not captured,5 Pleasant Hill Road,,Hopewell Junction,New York,12533,,,Not captured,Not captured,lilysmeade@gmail.com,Not captured,802049384,,Not captured,Not captured,Not captured,Not captured,Not captured,Not captured,
Not captured,Not captured,08/23/2020,07/31/2021,Not captured,Not captured,863949,020,00072,ARS-02-0056594,Beacon America,Not captured,Not captured,Not captured,Passport(A07779818),,,Abioye,Abiodun Joseph,,12/07/1995,male,Not captured,Not captured,Not captured,Not captured,Not captured,Not captured,Not captured,Not captured,Not captured,Not captured,Not captured,Not captured,Not captured,Nneamaka Augusta Okorafor,,Not captured,Not captured,Not captured,Not captured,25 muyibat oyefusi,,Ikeja,Lagos,00010,+1-8322961069,,Not captured,Not captured,abiodunjj@yahoo.com,Not captured,802049383,,Not captured,Not captured,Not captured,Not captured,Not captured,Not captured,
Not captured,Not captured,08/23/2020,08/29/2020,Not captured,Not captured,863949,020,00072,ARS-01-0056593,Beacon International,Not captured,Not captured,Not captured,Passport(544455227),,,wright,John andrew,,08/19/1965,male,Not captured,Not captured,Not captured,Not captured,Not captured,Not captured,Not captured,Not captured,Not captured,Not captured,Not captured,Not captured,Not captured,joshua wright,,Not captured,Not captured,Not captured,Not captured,2451 yester oaks dr,,germantown,TN,38139,+1-9014844683,,Not captured,Not captured,jawright1965@yahoo.com,Not captured,802049382,,Not captured,Not captured,Not captured,Not captured,Not captured,Not captured,
Not captured,Not captured,08/23/2020,12/31/2020,Not captured,Not captured,863949,020,00072,ARS-02-0056592,Beacon America,Not captured,Not captured,Not captured,Passport(P3756877A),,,Mendrez,Mae,,08/13/1975,female,Not captured,Not captured,Not captured,Not captured,Not captured,Not captured,Not captured,Not captured,Not captured,Not captured,Not captured,Not captured,Not captured,Mildred Mangubat,,Not captured,Not captured,Not captured,Not captured,Mabigo,,Canlaon City,Negros Oriental,6223,+63-09176312370,+63-09176312370,Not captured,Not captured,m.smile2@yahoo.com,Not captured,802049381,,Not captured,Not captured,Not captured,Not captured,Not captured,Not captured,
Not captured,Not captured,08/20/2020,03/25/2021,Not captured,Not captured,863949,020,00072,ARS-01-0056586,Beacon International,Not captured,Not captured,Not captured,Passport(642119085),,,Neuschloss,Naftuli,,02/19/2001,male,Not captured,Not captured,Not captured,Not captured,Not captured,Not captured,Not captured,Not captured,Not captured,Not captured,Not captured,Not captured,Not captured,,,Not captured,Not captured,Not captured,Not captured,1563 42nd Street,,Brooklyn,New York,11219,7185942680,,Not captured,Not captured,1183654@gmail.com,Not captured,802049374,,Not captured,Not captured,Not captured,Not captured,Not captured,Not captured,
Not captured,Not captured,08/22/2020,02/18/2021,Not captured,Not captured,863949,020,00072,ARS-02-0056585,Beacon America,Not captured,Not captured,Not captured,,,,Mulakaluri,Pushpamanjari,,12/11/1959,female,Not captured,Not captured,Not captured,Not captured,Not captured,Not captured,Not captured,Not captured,Not captured,Not captured,Not captured,Not captured,Not captured,Venkata Narasimham Mulakaluri,Spouse,Not captured,Not captured,Not captured,Not captured,plot#508 Flat#204 Sai Surya Residency,,Hyderabad,TS,500018,+1-6124047706,+1-6122262407,Not captured,Not captured,narasimham.mulakaluri@gmail.com,Not captured,802049373,,Not captured,Not captured,Not captured,Not captured,Not captured,Not captured,
Not captured,Not captured,08/22/2020,02/18/2021,Not captured,Not captured,863949,020,00072,ARS-02-0056584,Beacon America,Not captured,Not captured,Not captured,Passport(L7401576),,,Mulakaluri,Venugopal,,07/05/1954,male,Not captured,Not captured,Not captured,Not captured,Not captured,Not captured,Not captured,Not captured,Not captured,Not captured,Not captured,Not captured,Not captured,Venkata Narasimham Mulakaluri,,Not captured,Not captured,Not captured,Not captured,plot#508 Flat#204 Sai Surya Residency,,Hyderabad,TS,500018,+1-6124047706,+1-6122262407,Not captured,Not captured,narasimham.mulakaluri@gmail.com,Not captured,802049372,,Not captured,Not captured,Not captured,Not captured,Not captured,Not captured,
Not captured,Not captured,08/19/2020,10/30/2020,Not captured,Not captured,863949,020,00072,ARS-02-0056581,Beacon America,Not captured,Not captured,Not captured,Passport(EA2092547),,,Li,Xiang,,09/05/2000,female,Not captured,Not captured,Not captured,Not captured,Not captured,Not captured,Not captured,Not captured,Not captured,Not captured,Not captured,Not captured,Not captured,Hui Zhang,,Not captured,Not captured,Not captured,Not captured,Room 701 Unit 2 Building 8 Guihuayuan Haierlvcheng,,Jinan,Shandong,250001,+1-9292401201,,Not captured,Not captured,shirley95@outlook.com,Not captured,802049369,,Not captured,Not captured,Not captured,Not captured,Not captured,Not captured,
Not captured,Not captured,08/23/2020,02/14/2021,Not captured,Not captured,863949,020,00072,ARS-02-0056580,Beacon America,Not captured,Not captured,Not captured,Passport(R4964300),,,Chorera,Ramesh Bhovanbhai,,10/04/1951,male,Not captured,Not captured,Not captured,Not captured,Not captured,Not captured,Not captured,Not captured,Not captured,Not captured,Not captured,Not captured,Not captured,Kiran Ramesh Chorera,,Not captured,Not captured,Not captured,Not captured,C/13 101 Shanti Park Phase 3,,Mira Road Thane,MH,401107,+1-2036109000,,Not captured,Not captured,khusbhoo01@gmail.com,Not captured,802049368,,Not captured,Not captured,Not captured,Not captured,Not captured,Not captured,
Not captured,Not captured,08/19/2020,03/12/2021,Not captured,Not captured,863949,020,00072,ARS-01-0056579,Beacon International,Not captured,Not captured,Not captured,,,,Deutsch,Yisroel,,01/20/1999,male,Not captured,Not captured,Not captured,Not captured,Not captured,Not captured,Not captured,Not captured,Not captured,Not captured,Not captured,Not captured,Not captured,,,Not captured,Not captured,Not captured,Not captured,116 Glenn ave South,,Lakewood,New Jersey,08701,718-668-7152,,Not captured,Not captured,campdegel@gmail.com,Not captured,802049367,,Not captured,Not captured,Not captured,Not captured,Not captured,Not captured,
Not captured,Not captured,08/22/2020,08/30/2020,Not captured,Not captured,863949,020,00072,ARS-01-0056578,Beacon International,Not captured,Not captured,Not captured,Passport(651185491),,,Schob,Greg,A,10/09/1959,male,Not captured,Not captured,Not captured,Not captured,Not captured,Not captured,Not captured,Not captured,Not captured,Not captured,Not captured,Not captured,Not captured,Charles Schob,son,Not captured,Not captured,Not captured,Not captured,779 Arrow Trail,,Bozeman,Montana,59718,5599771600,,Not captured,Not captured,vicki@safeguard365.com,Not captured,802049366,,Not captured,Not captured,Not captured,Not captured,Not captured,Not captured,
Not captured,Not captured,08/22/2020,08/30/2020,Not captured,Not captured,863949,020,00072,ARS-01-0056577,Beacon International,Not captured,Not captured,Not captured,Passport(534980046),,,Schob,Vicki,L,10/11/1958,female,Not captured,Not captured,Not captured,Not captured,Not captured,Not captured,Not captured,Not captured,Not captured,Not captured,Not captured,Not captured,Not captured,Caitlin Schob,daughter,Not captured,Not captured,Not captured,Not captured,779 Arrow Trail,,Bozeman,Montana,59718,5599777335,,Not captured,Not captured,vicki@safeguard365.com,Not captured,802049365,,Not captured,Not captured,Not captured,Not captured,Not captured,Not captured,
Not captured,Not captured,08/19/2020,03/08/2021,Not captured,Not captured,863949,020,00072,ARS-01-0056576,Beacon International,Not captured,Not captured,Not captured,,,,Mermelstein,Alter ,,08/27/1999,male,Not captured,Not captured,Not captured,Not captured,Not captured,Not captured,Not captured,Not captured,Not captured,Not captured,Not captured,Not captured,Not captured,,,Not captured,Not captured,Not captured,Not captured,32 Engelberg Terrace,,Lakewood,New Jersey,08701,732-575-9251,,Not captured,Not captured,basicltd@gmail.com,Not captured,802049364,,Not captured,Not captured,Not captured,Not captured,Not captured,Not captured,
Not captured,Not captured,08/19/2020,08/26/2020,Not captured,Not captured,863949,020,00072,ARS-01-0056575,Beacon International,Not captured,Not captured,Not captured,,,,Vernikov,Anatoliy,,02/12/1985,male,Not captured,Not captured,Not captured,Not captured,Not captured,Not captured,Not captured,Not captured,Not captured,Not captured,Not captured,Not captured,Not captured,,,Not captured,Not captured,Not captured,Not captured,1463 Ocean Ave Apt 3B,,Brooklyn,New York,11230,,,Not captured,Not captured,avernix@gmail.com,Not captured,802049363,,Not captured,Not captured,Not captured,Not captured,Not captured,Not captured,
Not captured,Not captured,08/19/2020,12/31/2020,Not captured,Not captured,863949,020,00072,ARS-02-0056574,Beacon America,Not captured,Not captured,Not captured,Passport(L3178648),,,Jabeen,Naheeda Sana,,05/23/1988,female,Not captured,Not captured,Not captured,Not captured,Not captured,Not captured,Not captured,Not captured,Not captured,Not captured,Not captured,Not captured,Not captured,Niamath basha Shaik Fazilath,,Not captured,Not captured,Not captured,Not captured,17-3A-134 SRT colony,,Hyderabad,TS,500023,+1-5028219027,,Not captured,Not captured,niamathbasha@gmail.com,Not captured,802049362,,Not captured,Not captured,Not captured,Not captured,Not captured,Not captured,
Not captured,Not captured,08/19/2020,11/01/2020,Not captured,Not captured,863949,020,00072,ARS-01-0056573,Beacon International,Not captured,Not captured,Not captured,,,,Dunford,Tara,,06/12/1984,female,Not captured,Not captured,Not captured,Not captured,Not captured,Not captured,Not captured,Not captured,Not captured,Not captured,Not captured,Not captured,Not captured,,,Not captured,Not captured,Not captured,Not captured,18241 Rampart Drive SE,,Yelm,Washington,98597,,,Not captured,Not captured,taradunfordcpa@yahoo.com,Not captured,802049361,,Not captured,Not captured,Not captured,Not captured,Not captured,Not captured,
Not captured,Not captured,08/19/2020,09/19/2020,Not captured,Not captured,863949,020,00072,ARS-02-0056572,Beacon America,Not captured,Not captured,Not captured,Passport(E23221087),,,Yang,Yuamliang,,10/25/1993,male,Not captured,Not captured,Not captured,Not captured,Not captured,Not captured,Not captured,Not captured,Not captured,Not captured,Not captured,Not captured,Not captured,Li Xiaolin,,Not captured,Not captured,Not captured,Not captured,chegongzhuangxilu 38,,bejing,bejing,100000,+1-2134216204,,Not captured,Not captured,superyyl2009@qq.com,Not captured,802049360,,Not captured,Not captured,Not captured,Not captured,Not captured,Not captured,
Not captured,Not captured,08/18/2020,09/10/2020,Not captured,Not captured,863949,020,00072,ARS-02-0056571,Beacon America,Not captured,Not captured,Not captured,Passport(T8741959),,,rai,sita,,04/24/1951,female,Not captured,Not captured,Not captured,Not captured,Not captured,Not captured,Not captured,Not captured,Not captured,Not captured,Not captured,Not captured,Not captured,Ashish Rai,,Not captured,Not captured,Not captured,Not captured,Pt Din Dayal,,Raipur,CG,482001,+1-6032339448,,Not captured,Not captured,ashishraiji1@gmail.com,Not captured,802049359,,Not captured,Not captured,Not captured,Not captured,Not captured,Not captured,
Not captured,Not captured,08/18/2020,08/20/2020,Not captured,Not captured,863949,020,00072,ARS-02-0056569,Beacon America,Not captured,Not captured,Not captured,Passport(23183711),,,Even,Amit,,05/15/1987,female,Not captured,Not captured,Not captured,Not captured,Not captured,Not captured,Not captured,Not captured,Not captured,Not captured,Not captured,Not captured,Not captured,Moshe Even,,Not captured,Not captured,Not captured,Not captured,aHita 8,,Sitriyya,Israel,76834,+1-9175434392,,Not captured,Not captured,amit.even15@gmail.com,Not captured,802049357,,Not captured,Not captured,Not captured,Not captured,Not captured,Not captured,
Not captured,Not captured,08/17/2020,09/06/2020,Not captured,Not captured,863949,020,00072,ARS-01-0056567,Beacon International,Not captured,Not captured,Not captured,Passport(5155541010),,,Mangels,Amanda Dee,,10/13/1979,female,Not captured,Not captured,Not captured,Not captured,Not captured,Not captured,Not captured,Not captured,Not captured,Not captured,Not captured,Not captured,Not captured,Marlin Mangels,,Not captured,Not captured,Not captured,Not captured,523 Messenger Road,,Keokuk,IA,52632,+1-5155541010,,Not captured,Not captured,amandamangels@gmail.com,Not captured,802049355,,Not captured,Not captured,Not captured,Not captured,Not captured,Not captured,
Not captured,Not captured,08/17/2020,08/15/2021,Not captured,Not captured,863949,020,00072,ARS-03-0056556,Essential America,Not captured,Not captured,Not captured,Passport(A08504811),,,Adegunsoye,Moses,Tope,07/23/1994,male,Not captured,Not captured,Not captured,Not captured,Not captured,Not captured,Not captured,Not captured,Not captured,Not captured,Not captured,Not captured,Not captured,,,Not captured,Not captured,Not captured,Not captured,14010 East Harvard Place #219,,aurora,Colorado,80014,7206414152,,Not captured,Not captured,adegunsoyetope@yahoo.com,Not captured,802049343,,Not captured,Not captured,Not captured,Not captured,Not captured,Not captured,
Not captured,Not captured,08/17/2020,10/14/2020,Not captured,Not captured,863949,020,00072,ARS-02-0056566,Beacon America,Not captured,Not captured,Not captured,Passport(M7618096),,,Kodali,Alekhya,,06/15/1992,female,Not captured,Not captured,Not captured,Not captured,Not captured,Not captured,Not captured,Not captured,Not captured,Not captured,Not captured,Not captured,Not captured,MANEESH KODALI,,Not captured,Not captured,Not captured,Not captured,Door 4-257 Meraka veedhi,,Chintalapudi,AP,534460,+1-3125323998,,Not captured,Not captured,maneeshkodali@yahoo.co.in,Not captured,802049354,,Not captured,Not captured,Not captured,Not captured,Not captured,Not captured,
Not captured,Not captured,08/18/2020,10/18/2020,Not captured,Not captured,863949,020,00072,ARS-02-0056565,Beacon America,Not captured,Not captured,Not captured,Passport(N4634136),,,BHADIYADRA,HANSABEN DAYABHAI,,03/05/1963,female,Not captured,Not captured,Not captured,Not captured,Not captured,Not captured,Not captured,Not captured,Not captured,Not captured,Not captured,Not captured,Not captured,KIRANBEN PATEL,,Not captured,Not captured,Not captured,Not captured,2 BHURAKHIYA DHAM,,SURAT,GJ,395006,+1-7862090748,+1-5032671301,Not captured,Not captured,dr.savanigt@gmail.com,Not captured,802049353,,Not captured,Not captured,Not captured,Not captured,Not captured,Not captured,
Not captured,Not captured,08/17/2020,02/08/2021,Not captured,Not captured,863949,020,00072,ARS-02-0056564,Beacon America,Not captured,Not captured,Not captured,,,,korrapati,ajay babu,,11/26/1963,male,Not captured,Not captured,Not captured,Not captured,Not captured,Not captured,Not captured,Not captured,Not captured,Not captured,Not captured,Not captured,Not captured,kiran kumar patibandla,Spouse,Not captured,Not captured,Not captured,Not captured,Flat no 201 sashahomes apartment abhyudayanagar,,Hyderabad,TS,500070,+1-4695310456,+1-4694500587,Not captured,Not captured,kirru.patibandla@gmail.com,Not captured,802049352,,Not captured,Not captured,Not captured,Not captured,Not captured,Not captured,
Not captured,Not captured,08/17/2020,02/08/2021,Not captured,Not captured,863949,020,00072,ARS-02-0056563,Beacon America,Not captured,Not captured,Not captured,Passport(p2616308),,,Korrapati,Kavita,,12/10/1971,female,Not captured,Not captured,Not captured,Not captured,Not captured,Not captured,Not captured,Not captured,Not captured,Not captured,Not captured,Not captured,Not captured,kiran kumar patibandla,,Not captured,Not captured,Not captured,Not captured,Flat no 201 sashahomes apartment abhyudayanagar,,Hyderabad,TS,500070,+1-4695310456,+1-4694500587,Not captured,Not captured,kirru.patibandla@gmail.com,Not captured,802049351,,Not captured,Not captured,Not captured,Not captured,Not captured,Not captured,
Not captured,Not captured,08/17/2020,10/01/2020,Not captured,Not captured,863949,020,00072,ARS-01-0056560,Beacon International,Not captured,Not captured,Not captured,Passport(R8141254),,,Mohammad,Arman,,06/14/1987,male,Not captured,Not captured,Not captured,Not captured,Not captured,Not captured,Not captured,Not captured,Not captured,Not captured,Not captured,Not captured,Not captured,Anil SG,,Not captured,Not captured,Not captured,Not captured,4424 Ridge point Ln,,Plano,TX,75024,+1-4692654036,,Not captured,Not captured,mdarman35@gmail.com,Not captured,802049348,,Not captured,Not captured,Not captured,Not captured,Not captured,Not captured,
Not captured,Not captured,08/16/2020,08/21/2020,Not captured,Not captured,863949,020,00072,ARS-01-0056559,Beacon International,Not captured,Not captured,Not captured,Passport(544455227),,,wright,John andrew,,08/19/1965,male,Not captured,Not captured,Not captured,Not captured,Not captured,Not captured,Not captured,Not captured,Not captured,Not captured,Not captured,Not captured,Not captured,joshua wright,,Not captured,Not captured,Not captured,Not captured,2451 yester oaks dr,,germantown,TN,38139,+1-9014844683,,Not captured,Not captured,jawright1965@yahoo.com,Not captured,802049347,,Not captured,Not captured,Not captured,Not captured,Not captured,Not captured,
Not captured,Not captured,08/15/2020,09/01/2020,Not captured,Not captured,863949,020,00072,ARS-02-0056558,Beacon America,Not captured,Not captured,Not captured,Passport(J7637566),,,choudhary,rani,,02/28/1946,female,Not captured,Not captured,Not captured,Not captured,Not captured,Not captured,Not captured,Not captured,Not captured,Not captured,Not captured,Not captured,Not captured,SHAILENDRA SINGH,SON,Not captured,Not captured,Not captured,Not captured,5585 WEDDINGTON DR,,CUMMING,GA,30040,9739010005,,Not captured,Not captured,ssingh.ba3@gmail.com,Not captured,802049346,,Not captured,Not captured,Not captured,Not captured,Not captured,Not captured,
Not captured,Not captured,08/16/2020,08/18/2020,Not captured,Not captured,863949,020,00072,ARS-01-0056555,Beacon International,Not captured,Not captured,Not captured,,,,Steinman,Rivka,,10/25/1992,female,Not captured,Not captured,Not captured,Not captured,Not captured,Not captured,Not captured,Not captured,Not captured,Not captured,Not captured,Not captured,Not captured,,,Not captured,Not captured,Not captured,Not captured,80 Aspen Court,,Lakewood,New Jersey,08701,,,Not captured,Not captured,ariste15@yahoo.com,Not captured,802049342,,Not captured,Not captured,Not captured,Not captured,Not captured,Not captured,
Not captured,Not captured,08/16/2020,08/18/2020,Not captured,Not captured,863949,020,00072,ARS-01-0056554,Beacon International,Not captured,Not captured,Not captured,,,,Steinman,Aaron,,07/26/1989,male,Not captured,Not captured,Not captured,Not captured,Not captured,Not captured,Not captured,Not captured,Not captured,Not captured,Not captured,Not captured,Not captured,,,Not captured,Not captured,Not captured,Not captured,80 Aspen Court,,Lakewood,New Jersey,08701,,,Not captured,Not captured,ariste15@yahoo.com,Not captured,802049341,,Not captured,Not captured,Not captured,Not captured,Not captured,Not captured,
Not captured,Not captured,08/14/2020,09/15/2020,Not captured,Not captured,863949,020,00072,ARS-01-0056552,Beacon International,Not captured,Not captured,Not captured,Passport(549836055),,,Tweeten,Trevor,Nathaniel,11/20/1983,male,Not captured,Not captured,Not captured,Not captured,Not captured,Not captured,Not captured,Not captured,Not captured,Not captured,Not captured,Not captured,Not captured,Marine Pariente,Spouse,Not captured,Not captured,Not captured,Not captured,415 Grand St,,New York,New York,10002,612-419-6931,,Not captured,Not captured,trevor.tweeten@gmail.com,Not captured,802049338,,Not captured,Not captured,Not captured,Not captured,Not captured,Not captured,
Not captured,Not captured,08/14/2020,09/10/2020,Not captured,Not captured,863949,020,00072,ARS-01-0056551,Beacon International,Not captured,Not captured,Not captured,Passport(AL849688),,,Singh,Simar Jit,,02/06/1991,male,Not captured,Not captured,Not captured,Not captured,Not captured,Not captured,Not captured,Not captured,Not captured,Not captured,Not captured,Not captured,Not captured,Inder Pal Singh,,Not captured,Not captured,Not captured,Not captured,18 Yonge,,Toronto,ON,M5E1Z8,+1-6473936470,,Not captured,Not captured,simarsingh72@gmail.com,Not captured,802049337,,Not captured,Not captured,Not captured,Not captured,Not captured,Not captured,
Not captured,Not captured,08/15/2020,11/15/2020,Not captured,Not captured,863949,020,00072,ARS-02-0056548,Beacon America,Not captured,Not captured,Not captured,,,,VILLALOBOS RAMOS,JUAN JOSE,,03/24/1978,male,Not captured,Not captured,Not captured,Not captured,Not captured,Not captured,Not captured,Not captured,Not captured,Not captured,Not captured,Not captured,Not captured,CONRADO GERMAN ISLA,SON,Not captured,Not captured,Not captured,Not captured,Los Paraisos 1567,,Cipolletti,Rio Negro,8324,+ 5492984528184,,Not captured,Not captured,ajcrellin@gmail.com,Not captured,802049334,,Not captured,Not captured,Not captured,Not captured,Not captured,Not captured,
Not captured,Not captured,08/15/2020,11/15/2020,Not captured,Not captured,863949,020,00072,ARS-02-0056547,Beacon America,Not captured,Not captured,Not captured,,,,ISLA,EUGENIA BERENICE,,03/13/1993,female,Not captured,Not captured,Not captured,Not captured,Not captured,Not captured,Not captured,Not captured,Not captured,Not captured,Not captured,Not captured,Not captured,CONRADO GERMAN ISLA,SON,Not captured,Not captured,Not captured,Not captured,Los Paraisos 1567,,Cipolletti,Rio Negro,8324,+ 5492984528184,,Not captured,Not captured,ajcrellin@gmail.com,Not captured,802049333,,Not captured,Not captured,Not captured,Not captured,Not captured,Not captured,