EE Transaction Type,Dependent Transaction Type,Effective Date,Expiry Date,EE Signature,EE Signature Date,Control,Suffix,Account,Plan Number,Plan Name,Claim Office,Network ID Number,Customer Code,EE SSN,Dependent SSN,Dependent Relationship,Last Name,First Name,Middle Initial,DOB,Gender,Ethnicity,PCP/PCD,PCP/PCD Current Patient,Provider Cap Office Number,COB,Dep Student Indicator,Dep OOA Indicator,EE Prior Coverage Indicator,EE Late Entrant,EE Language Indicator,Hire Date,Earnings,Earnings Frequency,Beneficiary (Last Name First Name MI),Beneficiary Relationship,Continuation of Coverage Expiration Date,Continuation of Coverage Event Date,Continuation of Coverage Length of Coverage,Work Location Zip Code,Street Address Line 1,Street Address Line 2,City,State,Zip Code,Home Phone Number,Work Phone Number,Accept Code,Evidence Code,EE Email Address,Communication Disability Code,EE Alternate ID,Dep Alternate ID,Old Control,Old Suffix,Old Account,New Control,New Suffix,New Account,
Not captured,Not captured,08/16/2020,08/21/2020,Not captured,Not captured,863949,020,00072,ARS-01-0056559,Beacon International,Not captured,Not captured,Not captured,Passport(544455227),,,wright,John andrew,,08/19/1965,male,Not captured,Not captured,Not captured,Not captured,Not captured,Not captured,Not captured,Not captured,Not captured,Not captured,Not captured,Not captured,Not captured,joshua wright,,Not captured,Not captured,Not captured,Not captured,2451 yester oaks dr,,germantown,TN,38139,+1-9014844683,,Not captured,Not captured,jawright1965@yahoo.com,Not captured,802049347,,Not captured,Not captured,Not captured,Not captured,Not captured,Not captured,
Not captured,Not captured,08/15/2020,09/01/2020,Not captured,Not captured,863949,020,00072,ARS-02-0056558,Beacon America,Not captured,Not captured,Not captured,Passport(J7637566),,,choudhary,rani,,02/28/1946,female,Not captured,Not captured,Not captured,Not captured,Not captured,Not captured,Not captured,Not captured,Not captured,Not captured,Not captured,Not captured,Not captured,SHAILENDRA SINGH,SON,Not captured,Not captured,Not captured,Not captured,5585 WEDDINGTON DR,,CUMMING,GA,30040,9739010005,,Not captured,Not captured,ssingh.ba3@gmail.com,Not captured,802049346,,Not captured,Not captured,Not captured,Not captured,Not captured,Not captured,
Not captured,Not captured,08/16/2020,08/18/2020,Not captured,Not captured,863949,020,00072,ARS-01-0056555,Beacon International,Not captured,Not captured,Not captured,,,,Steinman,Rivka,,10/25/1992,female,Not captured,Not captured,Not captured,Not captured,Not captured,Not captured,Not captured,Not captured,Not captured,Not captured,Not captured,Not captured,Not captured,,,Not captured,Not captured,Not captured,Not captured,80 Aspen Court,,Lakewood,New Jersey,08701,,,Not captured,Not captured,ariste15@yahoo.com,Not captured,802049342,,Not captured,Not captured,Not captured,Not captured,Not captured,Not captured,
Not captured,Not captured,08/16/2020,08/18/2020,Not captured,Not captured,863949,020,00072,ARS-01-0056554,Beacon International,Not captured,Not captured,Not captured,,,,Steinman,Aaron,,07/26/1989,male,Not captured,Not captured,Not captured,Not captured,Not captured,Not captured,Not captured,Not captured,Not captured,Not captured,Not captured,Not captured,Not captured,,,Not captured,Not captured,Not captured,Not captured,80 Aspen Court,,Lakewood,New Jersey,08701,,,Not captured,Not captured,ariste15@yahoo.com,Not captured,802049341,,Not captured,Not captured,Not captured,Not captured,Not captured,Not captured,
Not captured,Not captured,08/14/2020,09/15/2020,Not captured,Not captured,863949,020,00072,ARS-01-0056552,Beacon International,Not captured,Not captured,Not captured,Passport(549836055),,,Tweeten,Trevor,Nathaniel,11/20/1983,male,Not captured,Not captured,Not captured,Not captured,Not captured,Not captured,Not captured,Not captured,Not captured,Not captured,Not captured,Not captured,Not captured,Marine Pariente,Spouse,Not captured,Not captured,Not captured,Not captured,415 Grand St,,New York,New York,10002,612-419-6931,,Not captured,Not captured,trevor.tweeten@gmail.com,Not captured,802049338,,Not captured,Not captured,Not captured,Not captured,Not captured,Not captured,
Not captured,Not captured,08/14/2020,09/10/2020,Not captured,Not captured,863949,020,00072,ARS-01-0056551,Beacon International,Not captured,Not captured,Not captured,Passport(AL849688),,,Singh,Simar Jit,,02/06/1991,male,Not captured,Not captured,Not captured,Not captured,Not captured,Not captured,Not captured,Not captured,Not captured,Not captured,Not captured,Not captured,Not captured,Inder Pal Singh,,Not captured,Not captured,Not captured,Not captured,18 Yonge,,Toronto,ON,M5E1Z8,+1-6473936470,,Not captured,Not captured,simarsingh72@gmail.com,Not captured,802049337,,Not captured,Not captured,Not captured,Not captured,Not captured,Not captured,
Not captured,Not captured,08/15/2020,11/15/2020,Not captured,Not captured,863949,020,00072,ARS-02-0056548,Beacon America,Not captured,Not captured,Not captured,,,,VILLALOBOS RAMOS,JUAN JOSE,,03/24/1978,male,Not captured,Not captured,Not captured,Not captured,Not captured,Not captured,Not captured,Not captured,Not captured,Not captured,Not captured,Not captured,Not captured,CONRADO GERMAN ISLA,SON,Not captured,Not captured,Not captured,Not captured,Los Paraisos 1567,,Cipolletti,Rio Negro,8324,+ 5492984528184,,Not captured,Not captured,ajcrellin@gmail.com,Not captured,802049334,,Not captured,Not captured,Not captured,Not captured,Not captured,Not captured,
Not captured,Not captured,08/15/2020,11/15/2020,Not captured,Not captured,863949,020,00072,ARS-02-0056547,Beacon America,Not captured,Not captured,Not captured,,,,ISLA,EUGENIA BERENICE,,03/13/1993,female,Not captured,Not captured,Not captured,Not captured,Not captured,Not captured,Not captured,Not captured,Not captured,Not captured,Not captured,Not captured,Not captured,CONRADO GERMAN ISLA,SON,Not captured,Not captured,Not captured,Not captured,Los Paraisos 1567,,Cipolletti,Rio Negro,8324,+ 5492984528184,,Not captured,Not captured,ajcrellin@gmail.com,Not captured,802049333,,Not captured,Not captured,Not captured,Not captured,Not captured,Not captured,
Not captured,Not captured,08/15/2020,11/15/2020,Not captured,Not captured,863949,020,00072,ARS-02-0056546,Beacon America,Not captured,Not captured,Not captured,,,,CARNEVALE,CRISTINA MONICA,,07/21/1966,female,Not captured,Not captured,Not captured,Not captured,Not captured,Not captured,Not captured,Not captured,Not captured,Not captured,Not captured,Not captured,Not captured,CONRADO GERMAN ISLA,SON,Not captured,Not captured,Not captured,Not captured,Los Paraisos 1567,,Cipolletti,Rio Negro,8324,+ 5492984528184,,Not captured,Not captured,ajcrellin@gmail.com,Not captured,802049332,,Not captured,Not captured,Not captured,Not captured,Not captured,Not captured,
Not captured,Not captured,08/15/2020,11/15/2020,Not captured,Not captured,863949,020,00072,ARS-02-0056545,Beacon America,Not captured,Not captured,Not captured,Passport(14169242),,,ISLA,CARLOS EUGENIO DEL CORAZON DE JESUS,,04/25/1960,male,Not captured,Not captured,Not captured,Not captured,Not captured,Not captured,Not captured,Not captured,Not captured,Not captured,Not captured,Not captured,Not captured,CONRADO GERMAN ISLA,SON,Not captured,Not captured,Not captured,Not captured,Los Paraisos 1567,,Cipolletti,Rio Negro,8324,+ 5492984528184,,Not captured,Not captured,ajcrellin@gmail.com,Not captured,802049331,,Not captured,Not captured,Not captured,Not captured,Not captured,Not captured,
Not captured,Not captured,08/13/2020,05/31/2021,Not captured,Not captured,863949,020,00072,ARS-02-0056544,Beacon America,Not captured,Not captured,Not captured,Passport(N7126386),,,de Silva,Krishan Hirun,,05/31/1994,male,Not captured,Not captured,Not captured,Not captured,Not captured,Not captured,Not captured,Not captured,Not captured,Not captured,Not captured,Not captured,Not captured,Dr Amal Harsha de Silva,,Not captured,Not captured,Not captured,Not captured,17/1 Wijerama rd,,Nugegoda,Western province,00094,+1-7147690379,,Not captured,Not captured,hirundesilva@outlook.com,Not captured,802049330,,Not captured,Not captured,Not captured,Not captured,Not captured,Not captured,
Not captured,Not captured,08/12/2020,08/25/2020,Not captured,Not captured,863949,020,00072,ARS-01-0056536,Beacon International,Not captured,Not captured,Not captured,,,,Wlson,Dominic,,02/22/2013,male,Not captured,Not captured,Not captured,Not captured,Not captured,Not captured,Not captured,Not captured,Not captured,Not captured,Not captured,Not captured,Not captured,,,Not captured,Not captured,Not captured,Not captured,14326 Hampshire Bay Cr,,Winter Garden,Florida,34787,,,Not captured,Not captured,magued.wilson@me.com,Not captured,802049322,,Not captured,Not captured,Not captured,Not captured,Not captured,Not captured,
Not captured,Not captured,08/12/2020,12/31/2020,Not captured,Not captured,863949,020,00072,ARS-02-0056535,Beacon America,Not captured,Not captured,Not captured,Passport(GN078289),,,Mazonde,Lennon ,,04/13/1988,male,Not captured,Not captured,Not captured,Not captured,Not captured,Not captured,Not captured,Not captured,Not captured,Not captured,Not captured,Not captured,Not captured,Elizabeth Mazonde,Mother,Not captured,Not captured,Not captured,Not captured,1520 Greening Lane,,Harrisburg,Pennsylvania,17110,7174890195,,Not captured,Not captured,lmmazonde@gmail.com,Not captured,802049321,,Not captured,Not captured,Not captured,Not captured,Not captured,Not captured,
Not captured,Not captured,08/12/2020,08/23/2020,Not captured,Not captured,863949,020,00072,ARS-01-0056533,Beacon International,Not captured,Not captured,Not captured,,,,schwimmer,meilech,,10/19/2000,male,Not captured,Not captured,Not captured,Not captured,Not captured,Not captured,Not captured,Not captured,Not captured,Not captured,Not captured,Not captured,Not captured,,,Not captured,Not captured,Not captured,Not captured,bp,,brooklyn,New York,11218,,,Not captured,Not captured,avrumy1155@gmail.com,Not captured,802049319,,Not captured,Not captured,Not captured,Not captured,Not captured,Not captured,
Not captured,Not captured,08/12/2020,08/23/2020,Not captured,Not captured,863949,020,00072,ARS-01-0056532,Beacon International,Not captured,Not captured,Not captured,,,,weiss,dov,,03/09/2001,male,Not captured,Not captured,Not captured,Not captured,Not captured,Not captured,Not captured,Not captured,Not captured,Not captured,Not captured,Not captured,Not captured,,,Not captured,Not captured,Not captured,Not captured,bp,,brooklyn,New York,11218,,,Not captured,Not captured,avrumy1155@gmail.com,Not captured,802049318,,Not captured,Not captured,Not captured,Not captured,Not captured,Not captured,
Not captured,Not captured,08/13/2020,09/14/2020,Not captured,Not captured,863949,020,00072,ARS-02-0056529,Beacon America,Not captured,Not captured,Not captured,Passport(Z3928686),,,Sarathy,Sudarshan,,05/17/1993,male,Not captured,Not captured,Not captured,Not captured,Not captured,Not captured,Not captured,Not captured,Not captured,Not captured,Not captured,Not captured,Not captured,Ramya Sivasubramanian,,Not captured,Not captured,Not captured,Not captured,1504-A Wing B Satyam Springs,,Mumbai,MH,400088,+91-6369152549,,Not captured,Not captured,sudarshansarathy93@gmail.com,Not captured,802049315,,Not captured,Not captured,Not captured,Not captured,Not captured,Not captured,
Not captured,Not captured,08/16/2020,08/26/2020,Not captured,Not captured,863949,020,00072,ARS-02-0056391,Beacon America,Not captured,Not captured,Not captured,,,,Rosenfeld,Rebecca,M,10/16/1994,female,Not captured,Not captured,Not captured,Not captured,Not captured,Not captured,Not captured,Not captured,Not captured,Not captured,Not captured,Not captured,Not captured,,,Not captured,Not captured,Not captured,Not captured,Tahon 5/5,,Tel Aviv,,6311509,,,Not captured,Not captured,rosenfeld.becky@gmail.com,Not captured,802049126,,Not captured,Not captured,Not captured,Not captured,Not captured,Not captured,
Not captured,Not captured,08/14/2020,08/21/2020,Not captured,Not captured,863949,020,00072,ARS-02-0056382,Beacon America,Not captured,Not captured,Not captured,Passport(E98991100),,,Sun,Yimeng,,01/04/1997,female,Not captured,Not captured,Not captured,Not captured,Not captured,Not captured,Not captured,Not captured,Not captured,Not captured,Not captured,Not captured,Not captured,Chunyan Zhao,,Not captured,Not captured,Not captured,Not captured,136 Chaoyangmennei St,,Beijing,Beijing,100010,+1-8589996002,,Not captured,Not captured,leonora1465@gmail.com,Not captured,802049117,,Not captured,Not captured,Not captured,Not captured,Not captured,Not captured,
Not captured,Not captured,08/14/2020,08/12/2021,Not captured,Not captured,863949,020,00072,ARS-03-0056307,Essential America,Not captured,Not captured,Not captured,Passport(565493493),,,Ottosen,Jason ,Alan,09/04/1980,male,Not captured,Not captured,Not captured,Not captured,Not captured,Not captured,Not captured,Not captured,Not captured,Not captured,Not captured,Not captured,Not captured,,,Not captured,Not captured,Not captured,Not captured,4153 Carpenter Bridge Road,,Felton,Delaware,19943,302-335-8654,,Not captured,Not captured,kameabible@gmail.com,Not captured,802049004,,Not captured,Not captured,Not captured,Not captured,Not captured,Not captured,
Not captured,Not captured,08/14/2020,08/12/2021,Not captured,Not captured,863949,020,00072,ARS-03-0056307,Essential America,Not captured,Not captured,Not captured,,Passport(481005786),Spouse,Ottosen,Cherith,Brook,02/23/1978,female,Not captured,Not captured,Not captured,Not captured,Not captured,Not captured,Not captured,Not captured,Not captured,Not captured,Not captured,Not captured,Not captured,,,Not captured,Not captured,Not captured,Not captured,4153 Carpenter Bridge Road,,Felton,Delaware,19943,302-335-8654,,Not captured,Not captured,kameabible@gmail.com,Not captured,,802049093,Not captured,Not captured,Not captured,Not captured,Not captured,Not captured,
Not captured,Not captured,08/14/2020,08/12/2021,Not captured,Not captured,863949,020,00072,ARS-03-0056307,Essential America,Not captured,Not captured,Not captured,,Passport(531178303),Dependant,Ottosen,Grace,Elisabeth ,09/14/2011,female,Not captured,Not captured,Not captured,Not captured,Not captured,Not captured,Not captured,Not captured,Not captured,Not captured,Not captured,Not captured,Not captured,,,Not captured,Not captured,Not captured,Not captured,4153 Carpenter Bridge Road,,Felton,Delaware,19943,302-335-8654,,Not captured,Not captured,kameabible@gmail.com,Not captured,,802049094,Not captured,Not captured,Not captured,Not captured,Not captured,Not captured,
Not captured,Not captured,08/14/2020,08/12/2021,Not captured,Not captured,863949,020,00072,ARS-03-0056307,Essential America,Not captured,Not captured,Not captured,,Passport(565493494),Dependant,Ottosen,Melody,Joy,09/09/2013,female,Not captured,Not captured,Not captured,Not captured,Not captured,Not captured,Not captured,Not captured,Not captured,Not captured,Not captured,Not captured,Not captured,,,Not captured,Not captured,Not captured,Not captured,4153 Carpenter Bridge Road,,Felton,Delaware,19943,302-335-8654,,Not captured,Not captured,kameabible@gmail.com,Not captured,,802049095,Not captured,Not captured,Not captured,Not captured,Not captured,Not captured,
Not captured,Not captured,08/14/2020,08/12/2021,Not captured,Not captured,863949,020,00072,ARS-03-0056307,Essential America,Not captured,Not captured,Not captured,,Passport(557472669),Dependant,Ottosen,Hannah ,Faith,09/30/2016,female,Not captured,Not captured,Not captured,Not captured,Not captured,Not captured,Not captured,Not captured,Not captured,Not captured,Not captured,Not captured,Not captured,,,Not captured,Not captured,Not captured,Not captured,4153 Carpenter Bridge Road,,Felton,Delaware,19943,302-335-8654,,Not captured,Not captured,kameabible@gmail.com,Not captured,,802049096,Not captured,Not captured,Not captured,Not captured,Not captured,Not captured,
Not captured,Not captured,08/14/2020,08/12/2021,Not captured,Not captured,863949,020,00072,ARS-03-0056307,Essential America,Not captured,Not captured,Not captured,,Passport(596988065),Dependant,Ottosen,Josiah,David,04/03/2019,male,Not captured,Not captured,Not captured,Not captured,Not captured,Not captured,Not captured,Not captured,Not captured,Not captured,Not captured,Not captured,Not captured,,,Not captured,Not captured,Not captured,Not captured,4153 Carpenter Bridge Road,,Felton,Delaware,19943,302-335-8654,,Not captured,Not captured,kameabible@gmail.com,Not captured,,802049097,Not captured,Not captured,Not captured,Not captured,Not captured,Not captured,
Not captured,Not captured,08/14/2020,08/12/2021,Not captured,Not captured,863949,020,00072,ARS-36-0056306,Beacon Student Elite,Not captured,Not captured,Not captured,Passport(140897326),,,RODRIGUES DE ABREU,VALENTINA ,V,02/08/2002,male,Not captured,Not captured,Not captured,Not captured,Not captured,Not captured,Not captured,Not captured,Not captured,Not captured,Not captured,Not captured,Not captured,PATRICIA RODRIGUES,Mother,Not captured,Not captured,Not captured,Not captured,AVE. VENEZUELA CALLE 32 URBL. LA PEDREA,,ACARIGUA,Portuguesa,00000,3053937543,,Not captured,Not captured,ARODR1274@FIU.EDU,Not captured,802049003,,Not captured,Not captured,Not captured,Not captured,Not captured,Not captured,
Not captured,Not captured,08/16/2020,08/31/2020,Not captured,Not captured,863949,020,00072,ARS-02-0056219,Beacon America,Not captured,Not captured,Not captured,,,,Rosenfeld,Thomas,,06/30/1961,male,Not captured,Not captured,Not captured,Not captured,Not captured,Not captured,Not captured,Not captured,Not captured,Not captured,Not captured,Not captured,Not captured,,,Not captured,Not captured,Not captured,Not captured,77 Hamalech David,,Efrat,,9045122,,,Not captured,Not captured,trosenfeld@gmail.com,Not captured,802048882,,Not captured,Not captured,Not captured,Not captured,Not captured,Not captured,
Not captured,Not captured,08/12/2020,05/18/2021,Not captured,Not captured,863949,020,00072,ARS-02-0056154,Beacon America,Not captured,Not captured,Not captured,Passport(AN5483888),,,Kanatas,Georgios,,08/03/2000,male,Not captured,Not captured,Not captured,Not captured,Not captured,Not captured,Not captured,Not captured,Not captured,Not captured,Not captured,Not captured,Not captured,KANATAS ATHANASIOS,FATHER,Not captured,Not captured,Not captured,Not captured,ANTHEON 3,,ATHENS,Attiki,14342,+306975023899,,Not captured,Not captured,tkanatas@gmail.com,Not captured,802048763,,Not captured,Not captured,Not captured,Not captured,Not captured,Not captured,
Not captured,Not captured,08/15/2020,08/31/2020,Not captured,Not captured,863949,020,00072,ARS-01-0055926,Beacon International,Not captured,Not captured,Not captured,Passport(RG067972),,,Almuradi,Abdullah Mogalli,,05/07/1987,male,Not captured,Not captured,Not captured,Not captured,Not captured,Not captured,Not captured,Not captured,Not captured,Not captured,Not captured,Not captured,Not captured,Majed Almoradi,,Not captured,Not captured,Not captured,Not captured,45 Edinborough Ct,,York,ON,M6N 2E9,+1-6472285542,+1-3473242736,Not captured,Not captured,almuradi_a@yahoo.com,Not captured,802048311,,Not captured,Not captured,Not captured,Not captured,Not captured,Not captured,
Not captured,Not captured,08/17/2020,08/20/2020,Not captured,Not captured,863949,020,00072,BG001030-23-c31d5a84,International Assurance,Not captured,Not captured,Not captured,-,-,,Arzate,Antonio,,06/28/1974,male,Not captured,Not captured,Not captured,Not captured,Not captured,Not captured,Not captured,Not captured,Not captured,Not captured,Not captured,Not captured,Not captured,,,Not captured,Not captured,Not captured,Not captured,7201 North Loop Dr.,,El Paso,Texas,79915,9157780046,,Not captured,Not captured,questions@casasporcristo.org,Not captured,802049344,,Not captured,Not captured,Not captured,Not captured,Not captured,Not captured,
Not captured,Not captured,08/17/2020,08/20/2020,Not captured,Not captured,863949,020,00072,BG001030-23-f56c6488,International Assurance,Not captured,Not captured,Not captured,-,-,,Hernandez,Luis Carlos,,06/28/1976,male,Not captured,Not captured,Not captured,Not captured,Not captured,Not captured,Not captured,Not captured,Not captured,Not captured,Not captured,Not captured,Not captured,,,Not captured,Not captured,Not captured,Not captured,PO Box 971070,,El Paso,Texas,79997,(915) 778-0046,,Not captured,Not captured,questions@casasporcristo.org,Not captured,802049340,,Not captured,Not captured,Not captured,Not captured,Not captured,Not captured