EE Transaction Type,Dependent Transaction Type,Effective Date,Expiry Date,EE Signature,EE Signature Date,Control,Suffix,Account,Plan Number,Plan Name,Claim Office,Network ID Number,Customer Code,EE SSN,Dependent SSN,Dependent Relationship,Last Name,First Name,Middle Initial,DOB,Gender,Ethnicity,PCP/PCD,PCP/PCD Current Patient,Provider Cap Office Number,COB,Dep Student Indicator,Dep OOA Indicator,EE Prior Coverage Indicator,EE Late Entrant,EE Language Indicator,Hire Date,Earnings,Earnings Frequency,Beneficiary (Last Name First Name MI),Beneficiary Relationship,Continuation of Coverage Expiration Date,Continuation of Coverage Event Date,Continuation of Coverage Length of Coverage,Work Location Zip Code,Street Address Line 1,Street Address Line 2,City,State,Zip Code,Home Phone Number,Work Phone Number,Accept Code,Evidence Code,EE Email Address,Communication Disability Code,EE Alternate ID,Dep Alternate ID,Old Control,Old Suffix,Old Account,New Control,New Suffix,New Account,
Not captured,Not captured,08/11/2020,08/23/2020,Not captured,Not captured,863949,020,00072,ARS-01-0056528,Beacon International,Not captured,Not captured,Not captured,Passport(G34523791),,,Acevedo Quezada,Jorge,,04/19/2001,male,Not captured,Not captured,Not captured,Not captured,Not captured,Not captured,Not captured,Not captured,Not captured,Not captured,Not captured,Not captured,Not captured,Emilia Acevedo Quezada,,Not captured,Not captured,Not captured,Not captured,1978 Furlong Court,,West Linn,OR,97068,+1-5038690024,,Not captured,Not captured,jorgeaq8@hotmail.com,Not captured,802049314,,Not captured,Not captured,Not captured,Not captured,Not captured,Not captured,
Not captured,Not captured,08/10/2020,09/10/2020,Not captured,Not captured,863949,020,00072,ARS-01-0056526,Beacon International,Not captured,Not captured,Not captured,,,,Schapiro,Mordechai,,09/13/1980,male,Not captured,Not captured,Not captured,Not captured,Not captured,Not captured,Not captured,Not captured,Not captured,Not captured,Not captured,Not captured,Not captured,,,Not captured,Not captured,Not captured,Not captured,63 Arosa Hill,,Lakewood,New Jersey,08701,3472446878,,Not captured,Not captured,basi@resimgt.com,Not captured,802049312,,Not captured,Not captured,Not captured,Not captured,Not captured,Not captured,
Not captured,Not captured,08/10/2020,09/10/2020,Not captured,Not captured,863949,020,00072,ARS-01-0056525,Beacon International,Not captured,Not captured,Not captured,,,,Schapiro,Elizabeth,,11/29/1957,female,Not captured,Not captured,Not captured,Not captured,Not captured,Not captured,Not captured,Not captured,Not captured,Not captured,Not captured,Not captured,Not captured,,,Not captured,Not captured,Not captured,Not captured,63 Arosa Hill,,Lakewood,New Jersey,08701,3472446878,,Not captured,Not captured,basi@resimgt.com,Not captured,802049311,,Not captured,Not captured,Not captured,Not captured,Not captured,Not captured,
Not captured,Not captured,08/10/2020,09/10/2020,Not captured,Not captured,863949,020,00072,ARS-01-0056524,Beacon International,Not captured,Not captured,Not captured,,,,Schapiro,Pinchos,,12/19/1957,male,Not captured,Not captured,Not captured,Not captured,Not captured,Not captured,Not captured,Not captured,Not captured,Not captured,Not captured,Not captured,Not captured,,,Not captured,Not captured,Not captured,Not captured,63 Arosa Hill,,Lakewood,New Jersey,08701,3472446878,,Not captured,Not captured,basi@resimgt.com,Not captured,802049310,,Not captured,Not captured,Not captured,Not captured,Not captured,Not captured,
Not captured,Not captured,08/11/2020,10/01/2020,Not captured,Not captured,863949,020,00072,ARS-02-0056523,Beacon America,Not captured,Not captured,Not captured,Passport(561517097),,,Bahadur,Monique,,12/11/1957,female,Not captured,Not captured,Not captured,Not captured,Not captured,Not captured,Not captured,Not captured,Not captured,Not captured,Not captured,Not captured,Not captured,Sekhar Bahadur,Husband,Not captured,Not captured,Not captured,Not captured,19 Palace Gardens Terrace,,London,England,W8 4SA,011447831879100,,Not captured,Not captured,monique.bahadur@gmail.com,Not captured,802049309,,Not captured,Not captured,Not captured,Not captured,Not captured,Not captured,
Not captured,Not captured,08/11/2020,08/09/2021,Not captured,Not captured,863949,020,00072,ARS-01-0056522,Beacon International,Not captured,Not captured,Not captured,,,,Kiefer,Xavier,S,10/15/2019,male,Not captured,Not captured,Not captured,Not captured,Not captured,Not captured,Not captured,Not captured,Not captured,Not captured,Not captured,Not captured,Not captured,Tiffany Kiefer,Wife,Not captured,Not captured,Not captured,Not captured,1425 Sedwick Road,,Durham,North Carolina,27713,919-270-8921,,Not captured,Not captured,charles.kiefer@gmail.com,Not captured,802049308,,Not captured,Not captured,Not captured,Not captured,Not captured,Not captured,
Not captured,Not captured,08/11/2020,08/09/2021,Not captured,Not captured,863949,020,00072,ARS-01-0056521,Beacon International,Not captured,Not captured,Not captured,,,,Kiefer,Joseph ,P,07/14/2013,male,Not captured,Not captured,Not captured,Not captured,Not captured,Not captured,Not captured,Not captured,Not captured,Not captured,Not captured,Not captured,Not captured,Tiffany Kiefer,Wife,Not captured,Not captured,Not captured,Not captured,1425 Sedwick Road,,Durham,North Carolina,27713,919-270-8921,,Not captured,Not captured,charles.kiefer@gmail.com,Not captured,802049307,,Not captured,Not captured,Not captured,Not captured,Not captured,Not captured,
Not captured,Not captured,08/11/2020,08/09/2021,Not captured,Not captured,863949,020,00072,ARS-01-0056520,Beacon International,Not captured,Not captured,Not captured,,,,Kiefer,Sophia,A,09/27/2011,female,Not captured,Not captured,Not captured,Not captured,Not captured,Not captured,Not captured,Not captured,Not captured,Not captured,Not captured,Not captured,Not captured,Tiffany Kiefer,Wife,Not captured,Not captured,Not captured,Not captured,1425 Sedwick Road,,Durham,North Carolina,27713,919-270-8921,,Not captured,Not captured,charles.kiefer@gmail.com,Not captured,802049306,,Not captured,Not captured,Not captured,Not captured,Not captured,Not captured,
Not captured,Not captured,08/11/2020,08/09/2021,Not captured,Not captured,863949,020,00072,ARS-01-0056519,Beacon International,Not captured,Not captured,Not captured,,,,Kiefer,Ezekiel,J,03/04/2010,male,Not captured,Not captured,Not captured,Not captured,Not captured,Not captured,Not captured,Not captured,Not captured,Not captured,Not captured,Not captured,Not captured,Tiffany Kiefer,Wife,Not captured,Not captured,Not captured,Not captured,1425 Sedwick Road,,Durham,North Carolina,27713,919-270-8921,,Not captured,Not captured,charles.kiefer@gmail.com,Not captured,802049305,,Not captured,Not captured,Not captured,Not captured,Not captured,Not captured,
Not captured,Not captured,08/11/2020,08/09/2021,Not captured,Not captured,863949,020,00072,ARS-01-0056518,Beacon International,Not captured,Not captured,Not captured,,,,Kiefer,Charles,H,12/25/2007,male,Not captured,Not captured,Not captured,Not captured,Not captured,Not captured,Not captured,Not captured,Not captured,Not captured,Not captured,Not captured,Not captured,Tiffany Kiefer,Wife,Not captured,Not captured,Not captured,Not captured,1425 Sedwick Road,,Durham,North Carolina,27713,919-270-8921,,Not captured,Not captured,charles.kiefer@gmail.com,Not captured,802049304,,Not captured,Not captured,Not captured,Not captured,Not captured,Not captured,
Not captured,Not captured,08/11/2020,08/09/2021,Not captured,Not captured,863949,020,00072,ARS-01-0056517,Beacon International,Not captured,Not captured,Not captured,,,,Kiefer,Mylie,G,07/28/2006,female,Not captured,Not captured,Not captured,Not captured,Not captured,Not captured,Not captured,Not captured,Not captured,Not captured,Not captured,Not captured,Not captured,Tiffany Kiefer,Wife,Not captured,Not captured,Not captured,Not captured,1425 Sedwick Road,,Durham,North Carolina,27713,919-270-8921,,Not captured,Not captured,charles.kiefer@gmail.com,Not captured,802049303,,Not captured,Not captured,Not captured,Not captured,Not captured,Not captured,
Not captured,Not captured,08/11/2020,08/09/2021,Not captured,Not captured,863949,020,00072,ARS-01-0056516,Beacon International,Not captured,Not captured,Not captured,,,,Kiefer,Tiffany,A,09/20/1979,female,Not captured,Not captured,Not captured,Not captured,Not captured,Not captured,Not captured,Not captured,Not captured,Not captured,Not captured,Not captured,Not captured,Tiffany Kiefer,Wife,Not captured,Not captured,Not captured,Not captured,1425 Sedwick Road,,Durham,North Carolina,27713,919-270-8921,,Not captured,Not captured,charles.kiefer@gmail.com,Not captured,802049302,,Not captured,Not captured,Not captured,Not captured,Not captured,Not captured,
Not captured,Not captured,08/11/2020,08/09/2021,Not captured,Not captured,863949,020,00072,ARS-01-0056515,Beacon International,Not captured,Not captured,Not captured,Passport(533068954),,,Kiefer,Charles,H,03/18/1978,male,Not captured,Not captured,Not captured,Not captured,Not captured,Not captured,Not captured,Not captured,Not captured,Not captured,Not captured,Not captured,Not captured,Tiffany Kiefer,Wife,Not captured,Not captured,Not captured,Not captured,1425 Sedwick Road,,Durham,North Carolina,27713,919-270-8921,,Not captured,Not captured,charles.kiefer@gmail.com,Not captured,802049301,,Not captured,Not captured,Not captured,Not captured,Not captured,Not captured,
Not captured,Not captured,08/10/2020,09/30/2020,Not captured,Not captured,863949,020,00072,ARS-02-0056514,Beacon America,Not captured,Not captured,Not captured,Passport(P1780135),,,Das,Sukanti,,06/01/1970,female,Not captured,Not captured,Not captured,Not captured,Not captured,Not captured,Not captured,Not captured,Not captured,Not captured,Not captured,Not captured,Not captured,Satyajit Das,,Not captured,Not captured,Not captured,Not captured,Jolly House Gourbad Sahi ,,Puri,OR,752001,+1-4253899155,,Not captured,Not captured,koollucky01@gmail.com,Not captured,802049300,,Not captured,Not captured,Not captured,Not captured,Not captured,Not captured,
Not captured,Not captured,08/10/2020,08/13/2020,Not captured,Not captured,863949,020,00072,ARS-01-0056513,Beacon International,Not captured,Not captured,Not captured,,,,Dauer,Chana,L,08/01/1980,female,Not captured,Not captured,Not captured,Not captured,Not captured,Not captured,Not captured,Not captured,Not captured,Not captured,Not captured,Not captured,Not captured,,,Not captured,Not captured,Not captured,Not captured,712 n. florence st.,,BURBANK,California,91505,,,Not captured,Not captured,mendywuensch@gmail.com,Not captured,802049297,,Not captured,Not captured,Not captured,Not captured,Not captured,Not captured,
Not captured,Not captured,08/10/2020,08/13/2020,Not captured,Not captured,863949,020,00072,ARS-01-0056512,Beacon International,Not captured,Not captured,Not captured,,,,Wuensch,Menachem,,09/01/1976,male,Not captured,Not captured,Not captured,Not captured,Not captured,Not captured,Not captured,Not captured,Not captured,Not captured,Not captured,Not captured,Not captured,,,Not captured,Not captured,Not captured,Not captured,712 n. florence st.,,BURBANK,California,91505,,,Not captured,Not captured,mendywuensch@gmail.com,Not captured,802049296,,Not captured,Not captured,Not captured,Not captured,Not captured,Not captured,
Not captured,Not captured,08/10/2020,09/09/2020,Not captured,Not captured,863949,020,00072,ARS-01-0056511,Beacon International,Not captured,Not captured,Not captured,Passport(AP505849),,,Gelvez Barrera,Tatiana Carolina,,05/22/1993,female,Not captured,Not captured,Not captured,Not captured,Not captured,Not captured,Not captured,Not captured,Not captured,Not captured,Not captured,Not captured,Not captured,Carmenza Barrera,,Not captured,Not captured,Not captured,Not captured,cra 21 D 20-44 Portal Campestre Norte 3,,Giron,Santander,687542,+358-466180185,,Not captured,Not captured,caroltatianagelvez@hotmail.com,Not captured,802049295,,Not captured,Not captured,Not captured,Not captured,Not captured,Not captured,
Not captured,Not captured,08/09/2020,08/19/2020,Not captured,Not captured,863949,020,00072,ARS-01-0056508,Beacon International,Not captured,Not captured,Not captured,,,,Fries,Emily,,01/09/1969,female,Not captured,Not captured,Not captured,Not captured,Not captured,Not captured,Not captured,Not captured,Not captured,Not captured,Not captured,Not captured,Not captured,,,Not captured,Not captured,Not captured,Not captured,3 Peter Cooper Rd Apt 14B,,New York,New York,10010,,,Not captured,Not captured,efries@rcn.com,Not captured,802049292,,Not captured,Not captured,Not captured,Not captured,Not captured,Not captured,
Not captured,Not captured,08/09/2020,08/16/2020,Not captured,Not captured,863949,020,00072,ARS-01-0056507,Beacon International,Not captured,Not captured,Not captured,Passport(C1797610),,,NIVARD,FRANSISKA,,06/04/1983,female,Not captured,Not captured,Not captured,Not captured,Not captured,Not captured,Not captured,Not captured,Not captured,Not captured,Not captured,Not captured,Not captured,JEAN CHRISTOPHE NIVARD,,Not captured,Not captured,Not captured,Not captured,12 ELGIN ROAD,,DUBLIN 4,BALLSBRIDGE,D04 X2T4,+353-894320645,+353-894642196,Not captured,Not captured,me@jcn50.com,Not captured,802049291,,Not captured,Not captured,Not captured,Not captured,Not captured,Not captured,
Not captured,Not captured,08/09/2020,10/08/2020,Not captured,Not captured,863949,020,00072,ARS-02-0056506,Beacon America,Not captured,Not captured,Not captured,Passport(z2973379),,,thakut,rama lakshmi,,06/13/1970,female,Not captured,Not captured,Not captured,Not captured,Not captured,Not captured,Not captured,Not captured,Not captured,Not captured,Not captured,Not captured,Not captured,rama krishna reddy chanda,,Not captured,Not captured,Not captured,Not captured,8-2-64 market road,,bhadrachalam,TS,507111,+1-9188046007,,Not captured,Not captured,chramonlyone@yahoo.com,Not captured,802049290,,Not captured,Not captured,Not captured,Not captured,Not captured,Not captured,
Not captured,Not captured,08/10/2020,12/31/2020,Not captured,Not captured,863949,020,00072,ARS-01-0056505,Beacon International,Not captured,Not captured,Not captured,,,,Baker,Julien Khalil,,08/08/2011,male,Not captured,Not captured,Not captured,Not captured,Not captured,Not captured,Not captured,Not captured,Not captured,Not captured,Not captured,Not captured,Not captured,Brent or Laura Baker,Dependent,Not captured,Not captured,Not captured,Not captured,76 Baker Rd,,Athol,ID,83801,+33-0605959508,,Not captured,Not captured,sisteremilyrose@gmail.com,Not captured,802049289,,Not captured,Not captured,Not captured,Not captured,Not captured,Not captured,
Not captured,Not captured,08/10/2020,12/31/2020,Not captured,Not captured,863949,020,00072,ARS-01-0056504,Beacon International,Not captured,Not captured,Not captured,Passport(569656537),,,Baker,Emily Rose,,04/01/1979,female,Not captured,Not captured,Not captured,Not captured,Not captured,Not captured,Not captured,Not captured,Not captured,Not captured,Not captured,Not captured,Not captured,Brent or Laura Baker,,Not captured,Not captured,Not captured,Not captured,76 Baker Rd,,Athol,ID,83801,+33-0605959508,,Not captured,Not captured,sisteremilyrose@gmail.com,Not captured,802049288,,Not captured,Not captured,Not captured,Not captured,Not captured,Not captured,
Not captured,Not captured,08/08/2020,08/18/2020,Not captured,Not captured,863949,020,00072,ARS-02-0056503,Beacon America,Not captured,Not captured,Not captured,Passport(ED6760485),,,Zhang,Huimin,,01/22/1964,female,Not captured,Not captured,Not captured,Not captured,Not captured,Not captured,Not captured,Not captured,Not captured,Not captured,Not captured,Not captured,Not captured,Minghua Zhang,,Not captured,Not captured,Not captured,Not captured,#37 Xueyuan Road,,Beijing,Beijing,100191,+1-5189615041,,Not captured,Not captured,zhangmhbuaa@gmail.com,Not captured,802049287,,Not captured,Not captured,Not captured,Not captured,Not captured,Not captured,
Not captured,Not captured,08/08/2020,08/23/2020,Not captured,Not captured,863949,020,00072,ARS-01-0056502,Beacon International,Not captured,Not captured,Not captured,,,,Ustymchuk,Luybov,,11/11/1971,female,Not captured,Not captured,Not captured,Not captured,Not captured,Not captured,Not captured,Not captured,Not captured,Not captured,Not captured,Not captured,Not captured,,,Not captured,Not captured,Not captured,Not captured,978 Jairus dr,,Lexington,Kentucky,40515,,,Not captured,Not captured,polpavlo@hotmail.com,Not captured,802049286,,Not captured,Not captured,Not captured,Not captured,Not captured,Not captured,
Not captured,Not captured,08/08/2020,10/25/2020,Not captured,Not captured,863949,020,00072,ARS-01-0056501,Beacon International,Not captured,Not captured,Not captured,Passport(591653900),,,Black,Joshua Edwards,,07/10/1979,male,Not captured,Not captured,Not captured,Not captured,Not captured,Not captured,Not captured,Not captured,Not captured,Not captured,Not captured,Not captured,Not captured,Terry Black,,Not captured,Not captured,Not captured,Not captured,11907 Pleasantree Dr,,Little Rock,AR,72211,+1-5014002140,+1-5014002140,Not captured,Not captured,jblack3702@me.com,Not captured,802049285,,Not captured,Not captured,Not captured,Not captured,Not captured,Not captured,
Not captured,Not captured,08/08/2020,09/30/2020,Not captured,Not captured,863949,020,00072,ARS-02-0056500,Beacon America,Not captured,Not captured,Not captured,Passport(EC8319429),,,Shen,Weiji,,09/29/1950,male,Not captured,Not captured,Not captured,Not captured,Not captured,Not captured,Not captured,Not captured,Not captured,Not captured,Not captured,Not captured,Not captured,Ang Shen,,Not captured,Not captured,Not captured,Not captured,8H Bldg 13 Zone 5 ShiJiCheng,,Beijing,Beijing,100097,+1-9796450356,+1-4047540342,Not captured,Not captured,angshen@hotmail.com,Not captured,802049284,,Not captured,Not captured,Not captured,Not captured,Not captured,Not captured,
Not captured,Not captured,08/07/2020,09/07/2020,Not captured,Not captured,863949,020,00072,ARS-02-0056497,Beacon America,Not captured,Not captured,Not captured,Passport(T5212464),,,Kollipara,Anudeep Chowdary,,05/30/1990,male,Not captured,Not captured,Not captured,Not captured,Not captured,Not captured,Not captured,Not captured,Not captured,Not captured,Not captured,Not captured,Not captured,Pradeep kollipara,,Not captured,Not captured,Not captured,Not captured,74-10-5D 9th Line Electricity Colony,,Vijayawada,AP,520007,+1-9098005222,,Not captured,Not captured,kolliparaanudeepchowdary@gmail.com,Not captured,802049280,,Not captured,Not captured,Not captured,Not captured,Not captured,Not captured,
Not captured,Not captured,08/06/2020,08/27/2020,Not captured,Not captured,863949,020,00072,ARS-01-0056493,Beacon International,Not captured,Not captured,Not captured,,,,Rosenberg,Miriam,,03/25/2019,female,Not captured,Not captured,Not captured,Not captured,Not captured,Not captured,Not captured,Not captured,Not captured,Not captured,Not captured,Not captured,Not captured,,,Not captured,Not captured,Not captured,Not captured,28 High St,,Lakewood,New Jersey,08701,848-525-9929,,Not captured,Not captured,ncrosenberg@gmail.com,Not captured,802049271,,Not captured,Not captured,Not captured,Not captured,Not captured,Not captured,
Not captured,Not captured,08/06/2020,08/27/2020,Not captured,Not captured,863949,020,00072,ARS-01-0056492,Beacon International,Not captured,Not captured,Not captured,,,,Rosenberg,Schmuel,,12/22/2016,male,Not captured,Not captured,Not captured,Not captured,Not captured,Not captured,Not captured,Not captured,Not captured,Not captured,Not captured,Not captured,Not captured,,,Not captured,Not captured,Not captured,Not captured,28 High St,,Lakewood,New Jersey,08701,848-525-9929,,Not captured,Not captured,ncrosenberg@gmail.com,Not captured,802049270,,Not captured,Not captured,Not captured,Not captured,Not captured,Not captured,
Not captured,Not captured,08/06/2020,08/27/2020,Not captured,Not captured,863949,020,00072,ARS-01-0056491,Beacon International,Not captured,Not captured,Not captured,,,,Rosenberg,Leah,,10/18/2014,male,Not captured,Not captured,Not captured,Not captured,Not captured,Not captured,Not captured,Not captured,Not captured,Not captured,Not captured,Not captured,Not captured,,,Not captured,Not captured,Not captured,Not captured,28 High St,,Lakewood,New Jersey,08701,848-525-9929,,Not captured,Not captured,ncrosenberg@gmail.com,Not captured,802049269,,Not captured,Not captured,Not captured,Not captured,Not captured,Not captured,
Not captured,Not captured,08/06/2020,08/27/2020,Not captured,Not captured,863949,020,00072,ARS-01-0056490,Beacon International,Not captured,Not captured,Not captured,,,,Rosenberg,Yehuda,,02/05/2013,male,Not captured,Not captured,Not captured,Not captured,Not captured,Not captured,Not captured,Not captured,Not captured,Not captured,Not captured,Not captured,Not captured,,,Not captured,Not captured,Not captured,Not captured,28 High St,,Lakewood,New Jersey,08701,848-525-9929,,Not captured,Not captured,ncrosenberg@gmail.com,Not captured,802049268,,Not captured,Not captured,Not captured,Not captured,Not captured,Not captured,
Not captured,Not captured,08/06/2020,08/27/2020,Not captured,Not captured,863949,020,00072,ARS-01-0056489,Beacon International,Not captured,Not captured,Not captured,,,,Rosenberg,Chana,,12/29/1982,female,Not captured,Not captured,Not captured,Not captured,Not captured,Not captured,Not captured,Not captured,Not captured,Not captured,Not captured,Not captured,Not captured,,,Not captured,Not captured,Not captured,Not captured,28 High St,,Lakewood,New Jersey,08701,848-525-9929,,Not captured,Not captured,ncrosenberg@gmail.com,Not captured,802049267,,Not captured,Not captured,Not captured,Not captured,Not captured,Not captured,
Not captured,Not captured,08/06/2020,08/27/2020,Not captured,Not captured,863949,020,00072,ARS-01-0056488,Beacon International,Not captured,Not captured,Not captured,,,,Rosenberg,Nathan,,12/27/1982,male,Not captured,Not captured,Not captured,Not captured,Not captured,Not captured,Not captured,Not captured,Not captured,Not captured,Not captured,Not captured,Not captured,,,Not captured,Not captured,Not captured,Not captured,28 High St,,Lakewood,New Jersey,08701,848-525-9929,,Not captured,Not captured,ncrosenberg@gmail.com,Not captured,802049266,,Not captured,Not captured,Not captured,Not captured,Not captured,Not captured,
Not captured,Not captured,08/10/2020,08/13/2020,Not captured,Not captured,863949,020,00072,ARS-01-0056486,Beacon International,Not captured,Not captured,Not captured,,,,Zuckerman,Aliza,,06/03/2019,female,Not captured,Not captured,Not captured,Not captured,Not captured,Not captured,Not captured,Not captured,Not captured,Not captured,Not captured,Not captured,Not captured,,,Not captured,Not captured,Not captured,Not captured,1439 Northlake Dr,,Lakewood,New Jersey,08701,732-886-5751,,Not captured,Not captured,yzuckerman@gmail.com,Not captured,802049234,,Not captured,Not captured,Not captured,Not captured,Not captured,Not captured,
Not captured,Not captured,08/10/2020,08/13/2020,Not captured,Not captured,863949,020,00072,ARS-01-0056485,Beacon International,Not captured,Not captured,Not captured,,,,zUCKERMAN,JudH,,08/15/2019,male,Not captured,Not captured,Not captured,Not captured,Not captured,Not captured,Not captured,Not captured,Not captured,Not captured,Not captured,Not captured,Not captured,,,Not captured,Not captured,Not captured,Not captured,1439 Northlake Dr,,Lakewood,New Jersey,08701,732-886-5751,,Not captured,Not captured,yzuckerman@gmail.com,Not captured,802049233,,Not captured,Not captured,Not captured,Not captured,Not captured,Not captured,