EE Transaction Type,Dependent Transaction Type,Effective Date,Expiry Date,EE Signature,EE Signature Date,Control,Suffix,Account,Plan Number,Plan Name,Claim Office,Network ID Number,Customer Code,EE SSN,Dependent SSN,Dependent Relationship,Last Name,First Name,Middle Initial,DOB,Gender,Ethnicity,PCP/PCD,PCP/PCD Current Patient,Provider Cap Office Number,COB,Dep Student Indicator,Dep OOA Indicator,EE Prior Coverage Indicator,EE Late Entrant,EE Language Indicator,Hire Date,Earnings,Earnings Frequency,Beneficiary (Last Name First Name MI),Beneficiary Relationship,Continuation of Coverage Expiration Date,Continuation of Coverage Event Date,Continuation of Coverage Length of Coverage,Work Location Zip Code,Street Address Line 1,Street Address Line 2,City,State,Zip Code,Home Phone Number,Work Phone Number,Accept Code,Evidence Code,EE Email Address,Communication Disability Code,EE Alternate ID,Dep Alternate ID,Old Control,Old Suffix,Old Account,New Control,New Suffix,New Account,
Not captured,Not captured,08/04/2020,07/31/2021,Not captured,Not captured,863949,020,00072,ARS-02-0056458,Beacon America,Not captured,Not captured,Not captured,Passport(AL721975),,,TUFENKDJIAN,ALEX,,11/18/2003,male,Not captured,Not captured,Not captured,Not captured,Not captured,Not captured,Not captured,Not captured,Not captured,Not captured,Not captured,Not captured,Not captured,GILBERT TUFENKDJIAN,,Not captured,Not captured,Not captured,Not captured,1620 100E AVENUE,,LAVAL,QC,H7W0B8,+1-2134317312,,Not captured,Not captured,alextuf2020@gmail.com,Not captured,802049197,,Not captured,Not captured,Not captured,Not captured,Not captured,Not captured,
Not captured,Not captured,08/04/2020,07/31/2021,Not captured,Not captured,863949,020,00072,ARS-02-0056457,Beacon America,Not captured,Not captured,Not captured,Passport(AL722403),,,Tufenkdjian,Garo,,08/12/2002,male,Not captured,Not captured,Not captured,Not captured,Not captured,Not captured,Not captured,Not captured,Not captured,Not captured,Not captured,Not captured,Not captured,GILBERT TUFENKDJIAN,,Not captured,Not captured,Not captured,Not captured,1620 100E AVENUE,,LAVAL,QC,H7W0B8,+1-2134317312,,Not captured,Not captured,garotuf2020@gmail.com,Not captured,802049196,,Not captured,Not captured,Not captured,Not captured,Not captured,Not captured,
Not captured,Not captured,08/03/2020,08/01/2021,Not captured,Not captured,863949,020,00072,ARS-03-0056404,Essential America,Not captured,Not captured,Not captured,Passport(548172322),,,Dixon,Allison,Maria,09/29/1975,female,Not captured,Not captured,Not captured,Not captured,Not captured,Not captured,Not captured,Not captured,Not captured,Not captured,Not captured,Not captured,Not captured,,,Not captured,Not captured,Not captured,Not captured,4 Clivede Rd.,,Chester Cheshire,England,CN4 8DR,01244676973,,Not captured,Not captured,mainstreetins@msn.com,Not captured,802049140,,Not captured,Not captured,Not captured,Not captured,Not captured,Not captured,
Not captured,Not captured,08/03/2020,08/01/2021,Not captured,Not captured,863949,020,00072,ARS-03-0056404,Essential America,Not captured,Not captured,Not captured,,Passport(556017760),Dependant,Dixon,Jack,,12/10/1998,male,Not captured,Not captured,Not captured,Not captured,Not captured,Not captured,Not captured,Not captured,Not captured,Not captured,Not captured,Not captured,Not captured,,,Not captured,Not captured,Not captured,Not captured,4 Clivede Rd.,,Chester Cheshire,England,CN4 8DR,01244676973,,Not captured,Not captured,mainstreetins@msn.com,Not captured,,802049168,Not captured,Not captured,Not captured,Not captured,Not captured,Not captured,
Not captured,Not captured,08/03/2020,08/01/2021,Not captured,Not captured,863949,020,00072,ARS-03-0056404,Essential America,Not captured,Not captured,Not captured,,Passport(561603890),Dependant,Dixon,Tia Jade,,01/20/2001,female,Not captured,Not captured,Not captured,Not captured,Not captured,Not captured,Not captured,Not captured,Not captured,Not captured,Not captured,Not captured,Not captured,,,Not captured,Not captured,Not captured,Not captured,4 Clivede Rd.,,Chester Cheshire,England,CN4 8DR,01244676973,,Not captured,Not captured,mainstreetins@msn.com,Not captured,,802049169,Not captured,Not captured,Not captured,Not captured,Not captured,Not captured,
Not captured,Not captured,08/03/2020,08/01/2021,Not captured,Not captured,863949,020,00072,ARS-03-0056404,Essential America,Not captured,Not captured,Not captured,,Passport(561543275),Dependant,Dixon,Luci Ella,,10/14/2003,female,Not captured,Not captured,Not captured,Not captured,Not captured,Not captured,Not captured,Not captured,Not captured,Not captured,Not captured,Not captured,Not captured,,,Not captured,Not captured,Not captured,Not captured,4 Clivede Rd.,,Chester Cheshire,England,CN4 8DR,01244676973,,Not captured,Not captured,mainstreetins@msn.com,Not captured,,802049170,Not captured,Not captured,Not captured,Not captured,Not captured,Not captured,
Not captured,Not captured,08/03/2020,09/01/2020,Not captured,Not captured,863949,020,00072,ARS-01-0056428,Beacon International,Not captured,Not captured,Not captured,,,,Emelianov,Andrey,,05/24/1983,male,Not captured,Not captured,Not captured,Not captured,Not captured,Not captured,Not captured,Not captured,Not captured,Not captured,Not captured,Not captured,Not captured,,,Not captured,Not captured,Not captured,Not captured,2250 Monroe St 156,,Santa Clara,California,95050,,,Not captured,Not captured,intvoker@gmail.com,Not captured,802049164,,Not captured,Not captured,Not captured,Not captured,Not captured,Not captured,
Not captured,Not captured,08/02/2020,08/11/2020,Not captured,Not captured,863949,020,00072,ARS-01-0056423,Beacon International,Not captured,Not captured,Not captured,,,,Margolin,Menadhem,,12/10/1982,male,Not captured,Not captured,Not captured,Not captured,Not captured,Not captured,Not captured,Not captured,Not captured,Not captured,Not captured,Not captured,Not captured,,,Not captured,Not captured,Not captured,Not captured,1516 Union Street,,Brooklyn,New York,11213,,,Not captured,Not captured,chasid@gmail.com,Not captured,802049159,,Not captured,Not captured,Not captured,Not captured,Not captured,Not captured,
Not captured,Not captured,08/03/2020,08/31/2020,Not captured,Not captured,863949,020,00072,ARS-01-0056422,Beacon International,Not captured,Not captured,Not captured,Passport(484813893),,,Awaktut,Pwoc Otor,,01/07/1976,male,Not captured,Not captured,Not captured,Not captured,Not captured,Not captured,Not captured,Not captured,Not captured,Not captured,Not captured,Not captured,Not captured,Elizabeth G Kwolong,,Not captured,Not captured,Not captured,Not captured,4204 13th Ave nw,,Rochester,MN,55901,+1-5073989907,+1-5073989907,Not captured,Not captured,awaktut@icloud.com,Not captured,802049158,,Not captured,Not captured,Not captured,Not captured,Not captured,Not captured,
Not captured,Not captured,08/02/2020,09/30/2020,Not captured,Not captured,863949,020,00072,ARS-02-0056421,Beacon America,Not captured,Not captured,Not captured,Passport(L3049595),,,Kumaravel,Kavitha,,03/14/1962,female,Not captured,Not captured,Not captured,Not captured,Not captured,Not captured,Not captured,Not captured,Not captured,Not captured,Not captured,Not captured,Not captured,Ramesh Nagarajan,,Not captured,Not captured,Not captured,Not captured,No. 96 Avvai 4th Street,,Chennai,TN,600100,+1-5852649499,+1-8436541261,Not captured,Not captured,kavithakumaravel1979@gmail.com,Not captured,802049157,,Not captured,Not captured,Not captured,Not captured,Not captured,Not captured,
Not captured,Not captured,08/02/2020,10/28/2020,Not captured,Not captured,863949,020,00072,ARS-01-0056420,Beacon International,Not captured,Not captured,Not captured,,,,Fiul,Ariel,,10/10/1986,male,Not captured,Not captured,Not captured,Not captured,Not captured,Not captured,Not captured,Not captured,Not captured,Not captured,Not captured,Not captured,Not captured,,,Not captured,Not captured,Not captured,Not captured,65-77 Parsons Blvd Apt 3A,,Flushing,New York,11365,,,Not captured,Not captured,arielfiul@protonmail.com,Not captured,802049156,,Not captured,Not captured,Not captured,Not captured,Not captured,Not captured,
Not captured,Not captured,08/03/2020,08/12/2020,Not captured,Not captured,863949,020,00072,ARS-02-0056419,Beacon America,Not captured,Not captured,Not captured,Passport(N2240042),,,Rao,Vijaya,,09/15/1951,female,Not captured,Not captured,Not captured,Not captured,Not captured,Not captured,Not captured,Not captured,Not captured,Not captured,Not captured,Not captured,Not captured,Dilip Rao,,Not captured,Not captured,Not captured,Not captured,155 13th Cross Malleswaram,,Bangalore,KA,560003,+1-214-202-2640,,Not captured,Not captured,akmirle2003@hotmail.com,Not captured,802049155,,Not captured,Not captured,Not captured,Not captured,Not captured,Not captured,
Not captured,Not captured,08/02/2020,08/03/2020,Not captured,Not captured,863949,020,00072,ARS-01-0056418,Beacon International,Not captured,Not captured,Not captured,,,,BURDA,MARIA,,04/17/1973,female,Not captured,Not captured,Not captured,Not captured,Not captured,Not captured,Not captured,Not captured,Not captured,Not captured,Not captured,Not captured,Not captured,,,Not captured,Not captured,Not captured,Not captured,29 Ridge Castle Dr,,Rochester,New York,14622,,,Not captured,Not captured,LINAD351@GMAIL.COM,Not captured,802049154,,Not captured,Not captured,Not captured,Not captured,Not captured,Not captured,
Not captured,Not captured,08/02/2020,08/03/2020,Not captured,Not captured,863949,020,00072,ARS-01-0056417,Beacon International,Not captured,Not captured,Not captured,,,,DZIVULSKY,YAROSLAVA,,02/14/1964,female,Not captured,Not captured,Not captured,Not captured,Not captured,Not captured,Not captured,Not captured,Not captured,Not captured,Not captured,Not captured,Not captured,,,Not captured,Not captured,Not captured,Not captured,29 Ridge Castle Dr,,Rochester,New York,14622,,,Not captured,Not captured,LINAD351@GMAIL.COM,Not captured,802049153,,Not captured,Not captured,Not captured,Not captured,Not captured,Not captured,
Not captured,Not captured,08/02/2020,09/01/2020,Not captured,Not captured,863949,020,00072,ARS-02-0056416,Beacon America,Not captured,Not captured,Not captured,Passport(K5171932),,,Mathur,Kanta,,08/03/1954,female,Not captured,Not captured,Not captured,Not captured,Not captured,Not captured,Not captured,Not captured,Not captured,Not captured,Not captured,Not captured,Not captured,Renu Mathur,,Not captured,Not captured,Not captured,Not captured,82 Vijay Ngar Chopasanni Jagir,,Jodhpur,RJ,342008,+1-6028200384,,Not captured,Not captured,rainu.mathur@gmail.com,Not captured,802049152,,Not captured,Not captured,Not captured,Not captured,Not captured,Not captured,
Not captured,Not captured,08/02/2020,08/14/2020,Not captured,Not captured,863949,020,00072,ARS-02-0056415,Beacon America,Not captured,Not captured,Not captured,,,,Poupko,Shira,,04/09/1998,female,Not captured,Not captured,Not captured,Not captured,Not captured,Not captured,Not captured,Not captured,Not captured,Not captured,Not captured,Not captured,Not captured,,,Not captured,Not captured,Not captured,Not captured,2 Abba Eban St apt 32,,Jerusalem,,9025808,,,Not captured,Not captured,ypoupko@gmail.com,Not captured,802049151,,Not captured,Not captured,Not captured,Not captured,Not captured,Not captured,
Not captured,Not captured,08/02/2020,11/30/2020,Not captured,Not captured,863949,020,00072,ARS-02-0056414,Beacon America,Not captured,Not captured,Not captured,Passport(545786977),,,bell,stacy,l,12/16/1983,female,Not captured,Not captured,Not captured,Not captured,Not captured,Not captured,Not captured,Not captured,Not captured,Not captured,Not captured,Not captured,Not captured,,,Not captured,Not captured,Not captured,Not captured,2/26 eversfield pl,,hastings,England,tn376by,447445602284,5412213502,Not captured,Not captured,stacyleebell66@gmail.com,Not captured,802049150,,Not captured,Not captured,Not captured,Not captured,Not captured,Not captured,
Not captured,Not captured,08/04/2020,08/12/2020,Not captured,Not captured,863949,020,00072,ARS-02-0056412,Beacon America,Not captured,Not captured,Not captured,Passport(AC358834),,,Kuipers,Trudy,,11/26/1953,female,Not captured,Not captured,Not captured,Not captured,Not captured,Not captured,Not captured,Not captured,Not captured,Not captured,Not captured,Not captured,Not captured,Peter Kuipers,,Not captured,Not captured,Not captured,Not captured,Box 742,,Bentley,AB,T0C 0J0,+1-4038773715,+1-4037484265,Not captured,Not captured,kuipers.trudy@gmail.com,Not captured,802049148,,Not captured,Not captured,Not captured,Not captured,Not captured,Not captured,
Not captured,Not captured,08/01/2020,09/30/2020,Not captured,Not captured,863949,020,00072,OVI-28-0056410,OverseasCare Visitors Insurance Plan,Not captured,Not captured,Not captured,Passport(K01884755),,,Song,Qinglin,,11/20/1952,female,Not captured,Not captured,Not captured,Not captured,Not captured,Not captured,Not captured,Not captured,Not captured,Not captured,Not captured,Not captured,Not captured,Xing Liu,Daughter,Not captured,Not captured,Not captured,Not captured,512 W BARRY AVE APT 210,,Chicago,Illinois,60657,8478686751,,Not captured,Not captured,barrybythelake@gmail.com,Not captured,802049146,,Not captured,Not captured,Not captured,Not captured,Not captured,Not captured,
Not captured,Not captured,07/31/2020,09/29/2020,Not captured,Not captured,863949,020,00072,ARS-02-0056409,Beacon America,Not captured,Not captured,Not captured,Passport(GJ179028),,,Heffernan,karly lynn,,02/06/1996,female,Not captured,Not captured,Not captured,Not captured,Not captured,Not captured,Not captured,Not captured,Not captured,Not captured,Not captured,Not captured,Not captured,James Heffernan,,Not captured,Not captured,Not captured,Not captured,446 52258 Range Road 232,,Sherwood Park,AB,T8B1M7,+1-8574452039,,Not captured,Not captured,karlylynn.heffernan@gmail.com,Not captured,802049145,,Not captured,Not captured,Not captured,Not captured,Not captured,Not captured,
Not captured,Not captured,08/01/2020,11/01/2020,Not captured,Not captured,863949,020,00072,ARS-02-0056405,Beacon America,Not captured,Not captured,Not captured,Passport(055240537),,,Csutak,Esztera,,10/18/1952,female,Not captured,Not captured,Not captured,Not captured,Not captured,Not captured,Not captured,Not captured,Not captured,Not captured,Not captured,Not captured,Not captured,,,Not captured,Not captured,Not captured,Not captured,94 Ford Road,,Germantown,New York,12526,5185376647,,Not captured,Not captured,guardall10@aol.com,Not captured,802049141,,Not captured,Not captured,Not captured,Not captured,Not captured,Not captured,
Not captured,Not captured,07/30/2020,02/28/2021,Not captured,Not captured,863949,020,00072,ARS-02-0056403,Beacon America,Not captured,Not captured,Not captured,Passport(A23565155),,,Nianaa,Abdelrhaman,,07/06/1998,male,Not captured,Not captured,Not captured,Not captured,Not captured,Not captured,Not captured,Not captured,Not captured,Not captured,Not captured,Not captured,Not captured,Saif eldeen nianaa,,Not captured,Not captured,Not captured,Not captured,603 horaya street zezenia,,Alexandria,Alexandria,21500,+1-3474996630,+1-3474996630,Not captured,Not captured,abdelrhmannienaa@gmail.com,Not captured,802049139,,Not captured,Not captured,Not captured,Not captured,Not captured,Not captured,
Not captured,Not captured,08/04/2020,02/03/2021,Not captured,Not captured,863949,020,00072,ARS-01-0056401,Beacon International,Not captured,Not captured,Not captured,Passport(566300117),,,Pedroni,Lilianna,I,02/24/1991,female,Not captured,Not captured,Not captured,Not captured,Not captured,Not captured,Not captured,Not captured,Not captured,Not captured,Not captured,Not captured,Not captured,Patrice Mulholland,Mother,Not captured,Not captured,Not captured,Not captured,148 Pfeiffer St,,San Francisco,California,94133,4159861722,,Not captured,Not captured,ms.pedroni@gmail.com,Not captured,802049137,,Not captured,Not captured,Not captured,Not captured,Not captured,Not captured,
Not captured,Not captured,07/30/2020,07/28/2021,Not captured,Not captured,863949,020,00072,ARS-03-0056386,Essential America,Not captured,Not captured,Not captured,Passport(YB0293259),,,Conte,Maurizio Junior Ludovico,,10/13/1993,male,Not captured,Not captured,Not captured,Not captured,Not captured,Not captured,Not captured,Not captured,Not captured,Not captured,Not captured,Not captured,Not captured,,,Not captured,Not captured,Not captured,Not captured,62 Smith Street,,Glen Cove,New York,11542,2012203875,,Not captured,Not captured,mochoconte@gmail.com,Not captured,802049121,,Not captured,Not captured,Not captured,Not captured,Not captured,Not captured,
Not captured,Not captured,07/30/2020,09/15/2020,Not captured,Not captured,863949,020,00072,ARS-01-0056397,Beacon International,Not captured,Not captured,Not captured,Passport(488313670),,,Mosse,Richard Bartholomew,,06/01/1980,male,Not captured,Not captured,Not captured,Not captured,Not captured,Not captured,Not captured,Not captured,Not captured,Not captured,Not captured,Not captured,Not captured,Susan Mosse,,Not captured,Not captured,Not captured,Not captured,1666 Summerfield St,,Ridgewood,NY,11385,+1-6467444204,,Not captured,Not captured,info@richardmosse.com,Not captured,802049133,,Not captured,Not captured,Not captured,Not captured,Not captured,Not captured,
Not captured,Not captured,07/29/2020,07/30/2020,Not captured,Not captured,863949,020,00072,ARS-02-0056396,Beacon America,Not captured,Not captured,Not captured,,,,Alalem,Jenan Mohammed,,01/29/2019,female,Not captured,Not captured,Not captured,Not captured,Not captured,Not captured,Not captured,Not captured,Not captured,Not captured,Not captured,Not captured,Not captured,Mohammed Alalem,Dependent,Not captured,Not captured,Not captured,Not captured,Abqiq Road,,Dhahran,Eastern province,31311,+1-6822834797,,Not captured,Not captured,archmad70@gmail.com,Not captured,802049131,,Not captured,Not captured,Not captured,Not captured,Not captured,Not captured,
Not captured,Not captured,07/29/2020,07/30/2020,Not captured,Not captured,863949,020,00072,ARS-02-0056395,Beacon America,Not captured,Not captured,Not captured,Passport(P02483531),,,Mustafa,Azar Mohamed,,11/08/1988,female,Not captured,Not captured,Not captured,Not captured,Not captured,Not captured,Not captured,Not captured,Not captured,Not captured,Not captured,Not captured,Not captured,Mohammed Alalem,,Not captured,Not captured,Not captured,Not captured,Abqiq Road,,Dhahran,Eastern province,31311,+1-6822834797,,Not captured,Not captured,archmad70@gmail.com,Not captured,802049130,,Not captured,Not captured,Not captured,Not captured,Not captured,Not captured,
Not captured,Not captured,07/28/2020,01/15/2021,Not captured,Not captured,863949,020,00072,ARS-02-0056390,Beacon America,Not captured,Not captured,Not captured,,,,Narisety Chinna,Rani,,08/21/1963,female,Not captured,Not captured,Not captured,Not captured,Not captured,Not captured,Not captured,Not captured,Not captured,Not captured,Not captured,Not captured,Not captured,Mithun Chakravarthy Narisety,Spouse,Not captured,Not captured,Not captured,Not captured,A-2 First Floor Amaravathi Residency,,Bellary,KA,583104,+1-5636634078,+1-8052352701,Not captured,Not captured,ncvenkatappa@gmail.com,Not captured,802049125,,Not captured,Not captured,Not captured,Not captured,Not captured,Not captured,
Not captured,Not captured,07/28/2020,01/15/2021,Not captured,Not captured,863949,020,00072,ARS-02-0056389,Beacon America,Not captured,Not captured,Not captured,Passport(J9299492),,,Narisety Chinna,Venkatappa,,08/01/1954,male,Not captured,Not captured,Not captured,Not captured,Not captured,Not captured,Not captured,Not captured,Not captured,Not captured,Not captured,Not captured,Not captured,Mithun Chakravarthy Narisety,,Not captured,Not captured,Not captured,Not captured,A-2 First Floor Amaravathi Residency,,Bellary,KA,583104,+1-5636634078,+1-8052352701,Not captured,Not captured,ncvenkatappa@gmail.com,Not captured,802049124,,Not captured,Not captured,Not captured,Not captured,Not captured,Not captured,
Not captured,Not captured,07/29/2020,08/02/2020,Not captured,Not captured,863949,020,00072,ARS-02-0056388,Beacon America,Not captured,Not captured,Not captured,Passport(R8179488),,,LNU,NARAYANAN GIREESAN,,02/10/1955,male,Not captured,Not captured,Not captured,Not captured,Not captured,Not captured,Not captured,Not captured,Not captured,Not captured,Not captured,Not captured,Not captured,PRASAD VASANTHA GOPINATHAN,,Not captured,Not captured,Not captured,Not captured,SREE LEKSHMI TANDRAMPOYKA,,THIRUVANATHAPURAM,KL,695607,+1-4084806994,,Not captured,Not captured,prasadvg.janani@gmail.com,Not captured,802049123,,Not captured,Not captured,Not captured,Not captured,Not captured,Not captured,
Not captured,Not captured,07/28/2020,08/19/2020,Not captured,Not captured,863949,020,00072,ARS-02-0056385,Beacon America,Not captured,Not captured,Not captured,,,,Taqqu,Yisroel M,,01/11/2004,male,Not captured,Not captured,Not captured,Not captured,Not captured,Not captured,Not captured,Not captured,Not captured,Not captured,Not captured,Not captured,Not captured,,,Not captured,Not captured,Not captured,Not captured,132 East 8th street,,Lakewood,New Jersey,08701,972548424377,,Not captured,Not captured,ctaqqu@gmail.Com,Not captured,802049120,,Not captured,Not captured,Not captured,Not captured,Not captured,Not captured,
Not captured,Not captured,07/28/2020,08/19/2020,Not captured,Not captured,863949,020,00072,ARS-02-0056384,Beacon America,Not captured,Not captured,Not captured,,,,TaQQU,Menachem T,,07/23/2002,male,Not captured,Not captured,Not captured,Not captured,Not captured,Not captured,Not captured,Not captured,Not captured,Not captured,Not captured,Not captured,Not captured,,,Not captured,Not captured,Not captured,Not captured,132 East 8th street,,Lakewood,New Jersey,08701,972548424377,,Not captured,Not captured,ctaqqu@gmail.Com,Not captured,802049119,,Not captured,Not captured,Not captured,Not captured,Not captured,Not captured,
Not captured,Not captured,07/28/2020,08/19/2020,Not captured,Not captured,863949,020,00072,ARS-02-0056383,Beacon America,Not captured,Not captured,Not captured,,,,Taqqu,Shlomo A,,10/31/1999,male,Not captured,Not captured,Not captured,Not captured,Not captured,Not captured,Not captured,Not captured,Not captured,Not captured,Not captured,Not captured,Not captured,,,Not captured,Not captured,Not captured,Not captured,132 East 8th street,,Lakewood,New Jersey,08701,972548424377,,Not captured,Not captured,ctaqqu@gmail.Com,Not captured,802049118,,Not captured,Not captured,Not captured,Not captured,Not captured,Not captured,
Not captured,Not captured,07/27/2020,07/25/2021,Not captured,Not captured,863949,020,00072,ARS-35-0056367,Global Mariner America,Not captured,Not captured,Not captured,SSN(549871059),,,Chirichiello,Lindsey,Diane,12/31/1987,female,Not captured,Not captured,Not captured,Not captured,Not captured,Not captured,Not captured,Not captured,Not captured,Not captured,Not captured,Not captured,Not captured,,,Not captured,Not captured,Not captured,Not captured,109 Wettah Lane,,North Palm Beach,Florida,33408,3404730883,,Not captured,Not captured,ldchirichiello@gmail.com,Not captured,802049101,,Not captured,Not captured,Not captured,Not captured,Not captured,Not captured,