EE Transaction Type,Dependent Transaction Type,Effective Date,Expiry Date,EE Signature,EE Signature Date,Control,Suffix,Account,Plan Number,Plan Name,Claim Office,Network ID Number,Customer Code,EE SSN,Dependent SSN,Dependent Relationship,Last Name,First Name,Middle Initial,DOB,Gender,Ethnicity,PCP/PCD,PCP/PCD Current Patient,Provider Cap Office Number,COB,Dep Student Indicator,Dep OOA Indicator,EE Prior Coverage Indicator,EE Late Entrant,EE Language Indicator,Hire Date,Earnings,Earnings Frequency,Beneficiary (Last Name First Name MI),Beneficiary Relationship,Continuation of Coverage Expiration Date,Continuation of Coverage Event Date,Continuation of Coverage Length of Coverage,Work Location Zip Code,Street Address Line 1,Street Address Line 2,City,State,Zip Code,Home Phone Number,Work Phone Number,Accept Code,Evidence Code,EE Email Address,Communication Disability Code,EE Alternate ID,Dep Alternate ID,Old Control,Old Suffix,Old Account,New Control,New Suffix,New Account,
Not captured,Not captured,07/31/2020,09/29/2020,Not captured,Not captured,863949,020,00072,ARS-02-0056409,Beacon America,Not captured,Not captured,Not captured,Passport(GJ179028),,,Heffernan,karly lynn,,02/06/1996,female,Not captured,Not captured,Not captured,Not captured,Not captured,Not captured,Not captured,Not captured,Not captured,Not captured,Not captured,Not captured,Not captured,James Heffernan,,Not captured,Not captured,Not captured,Not captured,446 52258 Range Road 232,,Sherwood Park,AB,T8B1M7,+1-8574452039,,Not captured,Not captured,karlylynn.heffernan@gmail.com,Not captured,802049145,,Not captured,Not captured,Not captured,Not captured,Not captured,Not captured,
Not captured,Not captured,07/30/2020,02/28/2021,Not captured,Not captured,863949,020,00072,ARS-02-0056403,Beacon America,Not captured,Not captured,Not captured,Passport(A23565155),,,Nianaa,Abdelrhaman,,07/06/1998,male,Not captured,Not captured,Not captured,Not captured,Not captured,Not captured,Not captured,Not captured,Not captured,Not captured,Not captured,Not captured,Not captured,Saif eldeen nianaa,,Not captured,Not captured,Not captured,Not captured,603 horaya street zezenia,,Alexandria,Alexandria,21500,+1-3474996630,+1-3474996630,Not captured,Not captured,abdelrhmannienaa@gmail.com,Not captured,802049139,,Not captured,Not captured,Not captured,Not captured,Not captured,Not captured,
Not captured,Not captured,07/30/2020,07/28/2021,Not captured,Not captured,863949,020,00072,ARS-03-0056386,Essential America,Not captured,Not captured,Not captured,Passport(YB0293259),,,Conte,Maurizio Junior Ludovico,,10/13/1993,male,Not captured,Not captured,Not captured,Not captured,Not captured,Not captured,Not captured,Not captured,Not captured,Not captured,Not captured,Not captured,Not captured,,,Not captured,Not captured,Not captured,Not captured,62 Smith Street,,Glen Cove,New York,11542,2012203875,,Not captured,Not captured,mochoconte@gmail.com,Not captured,802049121,,Not captured,Not captured,Not captured,Not captured,Not captured,Not captured,
Not captured,Not captured,07/30/2020,09/15/2020,Not captured,Not captured,863949,020,00072,ARS-01-0056397,Beacon International,Not captured,Not captured,Not captured,Passport(488313670),,,Mosse,Richard Bartholomew,,06/01/1980,male,Not captured,Not captured,Not captured,Not captured,Not captured,Not captured,Not captured,Not captured,Not captured,Not captured,Not captured,Not captured,Not captured,Susan Mosse,,Not captured,Not captured,Not captured,Not captured,1666 Summerfield St,,Ridgewood,NY,11385,+1-6467444204,,Not captured,Not captured,info@richardmosse.com,Not captured,802049133,,Not captured,Not captured,Not captured,Not captured,Not captured,Not captured,
Not captured,Not captured,07/29/2020,07/30/2020,Not captured,Not captured,863949,020,00072,ARS-02-0056396,Beacon America,Not captured,Not captured,Not captured,,,,Alalem,Jenan Mohammed,,01/29/2019,female,Not captured,Not captured,Not captured,Not captured,Not captured,Not captured,Not captured,Not captured,Not captured,Not captured,Not captured,Not captured,Not captured,Mohammed Alalem,Dependent,Not captured,Not captured,Not captured,Not captured,Abqiq Road,,Dhahran,Eastern province,31311,+1-6822834797,,Not captured,Not captured,archmad70@gmail.com,Not captured,802049131,,Not captured,Not captured,Not captured,Not captured,Not captured,Not captured,
Not captured,Not captured,07/29/2020,07/30/2020,Not captured,Not captured,863949,020,00072,ARS-02-0056395,Beacon America,Not captured,Not captured,Not captured,Passport(P02483531),,,Mustafa,Azar Mohamed,,11/08/1988,female,Not captured,Not captured,Not captured,Not captured,Not captured,Not captured,Not captured,Not captured,Not captured,Not captured,Not captured,Not captured,Not captured,Mohammed Alalem,,Not captured,Not captured,Not captured,Not captured,Abqiq Road,,Dhahran,Eastern province,31311,+1-6822834797,,Not captured,Not captured,archmad70@gmail.com,Not captured,802049130,,Not captured,Not captured,Not captured,Not captured,Not captured,Not captured,
Not captured,Not captured,07/28/2020,01/15/2021,Not captured,Not captured,863949,020,00072,ARS-02-0056390,Beacon America,Not captured,Not captured,Not captured,,,,Narisety Chinna,Rani,,08/21/1963,female,Not captured,Not captured,Not captured,Not captured,Not captured,Not captured,Not captured,Not captured,Not captured,Not captured,Not captured,Not captured,Not captured,Mithun Chakravarthy Narisety,Spouse,Not captured,Not captured,Not captured,Not captured,A-2 First Floor Amaravathi Residency,,Bellary,KA,583104,+1-5636634078,+1-8052352701,Not captured,Not captured,ncvenkatappa@gmail.com,Not captured,802049125,,Not captured,Not captured,Not captured,Not captured,Not captured,Not captured,
Not captured,Not captured,07/28/2020,01/15/2021,Not captured,Not captured,863949,020,00072,ARS-02-0056389,Beacon America,Not captured,Not captured,Not captured,Passport(J9299492),,,Narisety Chinna,Venkatappa,,08/01/1954,male,Not captured,Not captured,Not captured,Not captured,Not captured,Not captured,Not captured,Not captured,Not captured,Not captured,Not captured,Not captured,Not captured,Mithun Chakravarthy Narisety,,Not captured,Not captured,Not captured,Not captured,A-2 First Floor Amaravathi Residency,,Bellary,KA,583104,+1-5636634078,+1-8052352701,Not captured,Not captured,ncvenkatappa@gmail.com,Not captured,802049124,,Not captured,Not captured,Not captured,Not captured,Not captured,Not captured,
Not captured,Not captured,07/29/2020,08/02/2020,Not captured,Not captured,863949,020,00072,ARS-02-0056388,Beacon America,Not captured,Not captured,Not captured,Passport(R8179488),,,LNU,NARAYANAN GIREESAN,,02/10/1955,male,Not captured,Not captured,Not captured,Not captured,Not captured,Not captured,Not captured,Not captured,Not captured,Not captured,Not captured,Not captured,Not captured,PRASAD VASANTHA GOPINATHAN,,Not captured,Not captured,Not captured,Not captured,SREE LEKSHMI TANDRAMPOYKA,,THIRUVANATHAPURAM,KL,695607,+1-4084806994,,Not captured,Not captured,prasadvg.janani@gmail.com,Not captured,802049123,,Not captured,Not captured,Not captured,Not captured,Not captured,Not captured,
Not captured,Not captured,07/28/2020,08/19/2020,Not captured,Not captured,863949,020,00072,ARS-02-0056385,Beacon America,Not captured,Not captured,Not captured,,,,Taqqu,Yisroel M,,01/11/2004,male,Not captured,Not captured,Not captured,Not captured,Not captured,Not captured,Not captured,Not captured,Not captured,Not captured,Not captured,Not captured,Not captured,,,Not captured,Not captured,Not captured,Not captured,132 East 8th street,,Lakewood,New Jersey,08701,972548424377,,Not captured,Not captured,ctaqqu@gmail.Com,Not captured,802049120,,Not captured,Not captured,Not captured,Not captured,Not captured,Not captured,
Not captured,Not captured,07/28/2020,08/19/2020,Not captured,Not captured,863949,020,00072,ARS-02-0056384,Beacon America,Not captured,Not captured,Not captured,,,,TaQQU,Menachem T,,07/23/2002,male,Not captured,Not captured,Not captured,Not captured,Not captured,Not captured,Not captured,Not captured,Not captured,Not captured,Not captured,Not captured,Not captured,,,Not captured,Not captured,Not captured,Not captured,132 East 8th street,,Lakewood,New Jersey,08701,972548424377,,Not captured,Not captured,ctaqqu@gmail.Com,Not captured,802049119,,Not captured,Not captured,Not captured,Not captured,Not captured,Not captured,
Not captured,Not captured,07/28/2020,08/19/2020,Not captured,Not captured,863949,020,00072,ARS-02-0056383,Beacon America,Not captured,Not captured,Not captured,,,,Taqqu,Shlomo A,,10/31/1999,male,Not captured,Not captured,Not captured,Not captured,Not captured,Not captured,Not captured,Not captured,Not captured,Not captured,Not captured,Not captured,Not captured,,,Not captured,Not captured,Not captured,Not captured,132 East 8th street,,Lakewood,New Jersey,08701,972548424377,,Not captured,Not captured,ctaqqu@gmail.Com,Not captured,802049118,,Not captured,Not captured,Not captured,Not captured,Not captured,Not captured,
Not captured,Not captured,07/27/2020,07/25/2021,Not captured,Not captured,863949,020,00072,ARS-35-0056367,Global Mariner America,Not captured,Not captured,Not captured,SSN(549871059),,,Chirichiello,Lindsey,Diane,12/31/1987,female,Not captured,Not captured,Not captured,Not captured,Not captured,Not captured,Not captured,Not captured,Not captured,Not captured,Not captured,Not captured,Not captured,,,Not captured,Not captured,Not captured,Not captured,109 Wettah Lane,,North Palm Beach,Florida,33408,3404730883,,Not captured,Not captured,ldchirichiello@gmail.com,Not captured,802049101,,Not captured,Not captured,Not captured,Not captured,Not captured,Not captured,
Not captured,Not captured,07/27/2020,07/25/2021,Not captured,Not captured,863949,020,00072,ARS-04-0056368,Enhanced America,Not captured,Not captured,Not captured,Passport(n/a),,,Adkins,Benjamin,Mark,07/11/2020,male,Not captured,Not captured,Not captured,Not captured,Not captured,Not captured,Not captured,Not captured,Not captured,Not captured,Not captured,Not captured,Not captured,,,Not captured,Not captured,Not captured,Not captured,1333 Chipwood Circle,,Knoxville,Tennessee,37932,+18655671047,,Not captured,Not captured,chrisandashleyadkins@gmail.com,Not captured,802049102,,Not captured,Not captured,Not captured,Not captured,Not captured,Not captured,
Not captured,Not captured,07/27/2020,01/15/2021,Not captured,Not captured,863949,020,00072,OVI-28-0056377,OverseasCare Visitors Insurance Plan,Not captured,Not captured,Not captured,Passport(T4755629),,,Tolupunoorie,Aruna Kumari,,11/05/1971,female,Not captured,Not captured,Not captured,Not captured,Not captured,Not captured,Not captured,Not captured,Not captured,Not captured,Not captured,Not captured,Not captured,Shalini Priya Tholupunuri,Daughter,Not captured,Not captured,Not captured,Not captured,1331 S Wolfe Rd,,Sunnyvale,California,94087,4085053295,4085053295,Not captured,Not captured,pintuaitha@gmail.com,Not captured,802049112,,Not captured,Not captured,Not captured,Not captured,Not captured,Not captured,
Not captured,Not captured,07/28/2020,09/06/2020,Not captured,Not captured,863949,020,00072,ARS-01-0056374,Beacon International,Not captured,Not captured,Not captured,Passport(CFP3G5V2H),,,Schmidt,Christian,,11/21/1987,male,Not captured,Not captured,Not captured,Not captured,Not captured,Not captured,Not captured,Not captured,Not captured,Not captured,Not captured,Not captured,Not captured,Anna,,Not captured,Not captured,Not captured,Not captured,2130 44th Drive,,LIC,NY,11101,+1-9293028379,+1-9293028379,Not captured,Not captured,ipsik@me.com,Not captured,802049109,,Not captured,Not captured,Not captured,Not captured,Not captured,Not captured,
Not captured,Not captured,07/27/2020,08/12/2020,Not captured,Not captured,863949,020,00072,ARS-02-0056373,Beacon America,Not captured,Not captured,Not captured,Passport(P5211624A),,,Trampe,Diane Rosal,,06/19/1985,female,Not captured,Not captured,Not captured,Not captured,Not captured,Not captured,Not captured,Not captured,Not captured,Not captured,Not captured,Not captured,Not captured,Zoila R Venus,,Not captured,Not captured,Not captured,Not captured,1511 Avida San Lorenzo Tower 1 Don Chino Roces Ave.,,Makati,NCR,1230,+1-3304156612,,Not captured,Not captured,dianertrampe@gmail.com,Not captured,802049108,,Not captured,Not captured,Not captured,Not captured,Not captured,Not captured,
Not captured,Not captured,07/27/2020,10/31/2020,Not captured,Not captured,863949,020,00072,ARS-02-0056372,Beacon America,Not captured,Not captured,Not captured,Passport(J5243266),,,Naduvilthara,Lala Shashi,,10/27/1964,female,Not captured,Not captured,Not captured,Not captured,Not captured,Not captured,Not captured,Not captured,Not captured,Not captured,Not captured,Not captured,Not captured,Kamalakshan Gopalan,,Not captured,Not captured,Not captured,Not captured,148A 9/31A Naduvilthara House,,Pamboor,KL,680013,+1-7186985896,+1-7186985896,Not captured,Not captured,doogady@gmail.com,Not captured,802049107,,Not captured,Not captured,Not captured,Not captured,Not captured,Not captured,
Not captured,Not captured,07/27/2020,08/09/2020,Not captured,Not captured,863949,020,00072,ARS-02-0056371,Beacon America,Not captured,Not captured,Not captured,,,,Selvan,Prema,,05/20/1967,female,Not captured,Not captured,Not captured,Not captured,Not captured,Not captured,Not captured,Not captured,Not captured,Not captured,Not captured,Not captured,Not captured,Arun Sundar Selvan,Son,Not captured,Not captured,Not captured,Not captured,2701 SW BOILERMAKER RD,,BENTONVILLE,Arkansas,72713,4793218811,,Not captured,Not captured,arunssundar@gmail.com,Not captured,802049105,,Not captured,Not captured,Not captured,Not captured,Not captured,Not captured,
Not captured,Not captured,07/27/2020,08/09/2020,Not captured,Not captured,863949,020,00072,ARS-02-0056370,Beacon America,Not captured,Not captured,Not captured,,,,Kamatchi Sundaram,Selvan,,07/07/1960,male,Not captured,Not captured,Not captured,Not captured,Not captured,Not captured,Not captured,Not captured,Not captured,Not captured,Not captured,Not captured,Not captured,Arun Sundar Selvan,Son,Not captured,Not captured,Not captured,Not captured,2701 SW BOILERMAKER RD,,BENTONVILLE,Arkansas,72713,4793218811,,Not captured,Not captured,arunssundar@gmail.com,Not captured,802049104,,Not captured,Not captured,Not captured,Not captured,Not captured,Not captured,
Not captured,Not captured,07/27/2020,07/25/2021,Not captured,Not captured,863949,020,00072,ARS-35-0056366,Global Mariner America,Not captured,Not captured,Not captured,Passport(32365062),,,Witterso,Magnus,,01/25/1988,male,Not captured,Not captured,Not captured,Not captured,Not captured,Not captured,Not captured,Not captured,Not captured,Not captured,Not captured,Not captured,Not captured,,,Not captured,Not captured,Not captured,Not captured,Strandengveien 51a,,Vollen,Akershus,00000,3404730883,,Not captured,Not captured,magnuswitters@gmail.com,Not captured,802049100,,Not captured,Not captured,Not captured,Not captured,Not captured,Not captured,
Not captured,Not captured,07/31/2020,07/29/2021,Not captured,Not captured,863949,020,00072,ARS-03-0056331,Essential International,Not captured,Not captured,Not captured,Passport(PX1280236),,,Multanen,Jaakko,Ilmari,07/26/1981,male,Not captured,Not captured,Not captured,Not captured,Not captured,Not captured,Not captured,Not captured,Not captured,Not captured,Not captured,Not captured,Not captured,,,Not captured,Not captured,Not captured,Not captured,Hacienda Road 7,,Boquete,Chiriqui,0413,+18455545628,,Not captured,Not captured,multanen.jaakko@gmail.com,Not captured,802049060,,Not captured,Not captured,Not captured,Not captured,Not captured,Not captured,
Not captured,Not captured,07/27/2020,09/14/2020,Not captured,Not captured,863949,020,00072,ARS-02-0056355,Beacon America,Not captured,Not captured,Not captured,Passport(Z4819723),,,Kaushal,Kulbhushan,,09/19/1975,male,Not captured,Not captured,Not captured,Not captured,Not captured,Not captured,Not captured,Not captured,Not captured,Not captured,Not captured,Not captured,Not captured,Ruchika Kaushal,,Not captured,Not captured,Not captured,Not captured,Hno 776 Sector 26,,Panchkula,HR,134116,+1-2487871445,,Not captured,Not captured,kulbhushank@gmail.com,Not captured,802049084,,Not captured,Not captured,Not captured,Not captured,Not captured,Not captured,
Not captured,Not captured,07/26/2020,09/08/2020,Not captured,Not captured,863949,020,00072,ARS-02-0056352,Beacon America,Not captured,Not captured,Not captured,,,,Lefkowits,Joseph,,02/23/1997,male,Not captured,Not captured,Not captured,Not captured,Not captured,Not captured,Not captured,Not captured,Not captured,Not captured,Not captured,Not captured,Not captured,,,Not captured,Not captured,Not captured,Not captured,12 Zeissner Lane,,Spring Valley,New York,10977,,,Not captured,Not captured,rikkiweber1@gmail.com,Not captured,802049081,,Not captured,Not captured,Not captured,Not captured,Not captured,Not captured,
Not captured,Not captured,07/26/2020,11/01/2020,Not captured,Not captured,863949,020,00072,ARS-02-0056350,Beacon America,Not captured,Not captured,Not captured,Passport(K9944206),,,Anantharaman,Mahalakshmi,,02/12/1952,female,Not captured,Not captured,Not captured,Not captured,Not captured,Not captured,Not captured,Not captured,Not captured,Not captured,Not captured,Not captured,Not captured,Poornima Rajagopal,,Not captured,Not captured,Not captured,Not captured,#172 South Perumal Maistry Street,,Madurai,TN,625001,+1-6506566423,,Not captured,Not captured,calibergemini@yahoo.com,Not captured,802049079,,Not captured,Not captured,Not captured,Not captured,Not captured,Not captured,
Not captured,Not captured,07/25/2020,07/31/2020,Not captured,Not captured,863949,020,00072,ARS-02-0056348,Beacon America,Not captured,Not captured,Not captured,Passport(J7420842),,,DSouza,Carolyn,,09/04/1968,female,Not captured,Not captured,Not captured,Not captured,Not captured,Not captured,Not captured,Not captured,Not captured,Not captured,Not captured,Not captured,Not captured,none,,Not captured,Not captured,Not captured,Not captured,35 Prasanna,,Mumbai,MH,400010,+1-6177060127,,Not captured,Not captured,scottscrlyn@gmail.com,Not captured,802049077,,Not captured,Not captured,Not captured,Not captured,Not captured,Not captured,
Not captured,Not captured,07/26/2020,12/31/2020,Not captured,Not captured,863949,020,00072,OVI-42-0056347,Overseas Visitors Insurance Plan B,Not captured,Not captured,Not captured,,,,Rajagopalan,Saraswathi,,07/28/1946,female,Not captured,Not captured,Not captured,Not captured,Not captured,Not captured,Not captured,Not captured,Not captured,Not captured,Not captured,Not captured,Not captured,Uma Subramanian,Daughter,Not captured,Not captured,Not captured,Not captured,3605 Thorp Springs Dr,,Plano,Texas,75025,7324766300,,Not captured,Not captured,usubrama75@gmail.com,Not captured,802049076,,Not captured,Not captured,Not captured,Not captured,Not captured,Not captured,
Not captured,Not captured,07/24/2020,08/23/2020,Not captured,Not captured,863949,020,00072,ARS-01-0056344,Beacon International,Not captured,Not captured,Not captured,,,,Brezel,Tzvi,,06/06/2019,male,Not captured,Not captured,Not captured,Not captured,Not captured,Not captured,Not captured,Not captured,Not captured,Not captured,Not captured,Not captured,Not captured,,,Not captured,Not captured,Not captured,Not captured,2 Bartanura Road,,Toms river,New Jersey,07752,732-364-2118,,Not captured,Not captured,miriambrezel@gmail.com,Not captured,802049073,,Not captured,Not captured,Not captured,Not captured,Not captured,Not captured,
Not captured,Not captured,07/24/2020,08/23/2020,Not captured,Not captured,863949,020,00072,ARS-01-0056343,Beacon International,Not captured,Not captured,Not captured,,,,Brezel,Mordechai,,07/12/2017,male,Not captured,Not captured,Not captured,Not captured,Not captured,Not captured,Not captured,Not captured,Not captured,Not captured,Not captured,Not captured,Not captured,,,Not captured,Not captured,Not captured,Not captured,2 Bartanura Road,,Toms river,New Jersey,07752,732-364-2118,,Not captured,Not captured,miriambrezel@gmail.com,Not captured,802049072,,Not captured,Not captured,Not captured,Not captured,Not captured,Not captured,
Not captured,Not captured,07/24/2020,08/23/2020,Not captured,Not captured,863949,020,00072,ARS-01-0056342,Beacon International,Not captured,Not captured,Not captured,,,,Brezel,Simcha,,07/06/2015,male,Not captured,Not captured,Not captured,Not captured,Not captured,Not captured,Not captured,Not captured,Not captured,Not captured,Not captured,Not captured,Not captured,,,Not captured,Not captured,Not captured,Not captured,2 Bartanura Road,,Toms river,New Jersey,07752,732-364-2118,,Not captured,Not captured,miriambrezel@gmail.com,Not captured,802049071,,Not captured,Not captured,Not captured,Not captured,Not captured,Not captured,
Not captured,Not captured,07/24/2020,08/23/2020,Not captured,Not captured,863949,020,00072,ARS-01-0056341,Beacon International,Not captured,Not captured,Not captured,,,,Brezel,Chesky,,11/06/2013,male,Not captured,Not captured,Not captured,Not captured,Not captured,Not captured,Not captured,Not captured,Not captured,Not captured,Not captured,Not captured,Not captured,,,Not captured,Not captured,Not captured,Not captured,2 Bartanura Road,,Toms river,New Jersey,07752,732-364-2118,,Not captured,Not captured,miriambrezel@gmail.com,Not captured,802049070,,Not captured,Not captured,Not captured,Not captured,Not captured,Not captured,
Not captured,Not captured,07/24/2020,08/23/2020,Not captured,Not captured,863949,020,00072,ARS-01-0056340,Beacon International,Not captured,Not captured,Not captured,,,,Brezel,Shlomo,,02/05/2012,male,Not captured,Not captured,Not captured,Not captured,Not captured,Not captured,Not captured,Not captured,Not captured,Not captured,Not captured,Not captured,Not captured,,,Not captured,Not captured,Not captured,Not captured,2 Bartanura Road,,Toms river,New Jersey,07752,732-364-2118,,Not captured,Not captured,miriambrezel@gmail.com,Not captured,802049069,,Not captured,Not captured,Not captured,Not captured,Not captured,Not captured,
Not captured,Not captured,07/24/2020,08/23/2020,Not captured,Not captured,863949,020,00072,ARS-01-0056339,Beacon International,Not captured,Not captured,Not captured,,,,Brezel,Miriam,,10/03/1990,female,Not captured,Not captured,Not captured,Not captured,Not captured,Not captured,Not captured,Not captured,Not captured,Not captured,Not captured,Not captured,Not captured,,,Not captured,Not captured,Not captured,Not captured,2 Bartanura Road,,Toms river,New Jersey,07752,732-364-2118,,Not captured,Not captured,miriambrezel@gmail.com,Not captured,802049068,,Not captured,Not captured,Not captured,Not captured,Not captured,Not captured,
Not captured,Not captured,07/24/2020,08/23/2020,Not captured,Not captured,863949,020,00072,ARS-01-0056338,Beacon International,Not captured,Not captured,Not captured,,,,Brezel,Yaakov,,08/01/1989,male,Not captured,Not captured,Not captured,Not captured,Not captured,Not captured,Not captured,Not captured,Not captured,Not captured,Not captured,Not captured,Not captured,,,Not captured,Not captured,Not captured,Not captured,2 Bartanura Road,,Toms river,New Jersey,07752,732-364-2118,,Not captured,Not captured,miriambrezel@gmail.com,Not captured,802049067,,Not captured,Not captured,Not captured,Not captured,Not captured,Not captured,