EE Transaction Type,Dependent Transaction Type,Effective Date,Expiry Date,EE Signature,EE Signature Date,Control,Suffix,Account,Plan Number,Plan Name,Claim Office,Network ID Number,Customer Code,EE SSN,Dependent SSN,Dependent Relationship,Last Name,First Name,Middle Initial,DOB,Gender,Ethnicity,PCP/PCD,PCP/PCD Current Patient,Provider Cap Office Number,COB,Dep Student Indicator,Dep OOA Indicator,EE Prior Coverage Indicator,EE Late Entrant,EE Language Indicator,Hire Date,Earnings,Earnings Frequency,Beneficiary (Last Name First Name MI),Beneficiary Relationship,Continuation of Coverage Expiration Date,Continuation of Coverage Event Date,Continuation of Coverage Length of Coverage,Work Location Zip Code,Street Address Line 1,Street Address Line 2,City,State,Zip Code,Home Phone Number,Work Phone Number,Accept Code,Evidence Code,EE Email Address,Communication Disability Code,EE Alternate ID,Dep Alternate ID,Old Control,Old Suffix,Old Account,New Control,New Suffix,New Account,
Not captured,Not captured,08/05/2020,12/15/2020,Not captured,Not captured,863949,020,00072,ARS-02-0056472,Beacon America,Not captured,Not captured,Not captured,,,,kachynskaya,yeva,,05/03/2018,female,Not captured,Not captured,Not captured,Not captured,Not captured,Not captured,Not captured,Not captured,Not captured,Not captured,Not captured,Not captured,Not captured,marina kreiter,Dependent,Not captured,Not captured,Not captured,Not captured,42 pavlovskogo street apt: 70,,minsk,minsk,220109,+1-401-4803792,,Not captured,Not captured,kreitermarina@gmail.com,Not captured,802049211,,Not captured,Not captured,Not captured,Not captured,Not captured,Not captured,
Not captured,Not captured,08/05/2020,12/15/2020,Not captured,Not captured,863949,020,00072,ARS-02-0056471,Beacon America,Not captured,Not captured,Not captured,,,,kachynskaya,aliona,,08/28/1990,female,Not captured,Not captured,Not captured,Not captured,Not captured,Not captured,Not captured,Not captured,Not captured,Not captured,Not captured,Not captured,Not captured,marina kreiter,Spouse,Not captured,Not captured,Not captured,Not captured,42 pavlovskogo street apt: 70,,minsk,minsk,220109,+1-401-4803792,,Not captured,Not captured,kreitermarina@gmail.com,Not captured,802049210,,Not captured,Not captured,Not captured,Not captured,Not captured,Not captured,
Not captured,Not captured,08/05/2020,12/15/2020,Not captured,Not captured,863949,020,00072,ARS-02-0056470,Beacon America,Not captured,Not captured,Not captured,Passport(MP3925376),,,kachynski,maksim,,02/03/1993,male,Not captured,Not captured,Not captured,Not captured,Not captured,Not captured,Not captured,Not captured,Not captured,Not captured,Not captured,Not captured,Not captured,marina kreiter,,Not captured,Not captured,Not captured,Not captured,42 pavlovskogo street apt: 70,,minsk,minsk,220109,+1-401-4803792,,Not captured,Not captured,kreitermarina@gmail.com,Not captured,802049209,,Not captured,Not captured,Not captured,Not captured,Not captured,Not captured,
Not captured,Not captured,08/06/2020,09/05/2020,Not captured,Not captured,863949,020,00072,ARS-01-0056469,Beacon International,Not captured,Not captured,Not captured,Passport(641178546),,,Ovalle,Rafael,,05/10/1955,male,Not captured,Not captured,Not captured,Not captured,Not captured,Not captured,Not captured,Not captured,Not captured,Not captured,Not captured,Not captured,Not captured,John Ovalle,,Not captured,Not captured,Not captured,Not captured,125 West 109 street,,New York,NY,10025,+1-9176573429,+1-2126638897,Not captured,Not captured,ovalle.rafael1@gmail.com,Not captured,802049208,,Not captured,Not captured,Not captured,Not captured,Not captured,Not captured,
Not captured,Not captured,08/09/2020,09/10/2020,Not captured,Not captured,863949,020,00072,ARS-02-0056468,Beacon America,Not captured,Not captured,Not captured,,,,Rodrigurez,Luis,,02/13/2007,male,Not captured,Not captured,Not captured,Not captured,Not captured,Not captured,Not captured,Not captured,Not captured,Not captured,Not captured,Not captured,Not captured,Patricia Moreno ,Mother ,Not captured,Not captured,Not captured,Not captured,Laguna Vista 15,,San Jose del Cabo,Baja California Sur,23400,6241576741,,Not captured,Not captured,luz@innoventueres.ca,Not captured,802049207,,Not captured,Not captured,Not captured,Not captured,Not captured,Not captured,
Not captured,Not captured,08/09/2020,09/10/2020,Not captured,Not captured,863949,020,00072,ARS-02-0056467,Beacon America,Not captured,Not captured,Not captured,Passport(G29912818),,,Sologuren,Luz,,12/24/1983,female,Not captured,Not captured,Not captured,Not captured,Not captured,Not captured,Not captured,Not captured,Not captured,Not captured,Not captured,Not captured,Not captured,Patricia Moreno ,Mother ,Not captured,Not captured,Not captured,Not captured,Laguna Vista 15,,San Jose del Cabo,Baja California Sur,23400,6241576741,,Not captured,Not captured,luz@innoventueres.ca,Not captured,802049206,,Not captured,Not captured,Not captured,Not captured,Not captured,Not captured,
Not captured,Not captured,08/05/2020,08/16/2020,Not captured,Not captured,863949,020,00072,ARS-01-0056466,Beacon International,Not captured,Not captured,Not captured,,,,Markovic,Miri,,02/25/2020,female,Not captured,Not captured,Not captured,Not captured,Not captured,Not captured,Not captured,Not captured,Not captured,Not captured,Not captured,Not captured,Not captured,,,Not captured,Not captured,Not captured,Not captured,31 Shenandoah,,Lakewood,New Jersey,08701,646-565-9790,,Not captured,Not captured,zevmarkovic@gmail.com,Not captured,802049205,,Not captured,Not captured,Not captured,Not captured,Not captured,Not captured,
Not captured,Not captured,08/05/2020,08/16/2020,Not captured,Not captured,863949,020,00072,ARS-01-0056465,Beacon International,Not captured,Not captured,Not captured,,,,Markovic,Sheindle,,07/31/2017,female,Not captured,Not captured,Not captured,Not captured,Not captured,Not captured,Not captured,Not captured,Not captured,Not captured,Not captured,Not captured,Not captured,,,Not captured,Not captured,Not captured,Not captured,31 Shenandoah,,Lakewood,New Jersey,08701,646-565-9790,,Not captured,Not captured,zevmarkovic@gmail.com,Not captured,802049204,,Not captured,Not captured,Not captured,Not captured,Not captured,Not captured,
Not captured,Not captured,08/05/2020,08/16/2020,Not captured,Not captured,863949,020,00072,ARS-01-0056464,Beacon International,Not captured,Not captured,Not captured,,,,Klein,Tiffeny,,02/27/1994,male,Not captured,Not captured,Not captured,Not captured,Not captured,Not captured,Not captured,Not captured,Not captured,Not captured,Not captured,Not captured,Not captured,,,Not captured,Not captured,Not captured,Not captured,31 Shenandoah,,Lakewood,New Jersey,08701,646-565-9790,,Not captured,Not captured,zevmarkovic@gmail.com,Not captured,802049203,,Not captured,Not captured,Not captured,Not captured,Not captured,Not captured,
Not captured,Not captured,08/05/2020,09/05/2020,Not captured,Not captured,863949,020,00072,ARS-02-0056463,Beacon America,Not captured,Not captured,Not captured,Passport(P5222156),,,nimmagadda,ratna kumari,,09/27/1974,female,Not captured,Not captured,Not captured,Not captured,Not captured,Not captured,Not captured,Not captured,Not captured,Not captured,Not captured,Not captured,Not captured,MOUNIKA NIMMAGADDA,,Not captured,Not captured,Not captured,Not captured,KOYAVARIPALEM,,YANAMADALA,AP,522019,+1-8608779079,+1-2016228922,Not captured,Not captured,n.mounika34@gmail.com,Not captured,802049202,,Not captured,Not captured,Not captured,Not captured,Not captured,Not captured,
Not captured,Not captured,08/06/2020,09/30/2020,Not captured,Not captured,863949,020,00072,OVI-41-0056462,Overseas Visitors Insurance Plan A,Not captured,Not captured,Not captured,Passport(Z2752319),,,Maskai,Khushboo,,06/06/1985,female,Not captured,Not captured,Not captured,Not captured,Not captured,Not captured,Not captured,Not captured,Not captured,Not captured,Not captured,Not captured,Not captured,Nitin Maskai,Father,Not captured,Not captured,Not captured,Not captured,635 GROVE AVE,,EDISON,NJ,08820,7324235950,,Not captured,Not captured,knmusa6@gmail.com,Not captured,802049201,,Not captured,Not captured,Not captured,Not captured,Not captured,Not captured,
Not captured,Not captured,08/06/2020,09/30/2020,Not captured,Not captured,863949,020,00072,OVI-41-0056461,Overseas Visitors Insurance Plan A,Not captured,Not captured,Not captured,Passport(Z3268843),,,Maskai,Nihaar,N,06/11/1987,male,Not captured,Not captured,Not captured,Not captured,Not captured,Not captured,Not captured,Not captured,Not captured,Not captured,Not captured,Not captured,Not captured,Nitin Maskai,Father,Not captured,Not captured,Not captured,Not captured,635 GROVE AVE,,EDISON,New Jersey,08820,7324235950,,Not captured,Not captured,nnmaskai11@gmail.com,Not captured,802049200,,Not captured,Not captured,Not captured,Not captured,Not captured,Not captured,
Not captured,Not captured,08/05/2020,11/02/2020,Not captured,Not captured,863949,020,00072,ARS-01-0056460,Beacon International,Not captured,Not captured,Not captured,,,,Jones,Sara,L,09/09/1978,female,Not captured,Not captured,Not captured,Not captured,Not captured,Not captured,Not captured,Not captured,Not captured,Not captured,Not captured,Not captured,Not captured,,,Not captured,Not captured,Not captured,Not captured,Gable House Church Road,,Swindon,,SN4 0BZ,,,Not captured,Not captured,sljones5@yahoo.com,Not captured,802049199,,Not captured,Not captured,Not captured,Not captured,Not captured,Not captured,
Not captured,Not captured,08/05/2020,08/19/2020,Not captured,Not captured,863949,020,00072,ARS-02-0056459,Beacon America,Not captured,Not captured,Not captured,,,,Taqqu,Moshe,,12/31/2000,male,Not captured,Not captured,Not captured,Not captured,Not captured,Not captured,Not captured,Not captured,Not captured,Not captured,Not captured,Not captured,Not captured,,,Not captured,Not captured,Not captured,Not captured,132 East 8th Street,,Lakewood,New Jersey,08701,972548424377,,Not captured,Not captured,ctaqqu@gmail.com,Not captured,802049198,,Not captured,Not captured,Not captured,Not captured,Not captured,Not captured,
Not captured,Not captured,08/04/2020,07/31/2021,Not captured,Not captured,863949,020,00072,ARS-02-0056458,Beacon America,Not captured,Not captured,Not captured,Passport(AL721975),,,TUFENKDJIAN,ALEX,,11/18/2003,male,Not captured,Not captured,Not captured,Not captured,Not captured,Not captured,Not captured,Not captured,Not captured,Not captured,Not captured,Not captured,Not captured,GILBERT TUFENKDJIAN,,Not captured,Not captured,Not captured,Not captured,1620 100E AVENUE,,LAVAL,QC,H7W0B8,+1-2134317312,,Not captured,Not captured,alextuf2020@gmail.com,Not captured,802049197,,Not captured,Not captured,Not captured,Not captured,Not captured,Not captured,
Not captured,Not captured,08/04/2020,07/31/2021,Not captured,Not captured,863949,020,00072,ARS-02-0056457,Beacon America,Not captured,Not captured,Not captured,Passport(AL722403),,,Tufenkdjian,Garo,,08/12/2002,male,Not captured,Not captured,Not captured,Not captured,Not captured,Not captured,Not captured,Not captured,Not captured,Not captured,Not captured,Not captured,Not captured,GILBERT TUFENKDJIAN,,Not captured,Not captured,Not captured,Not captured,1620 100E AVENUE,,LAVAL,QC,H7W0B8,+1-2134317312,,Not captured,Not captured,garotuf2020@gmail.com,Not captured,802049196,,Not captured,Not captured,Not captured,Not captured,Not captured,Not captured,
Not captured,Not captured,08/23/2020,02/25/2021,Not captured,Not captured,863949,020,00072,ARS-01-0056455,Beacon International,Not captured,Not captured,Not captured,Passport(578435297),,,Long,Courtenay,Q,07/27/1978,male,Not captured,Not captured,Not captured,Not captured,Not captured,Not captured,Not captured,Not captured,Not captured,Not captured,Not captured,Not captured,Not captured,Cherith Long,Wife,Not captured,Not captured,Not captured,Not captured,1222 N. 29th Street,,Philadelphia,Pennsylvania,19121,2678729489,,Not captured,Not captured,eppleycj@hotmail.com,Not captured,802049193,,Not captured,Not captured,Not captured,Not captured,Not captured,Not captured,
Not captured,Not captured,08/06/2020,08/18/2020,Not captured,Not captured,863949,020,00072,ARS-02-0056450,Beacon America,Not captured,Not captured,Not captured,,,,Fleisher,Bentzy,,05/01/2017,male,Not captured,Not captured,Not captured,Not captured,Not captured,Not captured,Not captured,Not captured,Not captured,Not captured,Not captured,Not captured,Not captured,,,Not captured,Not captured,Not captured,Not captured,98 Gudz Road,,Lakewood,New Jersey,08701,347-772-1677,,Not captured,Not captured,etfleisher@gmail.com,Not captured,802049189,,Not captured,Not captured,Not captured,Not captured,Not captured,Not captured,
Not captured,Not captured,08/06/2020,08/18/2020,Not captured,Not captured,863949,020,00072,ARS-02-0056449,Beacon America,Not captured,Not captured,Not captured,,,,Fleisher,Simcha,,03/30/2014,male,Not captured,Not captured,Not captured,Not captured,Not captured,Not captured,Not captured,Not captured,Not captured,Not captured,Not captured,Not captured,Not captured,,,Not captured,Not captured,Not captured,Not captured,98 Gudz Road,,Lakewood,New Jersey,08701,347-772-1677,,Not captured,Not captured,etfleisher@gmail.com,Not captured,802049188,,Not captured,Not captured,Not captured,Not captured,Not captured,Not captured,
Not captured,Not captured,08/06/2020,08/18/2020,Not captured,Not captured,863949,020,00072,ARS-02-0056448,Beacon America,Not captured,Not captured,Not captured,,,,Fleisher,Eliyahu,,11/07/2011,male,Not captured,Not captured,Not captured,Not captured,Not captured,Not captured,Not captured,Not captured,Not captured,Not captured,Not captured,Not captured,Not captured,,,Not captured,Not captured,Not captured,Not captured,98 Gudz Road,,Lakewood,New Jersey,08701,347-772-1677,,Not captured,Not captured,etfleisher@gmail.com,Not captured,802049187,,Not captured,Not captured,Not captured,Not captured,Not captured,Not captured,
Not captured,Not captured,08/06/2020,08/18/2020,Not captured,Not captured,863949,020,00072,ARS-02-0056447,Beacon America,Not captured,Not captured,Not captured,,,,Fleisher,Chaim,,11/16/2008,male,Not captured,Not captured,Not captured,Not captured,Not captured,Not captured,Not captured,Not captured,Not captured,Not captured,Not captured,Not captured,Not captured,,,Not captured,Not captured,Not captured,Not captured,98 Gudz Road,,Lakewood,New Jersey,08701,347-772-1677,,Not captured,Not captured,etfleisher@gmail.com,Not captured,802049186,,Not captured,Not captured,Not captured,Not captured,Not captured,Not captured,
Not captured,Not captured,08/06/2020,08/18/2020,Not captured,Not captured,863949,020,00072,ARS-02-0056446,Beacon America,Not captured,Not captured,Not captured,,,,Fleisher,Yehudis,,09/10/2004,female,Not captured,Not captured,Not captured,Not captured,Not captured,Not captured,Not captured,Not captured,Not captured,Not captured,Not captured,Not captured,Not captured,,,Not captured,Not captured,Not captured,Not captured,98 Gudz Road,,Lakewood,New Jersey,08701,347-772-1677,,Not captured,Not captured,etfleisher@gmail.com,Not captured,802049185,,Not captured,Not captured,Not captured,Not captured,Not captured,Not captured,
Not captured,Not captured,08/06/2020,08/18/2020,Not captured,Not captured,863949,020,00072,ARS-02-0056445,Beacon America,Not captured,Not captured,Not captured,,,,Fleisher,Chavy,,03/03/2003,female,Not captured,Not captured,Not captured,Not captured,Not captured,Not captured,Not captured,Not captured,Not captured,Not captured,Not captured,Not captured,Not captured,,,Not captured,Not captured,Not captured,Not captured,98 Gudz Road,,Lakewood,New Jersey,08701,347-772-1677,,Not captured,Not captured,etfleisher@gmail.com,Not captured,802049184,,Not captured,Not captured,Not captured,Not captured,Not captured,Not captured,
Not captured,Not captured,08/06/2020,08/18/2020,Not captured,Not captured,863949,020,00072,ARS-02-0056444,Beacon America,Not captured,Not captured,Not captured,,,,Fleisher,Dovi,,06/09/1999,male,Not captured,Not captured,Not captured,Not captured,Not captured,Not captured,Not captured,Not captured,Not captured,Not captured,Not captured,Not captured,Not captured,,,Not captured,Not captured,Not captured,Not captured,98 Gudz Road,,Lakewood,New Jersey,08701,347-772-1677,,Not captured,Not captured,etfleisher@gmail.com,Not captured,802049183,,Not captured,Not captured,Not captured,Not captured,Not captured,Not captured,
Not captured,Not captured,08/06/2020,08/18/2020,Not captured,Not captured,863949,020,00072,ARS-02-0056443,Beacon America,Not captured,Not captured,Not captured,,,,Fleisher,Esther,,04/30/1977,male,Not captured,Not captured,Not captured,Not captured,Not captured,Not captured,Not captured,Not captured,Not captured,Not captured,Not captured,Not captured,Not captured,,,Not captured,Not captured,Not captured,Not captured,98 Gudz Road,,Lakewood,New Jersey,08701,347-772-1677,,Not captured,Not captured,etfleisher@gmail.com,Not captured,802049182,,Not captured,Not captured,Not captured,Not captured,Not captured,Not captured,
Not captured,Not captured,08/06/2020,08/18/2020,Not captured,Not captured,863949,020,00072,ARS-02-0056442,Beacon America,Not captured,Not captured,Not captured,,,,Fleisher,Mayer,,09/20/1973,male,Not captured,Not captured,Not captured,Not captured,Not captured,Not captured,Not captured,Not captured,Not captured,Not captured,Not captured,Not captured,Not captured,,,Not captured,Not captured,Not captured,Not captured,98 Gudz Road,,Lakewood,New Jersey,08701,347-772-1677,,Not captured,Not captured,etfleisher@gmail.com,Not captured,802049181,,Not captured,Not captured,Not captured,Not captured,Not captured,Not captured,
Not captured,Not captured,08/05/2020,05/31/2021,Not captured,Not captured,863949,020,00072,ARS-02-0056440,Beacon America,Not captured,Not captured,Not captured,Passport(E93021009),,,Ling,Yan,,12/01/1952,female,Not captured,Not captured,Not captured,Not captured,Not captured,Not captured,Not captured,Not captured,Not captured,Not captured,Not captured,Not captured,Not captured,Wanyi Ling,,Not captured,Not captured,Not captured,Not captured,Apt 4-201 No 62 Nan Si Jing Street Heping District,,Shenyang,Liaoning,110003,+1-7034085162,,Not captured,Not captured,alast9@gmail.com,Not captured,802049179,,Not captured,Not captured,Not captured,Not captured,Not captured,Not captured,
Not captured,Not captured,08/08/2020,09/07/2020,Not captured,Not captured,863949,020,00072,ARS-01-0056434,Beacon International,Not captured,Not captured,Not captured,Passport(534798929),,,Gelbart,Menahem,Meir,09/05/1953,male,Not captured,Not captured,Not captured,Not captured,Not captured,Not captured,Not captured,Not captured,Not captured,Not captured,Not captured,Not captured,Not captured,Tereza Cristina Ramos Costa,Girl Friend,Not captured,Not captured,Not captured,Not captured,7866 Seville Pl Apt#2304,,Boca Raton,Florida,33433,9542267930,561-430-3650,Not captured,Not captured,mennygel@gmail.com,Not captured,802049173,,Not captured,Not captured,Not captured,Not captured,Not captured,Not captured,
Not captured,Not captured,08/07/2020,10/29/2020,Not captured,Not captured,863949,020,00072,ARS-01-0056432,Beacon International,Not captured,Not captured,Not captured,Passport(584972614),,,Pereira,Fabio David,,07/25/1986,male,Not captured,Not captured,Not captured,Not captured,Not captured,Not captured,Not captured,Not captured,Not captured,Not captured,Not captured,Not captured,Not captured,Laysa Ditzel Durski,,Not captured,Not captured,Not captured,Not captured,461 E 51 st st,,Hialeah,FL,33013,+1-7864739806,,Not captured,Not captured,laydurski@gmail.com,Not captured,802049171,,Not captured,Not captured,Not captured,Not captured,Not captured,Not captured,
Not captured,Not captured,08/03/2020,08/01/2021,Not captured,Not captured,863949,020,00072,ARS-03-0056404,Essential America,Not captured,Not captured,Not captured,Passport(548172322),,,Dixon,Allison,Maria,09/29/1975,female,Not captured,Not captured,Not captured,Not captured,Not captured,Not captured,Not captured,Not captured,Not captured,Not captured,Not captured,Not captured,Not captured,,,Not captured,Not captured,Not captured,Not captured,4 Clivede Rd.,,Chester Cheshire,England,CN4 8DR,01244676973,,Not captured,Not captured,mainstreetins@msn.com,Not captured,802049140,,Not captured,Not captured,Not captured,Not captured,Not captured,Not captured,
Not captured,Not captured,08/03/2020,08/01/2021,Not captured,Not captured,863949,020,00072,ARS-03-0056404,Essential America,Not captured,Not captured,Not captured,,Passport(556017760),Dependant,Dixon,Jack,,12/10/1998,male,Not captured,Not captured,Not captured,Not captured,Not captured,Not captured,Not captured,Not captured,Not captured,Not captured,Not captured,Not captured,Not captured,,,Not captured,Not captured,Not captured,Not captured,4 Clivede Rd.,,Chester Cheshire,England,CN4 8DR,01244676973,,Not captured,Not captured,mainstreetins@msn.com,Not captured,,802049168,Not captured,Not captured,Not captured,Not captured,Not captured,Not captured,
Not captured,Not captured,08/03/2020,08/01/2021,Not captured,Not captured,863949,020,00072,ARS-03-0056404,Essential America,Not captured,Not captured,Not captured,,Passport(561603890),Dependant,Dixon,Tia Jade,,01/20/2001,female,Not captured,Not captured,Not captured,Not captured,Not captured,Not captured,Not captured,Not captured,Not captured,Not captured,Not captured,Not captured,Not captured,,,Not captured,Not captured,Not captured,Not captured,4 Clivede Rd.,,Chester Cheshire,England,CN4 8DR,01244676973,,Not captured,Not captured,mainstreetins@msn.com,Not captured,,802049169,Not captured,Not captured,Not captured,Not captured,Not captured,Not captured,
Not captured,Not captured,08/03/2020,08/01/2021,Not captured,Not captured,863949,020,00072,ARS-03-0056404,Essential America,Not captured,Not captured,Not captured,,Passport(561543275),Dependant,Dixon,Luci Ella,,10/14/2003,female,Not captured,Not captured,Not captured,Not captured,Not captured,Not captured,Not captured,Not captured,Not captured,Not captured,Not captured,Not captured,Not captured,,,Not captured,Not captured,Not captured,Not captured,4 Clivede Rd.,,Chester Cheshire,England,CN4 8DR,01244676973,,Not captured,Not captured,mainstreetins@msn.com,Not captured,,802049170,Not captured,Not captured,Not captured,Not captured,Not captured,Not captured,
Not captured,Not captured,08/22/2020,09/04/2020,Not captured,Not captured,863949,020,00072,ARS-01-0056431,Beacon International,Not captured,Not captured,Not captured,Passport(654571196),,,Wedlake,Hannah Leigh,,07/18/1995,female,Not captured,Not captured,Not captured,Not captured,Not captured,Not captured,Not captured,Not captured,Not captured,Not captured,Not captured,Not captured,Not captured,Fernando Vieira Leite,,Not captured,Not captured,Not captured,Not captured,2528 Mission St,,Pittsburgh,PA,15203,+1-8144041131,,Not captured,Not captured,hlwedlake16@gmail.com,Not captured,802049167,,Not captured,Not captured,Not captured,Not captured,Not captured,Not captured,
Not captured,Not captured,08/03/2020,09/01/2020,Not captured,Not captured,863949,020,00072,ARS-01-0056428,Beacon International,Not captured,Not captured,Not captured,,,,Emelianov,Andrey,,05/24/1983,male,Not captured,Not captured,Not captured,Not captured,Not captured,Not captured,Not captured,Not captured,Not captured,Not captured,Not captured,Not captured,Not captured,,,Not captured,Not captured,Not captured,Not captured,2250 Monroe St 156,,Santa Clara,California,95050,,,Not captured,Not captured,intvoker@gmail.com,Not captured,802049164,,Not captured,Not captured,Not captured,Not captured,Not captured,Not captured,