EE Transaction Type,Dependent Transaction Type,Effective Date,Expiry Date,EE Signature,EE Signature Date,Control,Suffix,Account,Plan Number,Plan Name,Claim Office,Network ID Number,Customer Code,EE SSN,Dependent SSN,Dependent Relationship,Last Name,First Name,Middle Initial,DOB,Gender,Ethnicity,PCP/PCD,PCP/PCD Current Patient,Provider Cap Office Number,COB,Dep Student Indicator,Dep OOA Indicator,EE Prior Coverage Indicator,EE Late Entrant,EE Language Indicator,Hire Date,Earnings,Earnings Frequency,Beneficiary (Last Name First Name MI),Beneficiary Relationship,Continuation of Coverage Expiration Date,Continuation of Coverage Event Date,Continuation of Coverage Length of Coverage,Work Location Zip Code,Street Address Line 1,Street Address Line 2,City,State,Zip Code,Home Phone Number,Work Phone Number,Accept Code,Evidence Code,EE Email Address,Communication Disability Code,EE Alternate ID,Dep Alternate ID,Old Control,Old Suffix,Old Account,New Control,New Suffix,New Account,
Not captured,Not captured,07/18/2020,08/18/2020,Not captured,Not captured,863949,020,00072,ARS-02-0056292,Beacon America,Not captured,Not captured,Not captured,,,,Pittoors,Elizabeth,,06/21/2005,female,Not captured,Not captured,Not captured,Not captured,Not captured,Not captured,Not captured,Not captured,Not captured,Not captured,Not captured,Not captured,Not captured,,,Not captured,Not captured,Not captured,Not captured,21661 Brookhurst Street,,Huntington Beach,California,92646,,,Not captured,Not captured,lisakathleen@shaw.ca,Not captured,802048988,,Not captured,Not captured,Not captured,Not captured,Not captured,Not captured,
Not captured,Not captured,07/18/2020,08/18/2020,Not captured,Not captured,863949,020,00072,ARS-02-0056291,Beacon America,Not captured,Not captured,Not captured,,,,Kathleen,Lisa,,02/16/1970,female,Not captured,Not captured,Not captured,Not captured,Not captured,Not captured,Not captured,Not captured,Not captured,Not captured,Not captured,Not captured,Not captured,,,Not captured,Not captured,Not captured,Not captured,21661 Brookhurst Street,,Huntington Beach,California,92646,,,Not captured,Not captured,lisakathleen@shaw.ca,Not captured,802048987,,Not captured,Not captured,Not captured,Not captured,Not captured,Not captured,
Not captured,Not captured,07/19/2020,09/07/2020,Not captured,Not captured,863949,020,00072,ARS-01-0056290,Beacon International,Not captured,Not captured,Not captured,,,,Whittaker,Angela,,04/24/1967,female,Not captured,Not captured,Not captured,Not captured,Not captured,Not captured,Not captured,Not captured,Not captured,Not captured,Not captured,Not captured,Not captured,Ruby Whittaker ,Mother,Not captured,Not captured,Not captured,Not captured,1234 Franklin Street,,Santa Monica,California,90404,3102108634,,Not captured,Not captured,meand33@mac.com,Not captured,802048986,,Not captured,Not captured,Not captured,Not captured,Not captured,Not captured,
Not captured,Not captured,07/19/2020,09/07/2020,Not captured,Not captured,863949,020,00072,ARS-01-0056289,Beacon International,Not captured,Not captured,Not captured,Passport(548878284),,,Umo,Manuel,,06/29/1975,male,Not captured,Not captured,Not captured,Not captured,Not captured,Not captured,Not captured,Not captured,Not captured,Not captured,Not captured,Not captured,Not captured,Ruby Whittaker ,Mother,Not captured,Not captured,Not captured,Not captured,1234 Franklin Street,,Santa Monica,California,90404,3102108634,,Not captured,Not captured,meand33@mac.com,Not captured,802048985,,Not captured,Not captured,Not captured,Not captured,Not captured,Not captured,
Not captured,Not captured,07/18/2020,08/17/2020,Not captured,Not captured,863949,020,00072,ARS-02-0056283,Beacon America,Not captured,Not captured,Not captured,Passport(B04572166),,,Morales,Miguel,Eduardo,01/28/1992,male,Not captured,Not captured,Not captured,Not captured,Not captured,Not captured,Not captured,Not captured,Not captured,Not captured,Not captured,Not captured,Not captured,Luis Rodolfo Morales,Father,Not captured,Not captured,Not captured,Not captured,Arcos de Santa Elena C. Apaneca 9C,,Antiguo Cuscatlan,La Libertad,1,78565513,,Not captured,Not captured,miguelm_barrios@hotmail.com,Not captured,802048976,,Not captured,Not captured,Not captured,Not captured,Not captured,Not captured,
Not captured,Not captured,07/17/2020,12/31/2020,Not captured,Not captured,863949,020,00072,ARS-02-0056280,Beacon America,Not captured,Not captured,Not captured,Passport(gv4976026),,,Valmir,Ejymson,,11/14/1994,male,Not captured,Not captured,Not captured,Not captured,Not captured,Not captured,Not captured,Not captured,Not captured,Not captured,Not captured,Not captured,Not captured,Evelyn Pierre,,Not captured,Not captured,Not captured,Not captured,Charrier Rue Masillon #18,,Cap-Haitien,Nord,11111,+1-4072555358,,Not captured,Not captured,vejymson@gmail.com,Not captured,802048971,,Not captured,Not captured,Not captured,Not captured,Not captured,Not captured,
Not captured,Not captured,07/16/2020,09/30/2020,Not captured,Not captured,863949,020,00072,ARS-02-0056279,Beacon America,Not captured,Not captured,Not captured,Passport(E51700964),,,Li,Changyun,,06/22/1962,female,Not captured,Not captured,Not captured,Not captured,Not captured,Not captured,Not captured,Not captured,Not captured,Not captured,Not captured,Not captured,Not captured,Lian Liu,,Not captured,Not captured,Not captured,Not captured,Chaohuayaju 4-502,,Shantou,Guangdong,515000,+1-6159456024,,Not captured,Not captured,timothylau316@gmail.com,Not captured,802048970,,Not captured,Not captured,Not captured,Not captured,Not captured,Not captured,
Not captured,Not captured,07/17/2020,10/31/2020,Not captured,Not captured,863949,020,00072,ARS-02-0056278,Beacon America,Not captured,Not captured,Not captured,Passport(P9810294),,,Sharma,Rekha,,03/12/1959,female,Not captured,Not captured,Not captured,Not captured,Not captured,Not captured,Not captured,Not captured,Not captured,Not captured,Not captured,Not captured,Not captured,Abhinesh Sharma,,Not captured,Not captured,Not captured,Not captured,7 Ranbir Margh,,PATIALA,PB,147001,+1-5622418134,+1-5624500982,Not captured,Not captured,abhi.kumarpta@gmail.com,Not captured,802048969,,Not captured,Not captured,Not captured,Not captured,Not captured,Not captured,
Not captured,Not captured,07/16/2020,08/28/2020,Not captured,Not captured,863949,020,00072,ARS-02-0056277,Beacon America,Not captured,Not captured,Not captured,,,,Dreyer,Sophie,V,05/13/1994,female,Not captured,Not captured,Not captured,Not captured,Not captured,Not captured,Not captured,Not captured,Not captured,Not captured,Not captured,Not captured,Not captured,,,Not captured,Not captured,Not captured,Not captured,16 pearson house,,putney,,SW15 1HY,,,Not captured,Not captured,sophiedreyer02@gmail.com,Not captured,802048968,,Not captured,Not captured,Not captured,Not captured,Not captured,Not captured,
Not captured,Not captured,07/16/2020,01/15/2021,Not captured,Not captured,863949,020,00072,ARS-02-0056275,Beacon America,Not captured,Not captured,Not captured,Passport(S7658058),,,KURUMARTHI ABISHEKAM,JACOB,,09/26/1971,male,Not captured,Not captured,Not captured,Not captured,Not captured,Not captured,Not captured,Not captured,Not captured,Not captured,Not captured,Not captured,Not captured,LAVEENA SWAROOPA MADDELA ADMIRAL,,Not captured,Not captured,Not captured,Not captured,H.NO:1-7-130/1/1 RISALA MUSHEERABAD,,HYDERABAD,TS,500020,+1-7087710751,+1-7088569538,Not captured,Not captured,jacobkurumarthi@gmail.com,Not captured,802048963,,Not captured,Not captured,Not captured,Not captured,Not captured,Not captured,
Not captured,Not captured,07/16/2020,01/15/2021,Not captured,Not captured,863949,020,00072,ARS-02-0056274,Beacon America,Not captured,Not captured,Not captured,Passport(S3384431),,,MADDELA ADMIRAL,LAVEENA SWAROOPA,,12/22/1973,female,Not captured,Not captured,Not captured,Not captured,Not captured,Not captured,Not captured,Not captured,Not captured,Not captured,Not captured,Not captured,Not captured,JACOB KURUMARTHI ABISHEKAM,,Not captured,Not captured,Not captured,Not captured,H.NO:1-7-130/1/1 RISALA MUSHEERABAD,,HYDERBAD,TS,500020,+1-7087710751,+1-7088569538,Not captured,Not captured,maddelalaveena@gmail.com,Not captured,802048962,,Not captured,Not captured,Not captured,Not captured,Not captured,Not captured,
Not captured,Not captured,07/16/2020,01/15/2021,Not captured,Not captured,863949,020,00072,ARS-02-0056273,Beacon America,Not captured,Not captured,Not captured,Passport(P2616423),,,KURUMARTHI JACOB,CAROLIN PEARL,,01/25/1995,female,Not captured,Not captured,Not captured,Not captured,Not captured,Not captured,Not captured,Not captured,Not captured,Not captured,Not captured,Not captured,Not captured,Jacob Kurumarthi Abishekam,,Not captured,Not captured,Not captured,Not captured,H.NO:1-7-130/1/1 RISALA MUSHEERABAD,,HYDERABAD,TS,500020,+1-7087710751,,Not captured,Not captured,carolinpearl.1995@gmail.com,Not captured,802048961,,Not captured,Not captured,Not captured,Not captured,Not captured,Not captured,
Not captured,Not captured,07/16/2020,07/31/2020,Not captured,Not captured,863949,020,00072,ARS-02-0056272,Beacon America,Not captured,Not captured,Not captured,Passport(EJ3033447),,,Wang,Handan,,07/26/1983,female,Not captured,Not captured,Not captured,Not captured,Not captured,Not captured,Not captured,Not captured,Not captured,Not captured,Not captured,Not captured,Not captured,BOTE ZHU,,Not captured,Not captured,Not captured,Not captured,Room G3-905 ShengHua JiaYuan No1777 Chen Xi Rd.,,YueQing,Zhejiang,325600,+1-6265609638,,Not captured,Not captured,gracemxpan@gmail.com,Not captured,802048960,,Not captured,Not captured,Not captured,Not captured,Not captured,Not captured,
Not captured,Not captured,07/17/2020,08/21/2020,Not captured,Not captured,863949,020,00072,ARS-01-0056271,Beacon International,Not captured,Not captured,Not captured,,,,D Ambrosio,Megan,E,11/27/2002,female,Not captured,Not captured,Not captured,Not captured,Not captured,Not captured,Not captured,Not captured,Not captured,Not captured,Not captured,Not captured,Not captured,Marcy D Ambrosio,Mother,Not captured,Not captured,Not captured,Not captured,4 Beverly Road,,Farmingdale,New York,11735,5163436786,,Not captured,Not captured,marcydambrosio@gmail.com,Not captured,802048959,,Not captured,Not captured,Not captured,Not captured,Not captured,Not captured,
Not captured,Not captured,07/17/2020,08/16/2020,Not captured,Not captured,863949,020,00072,ARS-02-0056269,Beacon America,Not captured,Not captured,Not captured,Passport(EC3717167),,,Zhao,Shuhuan,,10/16/2015,male,Not captured,Not captured,Not captured,Not captured,Not captured,Not captured,Not captured,Not captured,Not captured,Not captured,Not captured,Not captured,Not captured,Xujiang Zhao,,Not captured,Not captured,Not captured,Not captured,Juxing village tiancheng street,,Wenzhou,Zhejiang,325609,+1-518423-658,,Not captured,Not captured,zhaoxuj32@gmail.com,Not captured,802048957,,Not captured,Not captured,Not captured,Not captured,Not captured,Not captured,
Not captured,Not captured,07/16/2020,09/18/2020,Not captured,Not captured,863949,020,00072,ARS-02-0056268,Beacon America,Not captured,Not captured,Not captured,,,,Gaur,Rekha,,08/03/1956,female,Not captured,Not captured,Not captured,Not captured,Not captured,Not captured,Not captured,Not captured,Not captured,Not captured,Not captured,Not captured,Not captured,Amit Kumar Singh Gaur,Child,Not captured,Not captured,Not captured,Not captured,14 Valerie Lane,,Hamilton,New Jersey,08690,7324764725,,Not captured,Not captured,aksgaur2008@gmail.com,Not captured,802048955,,Not captured,Not captured,Not captured,Not captured,Not captured,Not captured,
Not captured,Not captured,07/16/2020,09/18/2020,Not captured,Not captured,863949,020,00072,ARS-02-0056267,Beacon America,Not captured,Not captured,Not captured,,,,Gaur,Arvind Kumar Singh,,05/09/1956,male,Not captured,Not captured,Not captured,Not captured,Not captured,Not captured,Not captured,Not captured,Not captured,Not captured,Not captured,Not captured,Not captured,Amit Kumar Singh Gaur,Child,Not captured,Not captured,Not captured,Not captured,14 Valerie Lane,,Hamilton,New Jersey,08690,7324764725,,Not captured,Not captured,aksgaur2008@gmail.com,Not captured,802048954,,Not captured,Not captured,Not captured,Not captured,Not captured,Not captured,
Not captured,Not captured,07/17/2020,09/10/2020,Not captured,Not captured,863949,020,00072,ARS-02-0056266,Beacon America,Not captured,Not captured,Not captured,Passport(30156123),,,ALALUF,RACHEL,,11/11/1953,female,Not captured,Not captured,Not captured,Not captured,Not captured,Not captured,Not captured,Not captured,Not captured,Not captured,Not captured,Not captured,Not captured,ben suky,ben suky,Not captured,Not captured,Not captured,Not captured,450 e. 83RD STREET,,nEW YORK,New York,10028,917-337-2777,,Not captured,Not captured,bensuky@aol.com,Not captured,802048945,,Not captured,Not captured,Not captured,Not captured,Not captured,Not captured,
Not captured,Not captured,07/16/2020,08/31/2020,Not captured,Not captured,863949,020,00072,ARS-02-0056265,Beacon America,Not captured,Not captured,Not captured,Passport(A09788357),,,GiwaAmu,Obafemi Ohiole,,08/29/1986,male,Not captured,Not captured,Not captured,Not captured,Not captured,Not captured,Not captured,Not captured,Not captured,Not captured,Not captured,Not captured,Not captured,Aimalohi GiwaAmu,,Not captured,Not captured,Not captured,Not captured,asparagus house 1,,Lekki,Lagos,0000,+1-9173531913,,Not captured,Not captured,fgajnr@gmail.com,Not captured,802048944,,Not captured,Not captured,Not captured,Not captured,Not captured,Not captured,
Not captured,Not captured,07/16/2020,09/16/2020,Not captured,Not captured,863949,020,00072,ARS-02-0056263,Beacon America,Not captured,Not captured,Not captured,Passport(G60219533),,,Luo,Bin,,11/29/1965,female,Not captured,Not captured,Not captured,Not captured,Not captured,Not captured,Not captured,Not captured,Not captured,Not captured,Not captured,Not captured,Not captured,Yao Xiao,,Not captured,Not captured,Not captured,Not captured,Bldg 1 Unit 601 Qinyuan Xiao Qu,,Changsha,Hunan,410004,+1-3157511375,,Not captured,Not captured,yxiao0712@gmail.com,Not captured,802048942,,Not captured,Not captured,Not captured,Not captured,Not captured,Not captured,
Not captured,Not captured,07/15/2020,07/13/2021,Not captured,Not captured,863949,020,00072,ARS-03-0056218,Essential America,Not captured,Not captured,Not captured,Passport(550067728),,,Pagano Jr,Martin,Carmelo,08/15/1980,male,Not captured,Not captured,Not captured,Not captured,Not captured,Not captured,Not captured,Not captured,Not captured,Not captured,Not captured,Not captured,Not captured,,,Not captured,Not captured,Not captured,Not captured,SR Guo Ji Xin Cheng,,Shenyang,Liaoning,110000,+86 186 2402 3247,,Not captured,Not captured,martypagano@gmail.com,Not captured,802048877,,Not captured,Not captured,Not captured,Not captured,Not captured,Not captured,
Not captured,Not captured,07/15/2020,07/13/2021,Not captured,Not captured,863949,020,00072,ARS-03-0056218,Essential America,Not captured,Not captured,Not captured,,Passport(567679377),Spouse,Pagano,Selena,Ann,06/11/1980,female,Not captured,Not captured,Not captured,Not captured,Not captured,Not captured,Not captured,Not captured,Not captured,Not captured,Not captured,Not captured,Not captured,,,Not captured,Not captured,Not captured,Not captured,SR Guo Ji Xin Cheng,,Shenyang,Liaoning,110000,+86 186 2402 3247,,Not captured,Not captured,martypagano@gmail.com,Not captured,,802048878,Not captured,Not captured,Not captured,Not captured,Not captured,Not captured,
Not captured,Not captured,07/15/2020,07/13/2021,Not captured,Not captured,863949,020,00072,ARS-03-0056218,Essential America,Not captured,Not captured,Not captured,,Passport(567467606),Dependant,Pagano,Yllana,Grace,03/26/2006,female,Not captured,Not captured,Not captured,Not captured,Not captured,Not captured,Not captured,Not captured,Not captured,Not captured,Not captured,Not captured,Not captured,,,Not captured,Not captured,Not captured,Not captured,SR Guo Ji Xin Cheng,,Shenyang,Liaoning,110000,+86 186 2402 3247,,Not captured,Not captured,martypagano@gmail.com,Not captured,,802048879,Not captured,Not captured,Not captured,Not captured,Not captured,Not captured,
Not captured,Not captured,07/15/2020,07/13/2021,Not captured,Not captured,863949,020,00072,ARS-03-0056218,Essential America,Not captured,Not captured,Not captured,,Passport(567467607),Dependant,Pagano,Leila,Micol,06/11/2008,female,Not captured,Not captured,Not captured,Not captured,Not captured,Not captured,Not captured,Not captured,Not captured,Not captured,Not captured,Not captured,Not captured,,,Not captured,Not captured,Not captured,Not captured,SR Guo Ji Xin Cheng,,Shenyang,Liaoning,110000,+86 186 2402 3247,,Not captured,Not captured,martypagano@gmail.com,Not captured,,802048880,Not captured,Not captured,Not captured,Not captured,Not captured,Not captured,
Not captured,Not captured,07/15/2020,07/13/2021,Not captured,Not captured,863949,020,00072,ARS-03-0056218,Essential America,Not captured,Not captured,Not captured,,Passport(565683296),Dependant,Pagano III,Martin,Carmelo,07/31/2012,male,Not captured,Not captured,Not captured,Not captured,Not captured,Not captured,Not captured,Not captured,Not captured,Not captured,Not captured,Not captured,Not captured,,,Not captured,Not captured,Not captured,Not captured,SR Guo Ji Xin Cheng,,Shenyang,Liaoning,110000,+86 186 2402 3247,,Not captured,Not captured,martypagano@gmail.com,Not captured,,802048881,Not captured,Not captured,Not captured,Not captured,Not captured,Not captured,
Not captured,Not captured,07/15/2020,08/03/2020,Not captured,Not captured,863949,020,00072,ARS-01-0056259,Beacon International,Not captured,Not captured,Not captured,,,,Zaltzman,Tall,,05/20/1985,female,Not captured,Not captured,Not captured,Not captured,Not captured,Not captured,Not captured,Not captured,Not captured,Not captured,Not captured,Not captured,Not captured,,,Not captured,Not captured,Not captured,Not captured,405 Humboldt st,,Brooklyn,New York,11211,,,Not captured,Not captured,talzaltzman85@gmail.com,Not captured,802048937,,Not captured,Not captured,Not captured,Not captured,Not captured,Not captured,
Not captured,Not captured,07/14/2020,08/15/2020,Not captured,Not captured,863949,020,00072,ARS-02-0056257,Beacon America,Not captured,Not captured,Not captured,Passport(a18239929),,,eldokmak,mohamed mahmoud,,05/04/1990,male,Not captured,Not captured,Not captured,Not captured,Not captured,Not captured,Not captured,Not captured,Not captured,Not captured,Not captured,Not captured,Not captured,mahmoud eldokmak,,Not captured,Not captured,Not captured,Not captured,dibi rosetta,,elbeheira,elbeheira,22758,+1-8324667896,,Not captured,Not captured,mm451990@gmail.com,Not captured,802048931,,Not captured,Not captured,Not captured,Not captured,Not captured,Not captured,
Not captured,Not captured,07/14/2020,07/12/2021,Not captured,Not captured,863949,020,00072,ARS-03-0056141,Essential America,Not captured,Not captured,Not captured,SSN(826085595),,,Carpinteyro Cabrera,Fernando,,11/12/1986,male,Not captured,Not captured,Not captured,Not captured,Not captured,Not captured,Not captured,Not captured,Not captured,Not captured,Not captured,Not captured,Not captured,,,Not captured,Not captured,Not captured,Not captured,Calle Vicente Guerrero 1980,,Ciudad Juarez,Chihuahua,32599,9153091241,,Not captured,Not captured,carrie.carpinteyro@gmail.com,Not captured,802048710,,Not captured,Not captured,Not captured,Not captured,Not captured,Not captured,
Not captured,Not captured,07/14/2020,07/12/2021,Not captured,Not captured,863949,020,00072,ARS-03-0056141,Essential America,Not captured,Not captured,Not captured,,SSN(704250177),Dependant,Carpinteyro,Milena,Bree,12/12/2013,female,Not captured,Not captured,Not captured,Not captured,Not captured,Not captured,Not captured,Not captured,Not captured,Not captured,Not captured,Not captured,Not captured,,,Not captured,Not captured,Not captured,Not captured,Calle Vicente Guerrero 1980,,Ciudad Juarez,Chihuahua,32599,9153091241,,Not captured,Not captured,carrie.carpinteyro@gmail.com,Not captured,,802048711,Not captured,Not captured,Not captured,Not captured,Not captured,Not captured,
Not captured,Not captured,07/14/2020,07/12/2021,Not captured,Not captured,863949,020,00072,ARS-03-0056141,Essential America,Not captured,Not captured,Not captured,,SSN(270899326),Dependant,Carpinteyro,Gael,Fernando,11/21/2016,male,Not captured,Not captured,Not captured,Not captured,Not captured,Not captured,Not captured,Not captured,Not captured,Not captured,Not captured,Not captured,Not captured,,,Not captured,Not captured,Not captured,Not captured,Calle Vicente Guerrero 1980,,Ciudad Juarez,Chihuahua,32599,9153091241,,Not captured,Not captured,carrie.carpinteyro@gmail.com,Not captured,,802048712,Not captured,Not captured,Not captured,Not captured,Not captured,Not captured,
Not captured,Not captured,07/14/2020,07/12/2021,Not captured,Not captured,863949,020,00072,ARS-03-0056141,Essential America,Not captured,Not captured,Not captured,,SSN(735222207),Dependant,Carpinteyro,Alessia ,Rose,10/17/2019,female,Not captured,Not captured,Not captured,Not captured,Not captured,Not captured,Not captured,Not captured,Not captured,Not captured,Not captured,Not captured,Not captured,,,Not captured,Not captured,Not captured,Not captured,Calle Vicente Guerrero 1980,,Ciudad Juarez,Chihuahua,32599,9153091241,,Not captured,Not captured,carrie.carpinteyro@gmail.com,Not captured,,802048713,Not captured,Not captured,Not captured,Not captured,Not captured,Not captured,
Not captured,Not captured,07/13/2020,09/10/2020,Not captured,Not captured,863949,020,00072,OVI-41-0056249,Overseas Visitors Insurance Plan A,Not captured,Not captured,Not captured,Passport(078601620),,,Atencio de Montero,Lastenia,L,05/20/1953,female,Not captured,Not captured,Not captured,Not captured,Not captured,Not captured,Not captured,Not captured,Not captured,Not captured,Not captured,Not captured,Not captured,,,Not captured,Not captured,Not captured,Not captured,2718 S Gary Dr,,Tulsa,Oklahoma,74114,9188552410,,Not captured,Not captured,alexander.montero@alumni.ou.edu,Not captured,802048919,,Not captured,Not captured,Not captured,Not captured,Not captured,Not captured,
Not captured,Not captured,07/13/2020,09/10/2020,Not captured,Not captured,863949,020,00072,OVI-41-0056248,Overseas Visitors Insurance Plan A,Not captured,Not captured,Not captured,Passport(081551682),,,Montero,Alexander,,12/21/1950,male,Not captured,Not captured,Not captured,Not captured,Not captured,Not captured,Not captured,Not captured,Not captured,Not captured,Not captured,Not captured,Not captured,,,Not captured,Not captured,Not captured,Not captured,2718 S Gary Dr,,Tulsa,Oklahoma,74114,9188552410,,Not captured,Not captured,alexander.montero@alumni.ou.edu,Not captured,802048918,,Not captured,Not captured,Not captured,Not captured,Not captured,Not captured,
Not captured,Not captured,07/13/2020,10/31/2020,Not captured,Not captured,863949,020,00072,ARS-02-0056247,Beacon America,Not captured,Not captured,Not captured,Passport(5375437),,,Karakozov,Samson,,03/07/1958,male,Not captured,Not captured,Not captured,Not captured,Not captured,Not captured,Not captured,Not captured,Not captured,Not captured,Not captured,Not captured,Not captured,Dianna Yakovlev,,Not captured,Not captured,Not captured,Not captured,40 Metalurgov - Apt. 167,,Oryol,Oryal,30067,+1-732.616.0100,,Not captured,Not captured,hmargulis@maxencapital.com,Not captured,802048917,,Not captured,Not captured,Not captured,Not captured,Not captured,Not captured,