EE Transaction Type,Dependent Transaction Type,Effective Date,Expiry Date,EE Signature,EE Signature Date,Control,Suffix,Account,Plan Number,Plan Name,Claim Office,Network ID Number,Customer Code,EE SSN,Dependent SSN,Dependent Relationship,Last Name,First Name,Middle Initial,DOB,Gender,Ethnicity,PCP/PCD,PCP/PCD Current Patient,Provider Cap Office Number,COB,Dep Student Indicator,Dep OOA Indicator,EE Prior Coverage Indicator,EE Late Entrant,EE Language Indicator,Hire Date,Earnings,Earnings Frequency,Beneficiary (Last Name First Name MI),Beneficiary Relationship,Continuation of Coverage Expiration Date,Continuation of Coverage Event Date,Continuation of Coverage Length of Coverage,Work Location Zip Code,Street Address Line 1,Street Address Line 2,City,State,Zip Code,Home Phone Number,Work Phone Number,Accept Code,Evidence Code,EE Email Address,Communication Disability Code,EE Alternate ID,Dep Alternate ID,Old Control,Old Suffix,Old Account,New Control,New Suffix,New Account,
Not captured,Not captured,06/30/2020,12/15/2020,Not captured,Not captured,863949,020,00072,ARS-02-0056128,Beacon America,Not captured,Not captured,Not captured,,,,DESAI,NILIMA SUDHIR,,06/26/1961,female,Not captured,Not captured,Not captured,Not captured,Not captured,Not captured,Not captured,Not captured,Not captured,Not captured,Not captured,Not captured,Not captured,ADITI DALIA,Spouse,Not captured,Not captured,Not captured,Not captured,A-64 ABHIJYOT GREENS NEAR SHRI RAVISHANKAR SCHOOL ,,AHMEDABAD,GJ,380015,+1-4085373383,,Not captured,Not captured,aditidesai26@gmail.com,Not captured,802048692,,Not captured,Not captured,Not captured,Not captured,Not captured,Not captured,
Not captured,Not captured,06/30/2020,12/15/2020,Not captured,Not captured,863949,020,00072,ARS-02-0056127,Beacon America,Not captured,Not captured,Not captured,Passport(N4996432),,,DESAI,SUDHIR SHYAMLAL,,01/16/1957,male,Not captured,Not captured,Not captured,Not captured,Not captured,Not captured,Not captured,Not captured,Not captured,Not captured,Not captured,Not captured,Not captured,ADITI DALIA,,Not captured,Not captured,Not captured,Not captured,A-64 ABHIJYOT GREENS NEAR SHRI RAVISHANKAR SCHOOL ,,AHMEDABAD,GJ,380015,+1-4085373383,,Not captured,Not captured,aditidesai26@gmail.com,Not captured,802048691,,Not captured,Not captured,Not captured,Not captured,Not captured,Not captured,
Not captured,Not captured,06/30/2020,08/28/2020,Not captured,Not captured,863949,020,00072,ARS-02-0056125,Beacon America,Not captured,Not captured,Not captured,Passport(C6407097),,,Vo,Thi Le Thuy,,01/18/1959,female,Not captured,Not captured,Not captured,Not captured,Not captured,Not captured,Not captured,Not captured,Not captured,Not captured,Not captured,Not captured,Not captured,,,Not captured,Not captured,Not captured,Not captured,7867 Red Oak Rd,,Lincoln,Nebraska,68516,4022021127,,Not captured,Not captured,duythanh06@gmail.com,Not captured,802048689,,Not captured,Not captured,Not captured,Not captured,Not captured,Not captured,
Not captured,Not captured,06/30/2020,06/28/2021,Not captured,Not captured,863949,020,00072,ARS-03-0056122,Essential America,Not captured,Not captured,Not captured,Passport(M4702824),,,Kondaveeti,Bhavana,,07/21/1994,female,Not captured,Not captured,Not captured,Not captured,Not captured,Not captured,Not captured,Not captured,Not captured,Not captured,Not captured,Not captured,Not captured,,,Not captured,Not captured,Not captured,Not captured,House 2-4-953 Plot 36 B,,Hyderabad,Maharashtra,500035,9729461509,,Not captured,Not captured,Bharati@VisitorsInsurance.com,Not captured,802048685,,Not captured,Not captured,Not captured,Not captured,Not captured,Not captured,
Not captured,Not captured,06/30/2020,07/15/2020,Not captured,Not captured,863949,020,00072,ARS-01-0056123,Beacon International,Not captured,Not captured,Not captured,Passport(142700534),,,Gelves,Eufracio,,08/16/1957,male,Not captured,Not captured,Not captured,Not captured,Not captured,Not captured,Not captured,Not captured,Not captured,Not captured,Not captured,Not captured,Not captured,Magda Salazar De Gelves,ESPOSA,Not captured,Not captured,Not captured,Not captured,14221 SW 120th ST STE 127 33186,,Miami,Florida,33196,3055196255,3053785210,Not captured,Not captured,egelves@live.com,Not captured,802048686,,Not captured,Not captured,Not captured,Not captured,Not captured,Not captured,
Not captured,Not captured,06/29/2020,07/28/2020,Not captured,Not captured,863949,020,00072,ARS-02-0056113,Beacon America,Not captured,Not captured,Not captured,Passport(J4709187),,,DHANDU RAJENDRAN,VIJAYALAKSHMI,,10/01/1956,female,Not captured,Not captured,Not captured,Not captured,Not captured,Not captured,Not captured,Not captured,Not captured,Not captured,Not captured,Not captured,Not captured,Murali K Segu,,Not captured,Not captured,Not captured,Not captured,No 7 Valluvan St,,Chennai,TN,600007,+1-7817081871,+1-7817423323,Not captured,Not captured,murali.segu@gmail.com,Not captured,802048671,,Not captured,Not captured,Not captured,Not captured,Not captured,Not captured,
Not captured,Not captured,06/30/2020,11/19/2020,Not captured,Not captured,863949,020,00072,ARS-02-0056112,Beacon America,Not captured,Not captured,Not captured,Passport(N9302863),,,Prabha,Shashi,,10/01/1968,female,Not captured,Not captured,Not captured,Not captured,Not captured,Not captured,Not captured,Not captured,Not captured,Not captured,Not captured,Not captured,Not captured,FNU Anurag,,Not captured,Not captured,Not captured,Not captured,Flat #547 Rosewood Apartments Sector 13 Pocket A,,New Delhi,DL,110078,+1-7347872017,+1-5138859965,Not captured,Not captured,fanurag@mtu.edu,Not captured,802048670,,Not captured,Not captured,Not captured,Not captured,Not captured,Not captured,
Not captured,Not captured,06/28/2020,09/30/2020,Not captured,Not captured,863949,020,00072,ARS-02-0056111,Beacon America,Not captured,Not captured,Not captured,Passport(L3037817),,,Ramamirtham,Peramu,,06/15/1969,female,Not captured,Not captured,Not captured,Not captured,Not captured,Not captured,Not captured,Not captured,Not captured,Not captured,Not captured,Not captured,Not captured,Siva Iswarya Ramamirtham,,Not captured,Not captured,Not captured,Not captured,New No. 56 Old No. 60 Nattu Subarayan Street,,Chennai,TN,600004,+1-415839607,+1-4155839607,Not captured,Not captured,sivaiswarya@gmail.com,Not captured,802048669,,Not captured,Not captured,Not captured,Not captured,Not captured,Not captured,
Not captured,Not captured,06/30/2020,07/15/2020,Not captured,Not captured,863949,020,00072,ARS-01-0056109,Beacon International,Not captured,Not captured,Not captured,,,,CARVALHO,DAVID,,05/18/1977,male,Not captured,Not captured,Not captured,Not captured,Not captured,Not captured,Not captured,Not captured,Not captured,Not captured,Not captured,Not captured,Not captured,,,Not captured,Not captured,Not captured,Not captured,971 East Broadway,,Stratford,Connecticut,06615,,,Not captured,Not captured,carvalhodavid60@yahoo.com,Not captured,802048667,,Not captured,Not captured,Not captured,Not captured,Not captured,Not captured,
Not captured,Not captured,06/28/2020,08/31/2020,Not captured,Not captured,863949,020,00072,ARS-01-0056108,Beacon International,Not captured,Not captured,Not captured,,,,Sidoui,Max,,08/31/1990,male,Not captured,Not captured,Not captured,Not captured,Not captured,Not captured,Not captured,Not captured,Not captured,Not captured,Not captured,Not captured,Not captured,,,Not captured,Not captured,Not captured,Not captured,3848 bedford ave,,brooklyn,New York,11229,,,Not captured,Not captured,maxsidoui@gmail.com,Not captured,802048666,,Not captured,Not captured,Not captured,Not captured,Not captured,Not captured,
Not captured,Not captured,06/27/2020,12/25/2020,Not captured,Not captured,863949,020,00072,ARS-02-0056104,Beacon America,Not captured,Not captured,Not captured,Passport(L6723630),,,Vaddey,Renuka Sree,,02/02/1961,female,Not captured,Not captured,Not captured,Not captured,Not captured,Not captured,Not captured,Not captured,Not captured,Not captured,Not captured,Not captured,Not captured,Venkata Satish Chaitanya Vaddey,,Not captured,Not captured,Not captured,Not captured,17-1-391/1/2 Bank Officers street,,Hyderabad,TS,500059,+1-2816822015,+1-9724397948,Not captured,Not captured,chaitu07@gmail.com,Not captured,802048657,,Not captured,Not captured,Not captured,Not captured,Not captured,Not captured,
Not captured,Not captured,06/26/2020,07/15/2020,Not captured,Not captured,863949,020,00072,ARS-02-0056099,Beacon America,Not captured,Not captured,Not captured,Passport(ED6760485),,,Zhang,Huimin,,06/22/1964,female,Not captured,Not captured,Not captured,Not captured,Not captured,Not captured,Not captured,Not captured,Not captured,Not captured,Not captured,Not captured,Not captured,Lianyi Zhang,,Not captured,Not captured,Not captured,Not captured,21-301 Binshui Xi Rd,,Tianjin,Tianjin,300384,+1-5189615041,,Not captured,Not captured,zhangmhbuaa@gmail.com,Not captured,802048642,,Not captured,Not captured,Not captured,Not captured,Not captured,Not captured,
Not captured,Not captured,06/26/2020,10/24/2020,Not captured,Not captured,863949,020,00072,ARS-02-0056097,Beacon America,Not captured,Not captured,Not captured,,,,Mi,Erlan,,09/24/1958,female,Not captured,Not captured,Not captured,Not captured,Not captured,Not captured,Not captured,Not captured,Not captured,Not captured,Not captured,Not captured,Not captured,Benjamin Shaw,Spouse,Not captured,Not captured,Not captured,Not captured,No. 184 Xinghezhuang Alley Kongtong District,,Pingliang,Gansu,744000,+1-9033049689,,Not captured,Not captured,benshaw88@gmail.com,Not captured,802048640,,Not captured,Not captured,Not captured,Not captured,Not captured,Not captured,
Not captured,Not captured,06/26/2020,10/24/2020,Not captured,Not captured,863949,020,00072,ARS-02-0056096,Beacon America,Not captured,Not captured,Not captured,Passport(EG8435145),,,Bai,Yingming,,11/11/1953,male,Not captured,Not captured,Not captured,Not captured,Not captured,Not captured,Not captured,Not captured,Not captured,Not captured,Not captured,Not captured,Not captured,Benjamin Shaw,,Not captured,Not captured,Not captured,Not captured,No. 184 Xinghezhuang Alley Kongtong District,,Pingliang,Gansu,744000,+1-9033049689,,Not captured,Not captured,benshaw88@gmail.com,Not captured,802048639,,Not captured,Not captured,Not captured,Not captured,Not captured,Not captured,
Not captured,Not captured,06/26/2020,12/31/2020,Not captured,Not captured,863949,020,00072,ARS-02-0056094,Beacon America,Not captured,Not captured,Not captured,Passport(532223923),,,Spreckley,Roland Max,,09/17/1993,male,Not captured,Not captured,Not captured,Not captured,Not captured,Not captured,Not captured,Not captured,Not captured,Not captured,Not captured,Not captured,Not captured,Justin spreckley,,Not captured,Not captured,Not captured,Not captured,Chynoweth tremaine green,,Pelynt,England,Pl13 2LT,+1-8572180982,,Not captured,Not captured,therollomusic2@gmail.com,Not captured,802048637,,Not captured,Not captured,Not captured,Not captured,Not captured,Not captured,
Not captured,Not captured,06/26/2020,07/25/2020,Not captured,Not captured,863949,020,00072,ARS-02-0056093,Beacon America,Not captured,Not captured,Not captured,Passport(AA0280427),,,Sirotina,Olga,,09/07/1957,female,Not captured,Not captured,Not captured,Not captured,Not captured,Not captured,Not captured,Not captured,Not captured,Not captured,Not captured,Not captured,Not captured,Aleksey Sirotin,,Not captured,Not captured,Not captured,Not captured,C-13 d. 25. kv. 27,,Tashkent,Tashkent,100128,+1-8189430592,,Not captured,Not captured,sogdianan@hotmail.com,Not captured,802048636,,Not captured,Not captured,Not captured,Not captured,Not captured,Not captured,
Not captured,Not captured,06/25/2020,07/26/2020,Not captured,Not captured,863949,020,00072,ARS-02-0056092,Beacon America,Not captured,Not captured,Not captured,,,,Selvan,Prema,,05/20/1967,female,Not captured,Not captured,Not captured,Not captured,Not captured,Not captured,Not captured,Not captured,Not captured,Not captured,Not captured,Not captured,Not captured,Arun Sundar Selvan,Son,Not captured,Not captured,Not captured,Not captured,2701 SW BOILERMAKER RD,,BENTONVILLE,Arkansas,72713,4793218811,,Not captured,Not captured,arunssundar@gmail.com,Not captured,802048635,,Not captured,Not captured,Not captured,Not captured,Not captured,Not captured,
Not captured,Not captured,06/25/2020,07/26/2020,Not captured,Not captured,863949,020,00072,ARS-02-0056091,Beacon America,Not captured,Not captured,Not captured,Passport(S9949218),,,Kamatchi Sundaram,Selvan,,07/07/1960,male,Not captured,Not captured,Not captured,Not captured,Not captured,Not captured,Not captured,Not captured,Not captured,Not captured,Not captured,Not captured,Not captured,Arun Sundar Selvan,Son,Not captured,Not captured,Not captured,Not captured,2701 SW BOILERMAKER RD,,BENTONVILLE,Arkansas,72713,4793218811,,Not captured,Not captured,arunssundar@gmail.com,Not captured,802048634,,Not captured,Not captured,Not captured,Not captured,Not captured,Not captured,
Not captured,Not captured,06/25/2020,07/31/2020,Not captured,Not captured,863949,020,00072,ARS-02-0056090,Beacon America,Not captured,Not captured,Not captured,Passport(ee8886395),,,yao,wenhong,,07/09/1970,female,Not captured,Not captured,Not captured,Not captured,Not captured,Not captured,Not captured,Not captured,Not captured,Not captured,Not captured,Not captured,Not captured,,,Not captured,Not captured,Not captured,Not captured,1045 trinity dr,,menlo park,California,94025,6505152218,,Not captured,Not captured,WANGKEDA228@GMAIL.COM,Not captured,802048633,,Not captured,Not captured,Not captured,Not captured,Not captured,Not captured,
Not captured,Not captured,06/24/2020,07/23/2020,Not captured,Not captured,863949,020,00072,ARS-02-0056085,Beacon America,Not captured,Not captured,Not captured,Passport(M7689752),,,Cheruku,Deepthi,,11/30/1986,female,Not captured,Not captured,Not captured,Not captured,Not captured,Not captured,Not captured,Not captured,Not captured,Not captured,Not captured,Not captured,Not captured,Parikshith Cheruku,,Not captured,Not captured,Not captured,Not captured,Indu Aranya Apts,,Hyderabad,Alabama,500068,+1-4698597100,,Not captured,Not captured,parik.351@gmail.com,Not captured,802048611,,Not captured,Not captured,Not captured,Not captured,Not captured,Not captured,
Not captured,Not captured,06/24/2020,07/04/2020,Not captured,Not captured,863949,020,00072,ARS-01-0056082,Beacon International,Not captured,Not captured,Not captured,,,,Palau Mayrl,Felix,A,08/16/1997,male,Not captured,Not captured,Not captured,Not captured,Not captured,Not captured,Not captured,Not captured,Not captured,Not captured,Not captured,Not captured,Not captured,,,Not captured,Not captured,Not captured,Not captured,329 E 132nd St,,Bronx,New York,10454,,,Not captured,Not captured,jacobfeld@gmail.com,Not captured,802048608,,Not captured,Not captured,Not captured,Not captured,Not captured,Not captured,
Not captured,Not captured,06/24/2020,07/04/2020,Not captured,Not captured,863949,020,00072,ARS-01-0056081,Beacon International,Not captured,Not captured,Not captured,,,,Feld,Jacob,M,05/14/1998,male,Not captured,Not captured,Not captured,Not captured,Not captured,Not captured,Not captured,Not captured,Not captured,Not captured,Not captured,Not captured,Not captured,,,Not captured,Not captured,Not captured,Not captured,329 E 132nd St,,Bronx,New York,10454,,,Not captured,Not captured,jacobfeld@gmail.com,Not captured,802048607,,Not captured,Not captured,Not captured,Not captured,Not captured,Not captured,
Not captured,Not captured,06/24/2020,08/31/2020,Not captured,Not captured,863949,020,00072,ARS-01-0056079,Beacon International,Not captured,Not captured,Not captured,,,,Tsang,Melissa,,03/31/1991,female,Not captured,Not captured,Not captured,Not captured,Not captured,Not captured,Not captured,Not captured,Not captured,Not captured,Not captured,Not captured,Not captured,,,Not captured,Not captured,Not captured,Not captured,177 west 26th Street,,New York,New York,10001,,,Not captured,Not captured,melissa.tsang03@gmail.com,Not captured,802048605,,Not captured,Not captured,Not captured,Not captured,Not captured,Not captured,
Not captured,Not captured,06/22/2020,07/22/2020,Not captured,Not captured,863949,020,00072,ARS-02-0056075,Beacon America,Not captured,Not captured,Not captured,Passport(133007394),,,Cuahonte,Maria Andreina,,04/18/2001,female,Not captured,Not captured,Not captured,Not captured,Not captured,Not captured,Not captured,Not captured,Not captured,Not captured,Not captured,Not captured,Not captured,Roberto Cuahonte,Padre,Not captured,Not captured,Not captured,Not captured,Urb. Palma real Conj. Lomas del Sol Casa # 14 Sector tipuro,,Maturin,Monagas,6201,+584143942121,,Not captured,Not captured,rxcuahonte@hotmail.com,Not captured,802048598,,Not captured,Not captured,Not captured,Not captured,Not captured,Not captured,
Not captured,Not captured,06/25/2020,07/15/2020,Not captured,Not captured,863949,020,00072,ARS-01-0056073,Beacon International,Not captured,Not captured,Not captured,Passport(720261479),,,Ledenev,Vladimir,,10/06/1953,male,Not captured,Not captured,Not captured,Not captured,Not captured,Not captured,Not captured,Not captured,Not captured,Not captured,Not captured,Not captured,Not captured,Anastasia Ledenea,,Not captured,Not captured,Not captured,Not captured,250 East 39 Street 3C,,New York,NY,10016,+1-2126615650,,Not captured,Not captured,vledenev@unis.org,Not captured,802048590,,Not captured,Not captured,Not captured,Not captured,Not captured,Not captured,
Not captured,Not captured,06/28/2020,07/09/2020,Not captured,Not captured,863949,020,00072,ARS-01-0056071,Beacon International,Not captured,Not captured,Not captured,Passport(562242296),,,Montgomery,Katarina Germain,,03/26/1988,female,Not captured,Not captured,Not captured,Not captured,Not captured,Not captured,Not captured,Not captured,Not captured,Not captured,Not captured,Not captured,Not captured,Nabil Mahfoud,Spouse,Not captured,Not captured,Not captured,Not captured,Choueir 801,,Choueir,Metn,502510,+381-621073165,,Not captured,Not captured,wmahfoud26@gmail.com,Not captured,802048585,,Not captured,Not captured,Not captured,Not captured,Not captured,Not captured,
Not captured,Not captured,06/28/2020,07/09/2020,Not captured,Not captured,863949,020,00072,ARS-01-0056070,Beacon International,Not captured,Not captured,Not captured,Passport(0628903),,,Mahfoud,William,,05/19/1985,male,Not captured,Not captured,Not captured,Not captured,Not captured,Not captured,Not captured,Not captured,Not captured,Not captured,Not captured,Not captured,Not captured,Nabil Mahfoud,,Not captured,Not captured,Not captured,Not captured,Choueir 801,,Choueir,Metn,502510,+381-621073165,,Not captured,Not captured,wmahfoud26@gmail.com,Not captured,802048584,,Not captured,Not captured,Not captured,Not captured,Not captured,Not captured,
Not captured,Not captured,06/23/2020,10/13/2020,Not captured,Not captured,863949,020,00072,ARS-02-0056069,Beacon America,Not captured,Not captured,Not captured,,,,Sarode,Seema,S,01/01/1965,female,Not captured,Not captured,Not captured,Not captured,Not captured,Not captured,Not captured,Not captured,Not captured,Not captured,Not captured,Not captured,Not captured,,,Not captured,Not captured,Not captured,Not captured,5105 Watters Branch Dr,,McKinney,TX,75070,,,Not captured,Not captured,kunals30@gmail.com,Not captured,802048583,,Not captured,Not captured,Not captured,Not captured,Not captured,Not captured,
Not captured,Not captured,06/23/2020,10/13/2020,Not captured,Not captured,863949,020,00072,ARS-02-0056068,Beacon America,Not captured,Not captured,Not captured,Passport(N2265957),,,Sarode,Sanjiv,V,01/01/1959,male,Not captured,Not captured,Not captured,Not captured,Not captured,Not captured,Not captured,Not captured,Not captured,Not captured,Not captured,Not captured,Not captured,,,Not captured,Not captured,Not captured,Not captured,5105 Watters Branch Dr,,McKinney,TX,75070,,,Not captured,Not captured,kunals30@gmail.com,Not captured,802048582,,Not captured,Not captured,Not captured,Not captured,Not captured,Not captured,
Not captured,Not captured,06/22/2020,07/22/2020,Not captured,Not captured,863949,020,00072,ARS-01-0056067,Beacon International,Not captured,Not captured,Not captured,,,,Landau ,Salomon,,03/01/2019,male,Not captured,Not captured,Not captured,Not captured,Not captured,Not captured,Not captured,Not captured,Not captured,Not captured,Not captured,Not captured,Not captured,,,Not captured,Not captured,Not captured,Not captured,2 lublin way ,,Monroe,New York,10950,8455457857,,Not captured,Not captured,landau545@gmail.com,Not captured,802048581,,Not captured,Not captured,Not captured,Not captured,Not captured,Not captured,
Not captured,Not captured,06/21/2020,07/20/2020,Not captured,Not captured,863949,020,00072,ARS-02-0056066,Beacon America,Not captured,Not captured,Not captured,Passport(J6830706),,,Rangoonwala,Sharifa Abidali,,07/01/1957,female,Not captured,Not captured,Not captured,Not captured,Not captured,Not captured,Not captured,Not captured,Not captured,Not captured,Not captured,Not captured,Not captured,Jamila Abidali Rangoonwala,,Not captured,Not captured,Not captured,Not captured,8 Alimuddin Street,,Kolkata,WB,700016,+1-5088183675,+1-2024170102,Not captured,Not captured,mustufa84@yahoo.com,Not captured,802048580,,Not captured,Not captured,Not captured,Not captured,Not captured,Not captured,
Not captured,Not captured,06/21/2020,07/20/2020,Not captured,Not captured,863949,020,00072,ARS-02-0056065,Beacon America,Not captured,Not captured,Not captured,,,,Gold,Aaron,J,10/20/1989,male,Not captured,Not captured,Not captured,Not captured,Not captured,Not captured,Not captured,Not captured,Not captured,Not captured,Not captured,Not captured,Not captured,,,Not captured,Not captured,Not captured,Not captured,99 John Street,,New York,New York,10038,,,Not captured,Not captured,aaron.gold@gmail.com,Not captured,802048579,,Not captured,Not captured,Not captured,Not captured,Not captured,Not captured,
Not captured,Not captured,06/21/2020,08/01/2020,Not captured,Not captured,863949,020,00072,ARS-02-0056064,Beacon America,Not captured,Not captured,Not captured,,,,Scott,Amie,M,06/08/1981,female,Not captured,Not captured,Not captured,Not captured,Not captured,Not captured,Not captured,Not captured,Not captured,Not captured,Not captured,Not captured,Not captured,,,Not captured,Not captured,Not captured,Not captured,99 John Street,,New York,New York,10038,,,Not captured,Not captured,amie.marie.scott@gmail.com,Not captured,802048578,,Not captured,Not captured,Not captured,Not captured,Not captured,Not captured,
Not captured,Not captured,06/21/2020,09/20/2020,Not captured,Not captured,863949,020,00072,ARS-02-0056063,Beacon America,Not captured,Not captured,Not captured,Passport(U7111992),,,Jha,Shushila,,08/24/1955,female,Not captured,Not captured,Not captured,Not captured,Not captured,Not captured,Not captured,Not captured,Not captured,Not captured,Not captured,Not captured,Not captured,Abhay Jha,,Not captured,Not captured,Not captured,Not captured,Plot KW10 Phase 3 Road 2 Vastu Vihar,,Bokaro Steel City,JS,827013,+1-6504412823,,Not captured,Not captured,abhaykj@gmail.com,Not captured,802048577,,Not captured,Not captured,Not captured,Not captured,Not captured,Not captured,