EE Transaction Type,Dependent Transaction Type,Effective Date,Expiry Date,EE Signature,EE Signature Date,Control,Suffix,Account,Plan Number,Plan Name,Claim Office,Network ID Number,Customer Code,EE SSN,Dependent SSN,Dependent Relationship,Last Name,First Name,Middle Initial,DOB,Gender,Ethnicity,PCP/PCD,PCP/PCD Current Patient,Provider Cap Office Number,COB,Dep Student Indicator,Dep OOA Indicator,EE Prior Coverage Indicator,EE Late Entrant,EE Language Indicator,Hire Date,Earnings,Earnings Frequency,Beneficiary (Last Name First Name MI),Beneficiary Relationship,Continuation of Coverage Expiration Date,Continuation of Coverage Event Date,Continuation of Coverage Length of Coverage,Work Location Zip Code,Street Address Line 1,Street Address Line 2,City,State,Zip Code,Home Phone Number,Work Phone Number,Accept Code,Evidence Code,EE Email Address,Communication Disability Code,EE Alternate ID,Dep Alternate ID,Old Control,Old Suffix,Old Account,New Control,New Suffix,New Account,
Not captured,Not captured,06/21/2020,07/20/2020,Not captured,Not captured,863949,020,00072,ARS-02-0056066,Beacon America,Not captured,Not captured,Not captured,Passport(J6830706),,,Rangoonwala,Sharifa Abidali,,07/01/1957,female,Not captured,Not captured,Not captured,Not captured,Not captured,Not captured,Not captured,Not captured,Not captured,Not captured,Not captured,Not captured,Not captured,Jamila Abidali Rangoonwala,,Not captured,Not captured,Not captured,Not captured,8 Alimuddin Street,,Kolkata,WB,700016,+1-5088183675,+1-2024170102,Not captured,Not captured,mustufa84@yahoo.com,Not captured,802048580,,Not captured,Not captured,Not captured,Not captured,Not captured,Not captured,
Not captured,Not captured,06/21/2020,07/20/2020,Not captured,Not captured,863949,020,00072,ARS-02-0056065,Beacon America,Not captured,Not captured,Not captured,,,,Gold,Aaron,J,10/20/1989,male,Not captured,Not captured,Not captured,Not captured,Not captured,Not captured,Not captured,Not captured,Not captured,Not captured,Not captured,Not captured,Not captured,,,Not captured,Not captured,Not captured,Not captured,99 John Street,,New York,New York,10038,,,Not captured,Not captured,aaron.gold@gmail.com,Not captured,802048579,,Not captured,Not captured,Not captured,Not captured,Not captured,Not captured,
Not captured,Not captured,06/21/2020,08/01/2020,Not captured,Not captured,863949,020,00072,ARS-02-0056064,Beacon America,Not captured,Not captured,Not captured,,,,Scott,Amie,M,06/08/1981,female,Not captured,Not captured,Not captured,Not captured,Not captured,Not captured,Not captured,Not captured,Not captured,Not captured,Not captured,Not captured,Not captured,,,Not captured,Not captured,Not captured,Not captured,99 John Street,,New York,New York,10038,,,Not captured,Not captured,amie.marie.scott@gmail.com,Not captured,802048578,,Not captured,Not captured,Not captured,Not captured,Not captured,Not captured,
Not captured,Not captured,06/21/2020,09/20/2020,Not captured,Not captured,863949,020,00072,ARS-02-0056063,Beacon America,Not captured,Not captured,Not captured,Passport(U7111992),,,Jha,Shushila,,08/24/1955,female,Not captured,Not captured,Not captured,Not captured,Not captured,Not captured,Not captured,Not captured,Not captured,Not captured,Not captured,Not captured,Not captured,Abhay Jha,,Not captured,Not captured,Not captured,Not captured,Plot KW10 Phase 3 Road 2 Vastu Vihar,,Bokaro Steel City,JS,827013,+1-6504412823,,Not captured,Not captured,abhaykj@gmail.com,Not captured,802048577,,Not captured,Not captured,Not captured,Not captured,Not captured,Not captured,
Not captured,Not captured,06/20/2020,07/10/2020,Not captured,Not captured,863949,020,00072,ARS-02-0056062,Beacon America,Not captured,Not captured,Not captured,Passport(G46566445),,,Tao,Liping,,01/10/1970,female,Not captured,Not captured,Not captured,Not captured,Not captured,Not captured,Not captured,Not captured,Not captured,Not captured,Not captured,Not captured,Not captured,Lingbin Cai,,Not captured,Not captured,Not captured,Not captured,North Zhongshan Road #200-2 06 0601,,Nanjing,Jiangsu,210009,+1-2158133145,,Not captured,Not captured,raphael0930@hotmail.com,Not captured,802048576,,Not captured,Not captured,Not captured,Not captured,Not captured,Not captured,
Not captured,Not captured,06/20/2020,05/31/2021,Not captured,Not captured,863949,020,00072,ARS-02-0056061,Beacon America,Not captured,Not captured,Not captured,Passport(4933715),,,Guerrero Palomino,Carolina Andrea,,07/29/1994,female,Not captured,Not captured,Not captured,Not captured,Not captured,Not captured,Not captured,Not captured,Not captured,Not captured,Not captured,Not captured,Not captured,Sara Melissa Mullens,,Not captured,Not captured,Not captured,Not captured,470/ERNESTO LOPEZ MINDREAU,,LIMA,LIMA,15045,+1-6366286445,,Not captured,Not captured,carolinaguerrero.29@gmail.com,Not captured,802048575,,Not captured,Not captured,Not captured,Not captured,Not captured,Not captured,
Not captured,Not captured,06/21/2020,08/31/2020,Not captured,Not captured,863949,020,00072,ARS-02-0056060,Beacon America,Not captured,Not captured,Not captured,Passport(081543924),,,GONZALEZ PARRA,MARIA LAURA,,07/21/1998,female,Not captured,Not captured,Not captured,Not captured,Not captured,Not captured,Not captured,Not captured,Not captured,Not captured,Not captured,Not captured,Not captured,FREDDY GONZALEZ,,Not captured,Not captured,Not captured,Not captured,CALLE C QTA LAS VIOLETAS URB EL ROCIO EL HATILLO,,CARACAS,MIRANDA,1083,+1-9049822445,,Not captured,Not captured,gonzal1@me.com,Not captured,802048574,,Not captured,Not captured,Not captured,Not captured,Not captured,Not captured,
Not captured,Not captured,06/21/2020,08/31/2020,Not captured,Not captured,863949,020,00072,ARS-02-0056059,Beacon America,Not captured,Not captured,Not captured,Passport(E73484628),,,FENG,YIWEN,,03/16/1977,male,Not captured,Not captured,Not captured,Not captured,Not captured,Not captured,Not captured,Not captured,Not captured,Not captured,Not captured,Not captured,Not captured,HONG AN,,Not captured,Not captured,Not captured,Not captured,73# ZHUGUANG RD 1188,,SHANGHAI,Massachusetts,201702,+1-6178521889,+86-13585988649,Not captured,Not captured,itsufumi@163.com,Not captured,802048573,,Not captured,Not captured,Not captured,Not captured,Not captured,Not captured,
Not captured,Not captured,06/20/2020,07/22/2020,Not captured,Not captured,863949,020,00072,OVI-41-0056056,Overseas Visitors Insurance Plan A,Not captured,Not captured,Not captured,Passport(L8438084),,,Shah,Madhuri,H,03/02/1954,female,Not captured,Not captured,Not captured,Not captured,Not captured,Not captured,Not captured,Not captured,Not captured,Not captured,Not captured,Not captured,Not captured,Kalpesh Harendra Shah,Son,Not captured,Not captured,Not captured,Not captured,8537 Sandpiper Ridge Ave,,Tampa,Florida,33647,8139431007,,Not captured,Not captured,kalpeshmail@gmail.com,Not captured,802048570,,Not captured,Not captured,Not captured,Not captured,Not captured,Not captured,
Not captured,Not captured,06/20/2020,07/22/2020,Not captured,Not captured,863949,020,00072,OVI-41-0056055,Overseas Visitors Insurance Plan A,Not captured,Not captured,Not captured,Passport(L9723625),,,Shah,Harendra,B,03/10/1949,male,Not captured,Not captured,Not captured,Not captured,Not captured,Not captured,Not captured,Not captured,Not captured,Not captured,Not captured,Not captured,Not captured,Kalpesh Harendra Shah,Son,Not captured,Not captured,Not captured,Not captured,8537 Sandpiper Ridge Ave,,Tampa,Florida,33647,8139431007,,Not captured,Not captured,kalpeshmail@gmail.com,Not captured,802048569,,Not captured,Not captured,Not captured,Not captured,Not captured,Not captured,
Not captured,Not captured,06/19/2020,07/11/2020,Not captured,Not captured,863949,020,00072,ARS-02-0056048,Beacon America,Not captured,Not captured,Not captured,,,,Gurusamy,Thangalakshmi,,05/06/1967,female,Not captured,Not captured,Not captured,Not captured,Not captured,Not captured,Not captured,Not captured,Not captured,Not captured,Not captured,Not captured,Not captured,Divya Anandhi Thangarajan,Spouse,Not captured,Not captured,Not captured,Not captured,Plot No 11 Door No 5 Chandran St,,Chennai,TN,600064,+1-6128593646,,Not captured,Not captured,aravinth.chaingang@gmail.com,Not captured,802048552,,Not captured,Not captured,Not captured,Not captured,Not captured,Not captured,
Not captured,Not captured,06/19/2020,07/11/2020,Not captured,Not captured,863949,020,00072,ARS-02-0056047,Beacon America,Not captured,Not captured,Not captured,Passport(J8546570),,,Sethuramalingam,Thangarajan,,10/21/1965,male,Not captured,Not captured,Not captured,Not captured,Not captured,Not captured,Not captured,Not captured,Not captured,Not captured,Not captured,Not captured,Not captured,Divya Anandhi Thangarajan,,Not captured,Not captured,Not captured,Not captured,Plot No 11 Door No 5 Chandran St,,Chennai,TN,600064,+1-6128593646,,Not captured,Not captured,aravinth.chaingang@gmail.com,Not captured,802048551,,Not captured,Not captured,Not captured,Not captured,Not captured,Not captured,
Not captured,Not captured,06/19/2020,01/05/2021,Not captured,Not captured,863949,020,00072,ARS-02-0056046,Beacon America,Not captured,Not captured,Not captured,Passport(05880895),,,Maharjan,Gyani,,04/22/1968,female,Not captured,Not captured,Not captured,Not captured,Not captured,Not captured,Not captured,Not captured,Not captured,Not captured,Not captured,Not captured,Not captured,Rabita,,Not captured,Not captured,Not captured,Not captured,samjhana tole,,lalitpur,NY,44700,+1-3477401721,+1-3477401721,Not captured,Not captured,itzzruby@hotmail.com,Not captured,802048550,,Not captured,Not captured,Not captured,Not captured,Not captured,Not captured,
Not captured,Not captured,06/19/2020,06/21/2020,Not captured,Not captured,863949,020,00072,ARS-02-0056044,Beacon America,Not captured,Not captured,Not captured,Passport(U14272515),,,Tilov,Sevim,,03/01/1952,female,Not captured,Not captured,Not captured,Not captured,Not captured,Not captured,Not captured,Not captured,Not captured,Not captured,Not captured,Not captured,Not captured,MESUT TILOV,,Not captured,Not captured,Not captured,Not captured,11 Hunkar Sokak,,Istanbul,ISTANBUL,33009,+1-6468841540,+1-6468841540,Not captured,Not captured,edagulux@gmail.com,Not captured,802048548,,Not captured,Not captured,Not captured,Not captured,Not captured,Not captured,
Not captured,Not captured,06/18/2020,10/31/2020,Not captured,Not captured,863949,020,00072,OVI-42-0056039,Overseas Visitors Insurance Plan B,Not captured,Not captured,Not captured,Passport(AN5576435),,,GIOVANI,THEODORA,,04/29/1956,female,Not captured,Not captured,Not captured,Not captured,Not captured,Not captured,Not captured,Not captured,Not captured,Not captured,Not captured,Not captured,Not captured,MARIA GIOVANI,DAUGHTER,Not captured,Not captured,Not captured,Not captured,2014 SOUTH OAKLAND STREET,,AURORA,,80014,7202124176,,Not captured,Not captured,YKOUSTENIS@GMAIL.COM,Not captured,802048541,,Not captured,Not captured,Not captured,Not captured,Not captured,Not captured,
Not captured,Not captured,06/18/2020,06/24/2020,Not captured,Not captured,863949,020,00072,ARS-02-0056034,Beacon America,Not captured,Not captured,Not captured,,,,Selvan,Prema,,05/20/1967,female,Not captured,Not captured,Not captured,Not captured,Not captured,Not captured,Not captured,Not captured,Not captured,Not captured,Not captured,Not captured,Not captured,,,Not captured,Not captured,Not captured,Not captured,2701 SW BOILERMAKER RD,,BENTONVILLE,Arkansas,72713,4793218811,,Not captured,Not captured,arunssundar@gmail.com,Not captured,802048531,,Not captured,Not captured,Not captured,Not captured,Not captured,Not captured,
Not captured,Not captured,06/18/2020,06/24/2020,Not captured,Not captured,863949,020,00072,ARS-02-0056033,Beacon America,Not captured,Not captured,Not captured,,,,Kamatchi Sundaram,Selvan,,07/07/1960,male,Not captured,Not captured,Not captured,Not captured,Not captured,Not captured,Not captured,Not captured,Not captured,Not captured,Not captured,Not captured,Not captured,,,Not captured,Not captured,Not captured,Not captured,2701 SW BOILERMAKER RD,,BENTONVILLE,Arkansas,72713,4793218811,,Not captured,Not captured,arunssundar@gmail.com,Not captured,802048530,,Not captured,Not captured,Not captured,Not captured,Not captured,Not captured,
Not captured,Not captured,06/19/2020,06/27/2020,Not captured,Not captured,863949,020,00072,ARS-02-0056032,Beacon America,Not captured,Not captured,Not captured,,,,Landeros,Martha,,06/28/1964,female,Not captured,Not captured,Not captured,Not captured,Not captured,Not captured,Not captured,Not captured,Not captured,Not captured,Not captured,Not captured,Not captured,,,Not captured,Not captured,Not captured,Not captured,Juan Jose Eguiara Num 93 Colonial Iztacalco,,Mexico City,,08200,,,Not captured,Not captured,fhernanda409@gmail.com,Not captured,802048529,,Not captured,Not captured,Not captured,Not captured,Not captured,Not captured,
Not captured,Not captured,06/19/2020,06/27/2020,Not captured,Not captured,863949,020,00072,ARS-02-0056031,Beacon America,Not captured,Not captured,Not captured,,,,Martinez,Fernanda,,11/28/1994,female,Not captured,Not captured,Not captured,Not captured,Not captured,Not captured,Not captured,Not captured,Not captured,Not captured,Not captured,Not captured,Not captured,,,Not captured,Not captured,Not captured,Not captured,Juan Jose Eguiara Num 93 Colonial Iztacalco,,Mexico City,,08200,,,Not captured,Not captured,fhernanda409@gmail.com,Not captured,802048528,,Not captured,Not captured,Not captured,Not captured,Not captured,Not captured,
Not captured,Not captured,06/19/2020,08/17/2020,Not captured,Not captured,863949,020,00072,OVI-28-0056030,OverseasCare Visitors Insurance Plan,Not captured,Not captured,Not captured,Passport(PE113941),,,Zuniga,Guillermo ,,09/26/1968,male,Not captured,Not captured,Not captured,Not captured,Not captured,Not captured,Not captured,Not captured,Not captured,Not captured,Not captured,Not captured,Not captured,Tatiana Alarcon ,Spouse ,Not captured,Not captured,Not captured,Not captured,Snug Harbor,,Providenciales,Providenciales,TKCA1ZZ,16492418523,,Not captured,Not captured,guillermozs@gmail.com,Not captured,802048527,,Not captured,Not captured,Not captured,Not captured,Not captured,Not captured,
Not captured,Not captured,06/17/2020,08/01/2020,Not captured,Not captured,863949,020,00072,ARS-02-0056027,Beacon America,Not captured,Not captured,Not captured,Passport(P0495155),,,Chelliah Nadar,Saroja Bai,,11/20/1955,female,Not captured,Not captured,Not captured,Not captured,Not captured,Not captured,Not captured,Not captured,Not captured,Not captured,Not captured,Not captured,Not captured,Beulah Mary Jacob,,Not captured,Not captured,Not captured,Not captured,Bethel Illam,,Chennai,TN,600119,+1-4792023039,,Not captured,Not captured,arsudhan@gmail.com,Not captured,802048519,,Not captured,Not captured,Not captured,Not captured,Not captured,Not captured,
Not captured,Not captured,06/16/2020,07/12/2020,Not captured,Not captured,863949,020,00072,ARS-02-0056023,Beacon America,Not captured,Not captured,Not captured,Passport(T3991840),,,Hangekar,Tanwi Rohan,,12/31/1989,female,Not captured,Not captured,Not captured,Not captured,Not captured,Not captured,Not captured,Not captured,Not captured,Not captured,Not captured,Not captured,Not captured,Rohan Hangekar,,Not captured,Not captured,Not captured,Not captured,457 Plains Road East Unit 217,,Burlington,ON,L7T 0B8,+1-9192748560,,Not captured,Not captured,tanwikulkarni@gmail.com,Not captured,802048514,,Not captured,Not captured,Not captured,Not captured,Not captured,Not captured,
Not captured,Not captured,06/16/2020,10/31/2020,Not captured,Not captured,863949,020,00072,ARS-02-0056022,Beacon America,Not captured,Not captured,Not captured,Passport(G49677952),,,Ye,Jing,,07/05/1963,female,Not captured,Not captured,Not captured,Not captured,Not captured,Not captured,Not captured,Not captured,Not captured,Not captured,Not captured,Not captured,Not captured,Yi Ma,,Not captured,Not captured,Not captured,Not captured,Yadutianyuan,,TEDA,Tianjin,300450,+1-3128819118,,Not captured,Not captured,maya900508@hotmail.com,Not captured,802048513,,Not captured,Not captured,Not captured,Not captured,Not captured,Not captured,
Not captured,Not captured,06/17/2020,08/01/2020,Not captured,Not captured,863949,020,00072,ARS-01-0056021,Beacon International,Not captured,Not captured,Not captured,Passport(545804423),,,Loudon,Cedric,,05/24/2011,male,Not captured,Not captured,Not captured,Not captured,Not captured,Not captured,Not captured,Not captured,Not captured,Not captured,Not captured,Not captured,Not captured,William Loudon,father,Not captured,Not captured,Not captured,Not captured,69 Falcon Dr,,Elmira,Ontario,N3B3H8,4696097241,,Not captured,Not captured,billloudon@hotmail.com,Not captured,802048512,,Not captured,Not captured,Not captured,Not captured,Not captured,Not captured,
Not captured,Not captured,06/16/2020,09/06/2020,Not captured,Not captured,863949,020,00072,ARS-01-0056020,Beacon International,Not captured,Not captured,Not captured,,,,Schmidt,Romeo Justin,,08/10/2018,male,Not captured,Not captured,Not captured,Not captured,Not captured,Not captured,Not captured,Not captured,Not captured,Not captured,Not captured,Not captured,Not captured,Christian,Dependent,Not captured,Not captured,Not captured,Not captured,2130 44th Drive,,LIC,NY,11101,+1-9293028421,+1-9293027983,Not captured,Not captured,ipsik@icloud.com,Not captured,802048511,,Not captured,Not captured,Not captured,Not captured,Not captured,Not captured,
Not captured,Not captured,06/16/2020,09/06/2020,Not captured,Not captured,863949,020,00072,ARS-01-0056019,Beacon International,Not captured,Not captured,Not captured,Passport(530695551),,,Ivanova,Anna,,10/13/1985,female,Not captured,Not captured,Not captured,Not captured,Not captured,Not captured,Not captured,Not captured,Not captured,Not captured,Not captured,Not captured,Not captured,Christian,,Not captured,Not captured,Not captured,Not captured,2130 44th Drive,,LIC,NY,11101,+1-9293028421,+1-9293027983,Not captured,Not captured,ipsik@icloud.com,Not captured,802048510,,Not captured,Not captured,Not captured,Not captured,Not captured,Not captured,
Not captured,Not captured,06/16/2020,06/30/2020,Not captured,Not captured,863949,020,00072,ARS-02-0056018,Beacon America,Not captured,Not captured,Not captured,,,,Rubina,Nataliia,,11/16/1963,female,Not captured,Not captured,Not captured,Not captured,Not captured,Not captured,Not captured,Not captured,Not captured,Not captured,Not captured,Not captured,Not captured,Irina Rubina,Spouse,Not captured,Not captured,Not captured,Not captured,Varshavskay ul. bld. 23-3,,Saint-Petersburg,Saint-Petersburg,196215,+1-6692248825,,Not captured,Not captured,rubina_natalia@mail.ru,Not captured,802048509,,Not captured,Not captured,Not captured,Not captured,Not captured,Not captured,
Not captured,Not captured,06/16/2020,06/30/2020,Not captured,Not captured,863949,020,00072,ARS-02-0056017,Beacon America,Not captured,Not captured,Not captured,Passport(717285597),,,Rubin,Semen,,09/17/1959,male,Not captured,Not captured,Not captured,Not captured,Not captured,Not captured,Not captured,Not captured,Not captured,Not captured,Not captured,Not captured,Not captured,Irina Rubina,,Not captured,Not captured,Not captured,Not captured,Varshavskay ul. bld. 23-3,,Saint-Petersburg,Saint-Petersburg,196215,+1-6692248825,,Not captured,Not captured,rubina_natalia@mail.ru,Not captured,802048508,,Not captured,Not captured,Not captured,Not captured,Not captured,Not captured,
Not captured,Not captured,06/16/2020,06/14/2021,Not captured,Not captured,863949,020,00072,ARS-03-0056009,Essential America,Not captured,Not captured,Not captured,Passport(P3554190B),,,Sollano,Junrey,Patoy,03/01/1989,male,Not captured,Not captured,Not captured,Not captured,Not captured,Not captured,Not captured,Not captured,Not captured,Not captured,Not captured,Not captured,Not captured,,,Not captured,Not captured,Not captured,Not captured,Purok Irene Poblacion,,Sominot,Zamboanga Del Sur,7022,8325739544,,Not captured,Not captured,kennharv@javelinamail.com,Not captured,802048479,,Not captured,Not captured,Not captured,Not captured,Not captured,Not captured,
Not captured,Not captured,06/17/2020,07/16/2020,Not captured,Not captured,863949,020,00072,ARS-02-0056015,Beacon America,Not captured,Not captured,Not captured,,,,JAISAWAL,Meera,,01/01/1964,female,Not captured,Not captured,Not captured,Not captured,Not captured,Not captured,Not captured,Not captured,Not captured,Not captured,Not captured,Not captured,Not captured,Deepak Kumar Jaiswal,Spouse,Not captured,Not captured,Not captured,Not captured,Omkar Vatika Colony,,padrauna,California,274304,+1-8586637584,,Not captured,Not captured,djaiswal.deepak@gmail.com,Not captured,802048488,,Not captured,Not captured,Not captured,Not captured,Not captured,Not captured,
Not captured,Not captured,06/17/2020,07/16/2020,Not captured,Not captured,863949,020,00072,ARS-02-0056014,Beacon America,Not captured,Not captured,Not captured,Passport(T0286565),,,Jaiswal,Krishana Kumar,,06/30/1957,male,Not captured,Not captured,Not captured,Not captured,Not captured,Not captured,Not captured,Not captured,Not captured,Not captured,Not captured,Not captured,Not captured,Deepak Kumar Jaiswal,,Not captured,Not captured,Not captured,Not captured,Omkar Vatika Colony,,padrauna,California,274304,+1-8586637584,,Not captured,Not captured,djaiswal.deepak@gmail.com,Not captured,802048487,,Not captured,Not captured,Not captured,Not captured,Not captured,Not captured,
Not captured,Not captured,06/20/2020,08/31/2020,Not captured,Not captured,863949,020,00072,ARS-02-0056013,Beacon America,Not captured,Not captured,Not captured,,,,SRINIVASA SUBRAMANIAN,CHITRA,,01/10/1963,female,Not captured,Not captured,Not captured,Not captured,Not captured,Not captured,Not captured,Not captured,Not captured,Not captured,Not captured,Not captured,Not captured,Vidya Munnirpallam Srinivasasubramanian,Spouse,Not captured,Not captured,Not captured,Not captured,6-2-19 Sri Ganesh Moovendar Nagar 2nd street,,Madurai,TN,625014,+1-5104231013,,Not captured,Not captured,rmragav@gmail.com,Not captured,802048486,,Not captured,Not captured,Not captured,Not captured,Not captured,Not captured,
Not captured,Not captured,06/20/2020,08/31/2020,Not captured,Not captured,863949,020,00072,ARS-02-0056012,Beacon America,Not captured,Not captured,Not captured,Passport(S8534315),,,VENKATARAMAN,SRINIVASA SUBRAMANIAN,,05/27/1957,male,Not captured,Not captured,Not captured,Not captured,Not captured,Not captured,Not captured,Not captured,Not captured,Not captured,Not captured,Not captured,Not captured,Vidya Munnirpallam Srinivasasubramanian,,Not captured,Not captured,Not captured,Not captured,6-2-19 Sri Ganesh Moovendar Nagar 2nd street,,Madurai,TN,625014,+1-5104231013,,Not captured,Not captured,rmragav@gmail.com,Not captured,802048485,,Not captured,Not captured,Not captured,Not captured,Not captured,Not captured,
Not captured,Not captured,06/16/2020,12/01/2020,Not captured,Not captured,863949,020,00072,ARS-02-0056011,Beacon America,Not captured,Not captured,Not captured,Passport(z5163705),,,srinivas,santhosh,,05/14/1985,male,Not captured,Not captured,Not captured,Not captured,Not captured,Not captured,Not captured,Not captured,Not captured,Not captured,Not captured,Not captured,Not captured,Dhanalakshmi,,Not captured,Not captured,Not captured,Not captured,205 Parthu hallmark hagadur road,,Bangalore,KA,560066,+91-9986871830,+1-9012462443,Not captured,Not captured,splashmered@gmail.com,Not captured,802048484,,Not captured,Not captured,Not captured,Not captured,Not captured,Not captured,