EE Transaction Type,Dependent Transaction Type,Effective Date,Expiry Date,EE Signature,EE Signature Date,Control,Suffix,Account,Plan Number,Plan Name,Claim Office,Network ID Number,Customer Code,EE SSN,Dependent SSN,Dependent Relationship,Last Name,First Name,Middle Initial,DOB,Gender,Ethnicity,PCP/PCD,PCP/PCD Current Patient,Provider Cap Office Number,COB,Dep Student Indicator,Dep OOA Indicator,EE Prior Coverage Indicator,EE Late Entrant,EE Language Indicator,Hire Date,Earnings,Earnings Frequency,Beneficiary (Last Name First Name MI),Beneficiary Relationship,Continuation of Coverage Expiration Date,Continuation of Coverage Event Date,Continuation of Coverage Length of Coverage,Work Location Zip Code,Street Address Line 1,Street Address Line 2,City,State,Zip Code,Home Phone Number,Work Phone Number,Accept Code,Evidence Code,EE Email Address,Communication Disability Code,EE Alternate ID,Dep Alternate ID,Old Control,Old Suffix,Old Account,New Control,New Suffix,New Account,
Not captured,Not captured,06/08/2020,06/06/2021,Not captured,Not captured,863949,020,00072,ARS-03-0055912,Essential America,Not captured,Not captured,Not captured,Passport(EH8828840),,,Chen,Yulu,,04/25/2006,female,Not captured,Not captured,Not captured,Not captured,Not captured,Not captured,Not captured,Not captured,Not captured,Not captured,Not captured,Not captured,Not captured,,,Not captured,Not captured,Not captured,Not captured,108 Austree Dr,,Columbia,South Carolina,29229,8034044015,,Not captured,Not captured,xbhuang4@gmail.com,Not captured,802048297,,Not captured,Not captured,Not captured,Not captured,Not captured,Not captured,
Not captured,Not captured,06/08/2020,07/31/2020,Not captured,Not captured,863949,020,00072,ARS-02-0055963,Beacon America,Not captured,Not captured,Not captured,Passport(K0042170),,,Thanikachalam,Shanthi,,01/26/1964,female,Not captured,Not captured,Not captured,Not captured,Not captured,Not captured,Not captured,Not captured,Not captured,Not captured,Not captured,Not captured,Not captured,Kannan Thanikachalam,,Not captured,Not captured,Not captured,Not captured,14 Krishnappa Lay Out,,Krishnagiri,TN,635001,+1-6784622233,,Not captured,Not captured,shanthi.thanikachalam@gmail.com,Not captured,802048358,,Not captured,Not captured,Not captured,Not captured,Not captured,Not captured,
Not captured,Not captured,06/07/2020,09/01/2020,Not captured,Not captured,863949,020,00072,ARS-02-0055962,Beacon America,Not captured,Not captured,Not captured,,,,Ramsay,Benjamin,J,10/01/1990,male,Not captured,Not captured,Not captured,Not captured,Not captured,Not captured,Not captured,Not captured,Not captured,Not captured,Not captured,Not captured,Not captured,,,Not captured,Not captured,Not captured,Not captured,11 Karaka Street,,Otaki,,5512,,,Not captured,Not captured,benny.ramsay@gmail.com,Not captured,802048357,,Not captured,Not captured,Not captured,Not captured,Not captured,Not captured,
Not captured,Not captured,06/07/2020,06/14/2020,Not captured,Not captured,863949,020,00072,ARS-02-0055961,Beacon America,Not captured,Not captured,Not captured,,,,Flores,Luz Abigail,,11/11/2011,female,Not captured,Not captured,Not captured,Not captured,Not captured,Not captured,Not captured,Not captured,Not captured,Not captured,Not captured,Not captured,Not captured,victor flores mora,Dependent,Not captured,Not captured,Not captured,Not captured,coronado la coralia i08,,san jose,san Jose,33768,+1-3213102165,,Not captured,Not captured,vaf77@hotmail.com,Not captured,802048356,,Not captured,Not captured,Not captured,Not captured,Not captured,Not captured,
Not captured,Not captured,06/07/2020,06/14/2020,Not captured,Not captured,863949,020,00072,ARS-02-0055960,Beacon America,Not captured,Not captured,Not captured,,,,flores,Vivian naomi,,04/09/2010,female,Not captured,Not captured,Not captured,Not captured,Not captured,Not captured,Not captured,Not captured,Not captured,Not captured,Not captured,Not captured,Not captured,victor flores mora,Dependent,Not captured,Not captured,Not captured,Not captured,coronado la coralia i08,,san jose,san Jose,33768,+1-3213102165,,Not captured,Not captured,vaf77@hotmail.com,Not captured,802048355,,Not captured,Not captured,Not captured,Not captured,Not captured,Not captured,
Not captured,Not captured,06/07/2020,06/14/2020,Not captured,Not captured,863949,020,00072,ARS-02-0055959,Beacon America,Not captured,Not captured,Not captured,,,,Pereira,Erika tatiana,,07/10/1989,female,Not captured,Not captured,Not captured,Not captured,Not captured,Not captured,Not captured,Not captured,Not captured,Not captured,Not captured,Not captured,Not captured,victor flores mora,Spouse,Not captured,Not captured,Not captured,Not captured,coronado la coralia i08,,san jose,san Jose,33768,+1-3213102165,,Not captured,Not captured,vaf77@hotmail.com,Not captured,802048354,,Not captured,Not captured,Not captured,Not captured,Not captured,Not captured,
Not captured,Not captured,06/07/2020,06/14/2020,Not captured,Not captured,863949,020,00072,ARS-02-0055958,Beacon America,Not captured,Not captured,Not captured,Passport(112550982),,,Flores,Victor,,10/12/1985,male,Not captured,Not captured,Not captured,Not captured,Not captured,Not captured,Not captured,Not captured,Not captured,Not captured,Not captured,Not captured,Not captured,victor flores mora,,Not captured,Not captured,Not captured,Not captured,coronado la coralia i08,,san jose,san Jose,33768,+1-3213102165,,Not captured,Not captured,vaf77@hotmail.com,Not captured,802048353,,Not captured,Not captured,Not captured,Not captured,Not captured,Not captured,
Not captured,Not captured,06/06/2020,08/05/2020,Not captured,Not captured,863949,020,00072,ARS-02-0055957,Beacon America,Not captured,Not captured,Not captured,Passport(k5509077),,,LNU,Laila Shaheen,,11/14/1962,female,Not captured,Not captured,Not captured,Not captured,Not captured,Not captured,Not captured,Not captured,Not captured,Not captured,Not captured,Not captured,Not captured,Saifuddin Syed,,Not captured,Not captured,Not captured,Not captured,9-4-77/n/3 nizam colony,,hyderabad,TS,500008,+1-5513585924,,Not captured,Not captured,syed.engineer619@gmail.com,Not captured,802048352,,Not captured,Not captured,Not captured,Not captured,Not captured,Not captured,
Not captured,Not captured,06/06/2020,07/24/2020,Not captured,Not captured,863949,020,00072,ARS-01-0055956,Beacon International,Not captured,Not captured,Not captured,,,,Nevo,Aviv,,03/16/2004,male,Not captured,Not captured,Not captured,Not captured,Not captured,Not captured,Not captured,Not captured,Not captured,Not captured,Not captured,Not captured,Not captured,,,Not captured,Not captured,Not captured,Not captured,310 Centennial drive,,blue bell,Pennsylvania,19422,,,Not captured,Not captured,anathnevo@gmail.com,Not captured,802048351,,Not captured,Not captured,Not captured,Not captured,Not captured,Not captured,
Not captured,Not captured,06/06/2020,06/27/2020,Not captured,Not captured,863949,020,00072,ARS-01-0055955,Beacon International,Not captured,Not captured,Not captured,,,,Nevo,Anath,,12/24/1973,female,Not captured,Not captured,Not captured,Not captured,Not captured,Not captured,Not captured,Not captured,Not captured,Not captured,Not captured,Not captured,Not captured,,,Not captured,Not captured,Not captured,Not captured,310 Centennial drive,,Blue Bell,Pennsylvania,19422,,,Not captured,Not captured,anathnevo@gmail.com,Not captured,802048350,,Not captured,Not captured,Not captured,Not captured,Not captured,Not captured,
Not captured,Not captured,06/06/2020,09/05/2020,Not captured,Not captured,863949,020,00072,ARS-01-0055954,Beacon International,Not captured,Not captured,Not captured,Passport(564698424),,,Crespo,Alena Middle,,04/01/1999,female,Not captured,Not captured,Not captured,Not captured,Not captured,Not captured,Not captured,Not captured,Not captured,Not captured,Not captured,Not captured,Not captured,Denise Crespo,,Not captured,Not captured,Not captured,Not captured,132 Wilcox Road,,Youngstown,OH,44515,+1-9055802213,+1-7036508483,Not captured,Not captured,alenacrespo4199@gmail.com,Not captured,802048349,,Not captured,Not captured,Not captured,Not captured,Not captured,Not captured,
Not captured,Not captured,06/06/2020,08/10/2020,Not captured,Not captured,863949,020,00072,ARS-02-0055953,Beacon America,Not captured,Not captured,Not captured,Passport(U10801322),,,Kuskonmaz,Gulnaz,,03/17/1959,female,Not captured,Not captured,Not captured,Not captured,Not captured,Not captured,Not captured,Not captured,Not captured,Not captured,Not captured,Not captured,Not captured,Rustu Seyhun Sariyildiz,,Not captured,Not captured,Not captured,Not captured,Sirakapilar Mah. Mimar Sinan Cd.,,DENIZLI,MERKEZEFENDI,20010,+1-6503508549,+1-6503502928,Not captured,Not captured,seyhuns@gmail.com,Not captured,802048348,,Not captured,Not captured,Not captured,Not captured,Not captured,Not captured,
Not captured,Not captured,06/06/2020,08/04/2020,Not captured,Not captured,863949,020,00072,ARS-02-0055952,Beacon America,Not captured,Not captured,Not captured,,,,nagabushanam,chitra,,04/29/1962,female,Not captured,Not captured,Not captured,Not captured,Not captured,Not captured,Not captured,Not captured,Not captured,Not captured,Not captured,Not captured,Not captured,archana nagabushanam,Spouse,Not captured,Not captured,Not captured,Not captured,G-A block 4 bajaj apartments,,chennai,TN,600035,+1-9739001327,,Not captured,Not captured,archana.n@gmail.com,Not captured,802048347,,Not captured,Not captured,Not captured,Not captured,Not captured,Not captured,
Not captured,Not captured,06/06/2020,08/04/2020,Not captured,Not captured,863949,020,00072,ARS-02-0055951,Beacon America,Not captured,Not captured,Not captured,Passport(j5773718),,,Vazhamangala Lakshminarayanan,Nagabushanam,,02/15/1955,male,Not captured,Not captured,Not captured,Not captured,Not captured,Not captured,Not captured,Not captured,Not captured,Not captured,Not captured,Not captured,Not captured,archana nagabushanam,,Not captured,Not captured,Not captured,Not captured,G-A block 4 bajaj apartments,,chennai,TN,600035,+1-9739001327,,Not captured,Not captured,archana.n@gmail.com,Not captured,802048346,,Not captured,Not captured,Not captured,Not captured,Not captured,Not captured,
Not captured,Not captured,06/06/2020,08/03/2020,Not captured,Not captured,863949,020,00072,ARS-02-0055950,Beacon America,Not captured,Not captured,Not captured,Passport(M7808291),,,Chacko,Mani,,01/11/1947,male,Not captured,Not captured,Not captured,Not captured,Not captured,Not captured,Not captured,Not captured,Not captured,Not captured,Not captured,Not captured,Not captured,Nitish James,,Not captured,Not captured,Not captured,Not captured,Puthuenpurayil House Perumpillichira P O,,Thodupuzha,KL,685605,+1-4793812998,,Not captured,Not captured,jamesnitish1@gmail.com,Not captured,802048345,,Not captured,Not captured,Not captured,Not captured,Not captured,Not captured,
Not captured,Not captured,06/06/2020,06/30/2020,Not captured,Not captured,863949,020,00072,ARS-02-0055949,Beacon America,Not captured,Not captured,Not captured,,,,Chee,Wai Wah,,05/15/1958,female,Not captured,Not captured,Not captured,Not captured,Not captured,Not captured,Not captured,Not captured,Not captured,Not captured,Not captured,Not captured,Not captured,Joshua Weijie Loh,Spouse,Not captured,Not captured,Not captured,Not captured,168D Simei Lane #04-66,,Singapore,Singapore,524168,+1-6268405042,,Not captured,Not captured,jwjloh@hotmail.com,Not captured,802048344,,Not captured,Not captured,Not captured,Not captured,Not captured,Not captured,
Not captured,Not captured,06/06/2020,06/30/2020,Not captured,Not captured,863949,020,00072,ARS-02-0055948,Beacon America,Not captured,Not captured,Not captured,Passport(E6235446N),,,Loh,Heng Fatt,,08/25/1953,male,Not captured,Not captured,Not captured,Not captured,Not captured,Not captured,Not captured,Not captured,Not captured,Not captured,Not captured,Not captured,Not captured,Joshua Weijie Loh,,Not captured,Not captured,Not captured,Not captured,168D Simei Lane #04-66,,Singapore,Singapore,524168,+1-6268405042,,Not captured,Not captured,jwjloh@hotmail.com,Not captured,802048343,,Not captured,Not captured,Not captured,Not captured,Not captured,Not captured,
Not captured,Not captured,06/05/2020,08/07/2020,Not captured,Not captured,863949,020,00072,ARS-01-0055946,Beacon International,Not captured,Not captured,Not captured,,,,Davis,Malka,,05/13/2020,female,Not captured,Not captured,Not captured,Not captured,Not captured,Not captured,Not captured,Not captured,Not captured,Not captured,Not captured,Not captured,Not captured,,,Not captured,Not captured,Not captured,Not captured,624 Monroe Ave,,Scranton,Pennsylvania,11510,570-703-9947,,Not captured,Not captured,yogad6@gmail.com,Not captured,802048341,,Not captured,Not captured,Not captured,Not captured,Not captured,Not captured,
Not captured,Not captured,06/06/2020,07/05/2020,Not captured,Not captured,863949,020,00072,ARS-01-0055944,Beacon International,Not captured,Not captured,Not captured,Passport(014889995),,,Aleksic,Nenad,,05/02/1972,male,Not captured,Not captured,Not captured,Not captured,Not captured,Not captured,Not captured,Not captured,Not captured,Not captured,Not captured,Not captured,Not captured,,,Not captured,Not captured,Not captured,Not captured,Guglgasse 8-4-12-76,,Vienna,Wien,1110,436604106329,,Not captured,Not captured,nick.sunchild@live.com,Not captured,802048339,,Not captured,Not captured,Not captured,Not captured,Not captured,Not captured,
Not captured,Not captured,06/04/2020,09/03/2020,Not captured,Not captured,863949,020,00072,ARS-02-0055942,Beacon America,Not captured,Not captured,Not captured,,,,Quadri,Ayesha,,01/10/1956,female,Not captured,Not captured,Not captured,Not captured,Not captured,Not captured,Not captured,Not captured,Not captured,Not captured,Not captured,Not captured,Not captured,Sayyeda Fatima,Spouse,Not captured,Not captured,Not captured,Not captured,10-3-830 / 33 Mehdipatnam,,Hyderabad,TS,500028,+1-8565249114,+1-8565249116,Not captured,Not captured,smq1952@yahoo.com,Not captured,802048336,,Not captured,Not captured,Not captured,Not captured,Not captured,Not captured,
Not captured,Not captured,06/04/2020,09/03/2020,Not captured,Not captured,863949,020,00072,ARS-02-0055941,Beacon America,Not captured,Not captured,Not captured,Passport(Z3584348),,,Ayesha Quadri,Syed Quadri,,02/26/1952,male,Not captured,Not captured,Not captured,Not captured,Not captured,Not captured,Not captured,Not captured,Not captured,Not captured,Not captured,Not captured,Not captured,Sayyeda Fatima,,Not captured,Not captured,Not captured,Not captured,10-3-830 / 33 Mehdipatnam,,Hyderabad,TS,500028,+1-8565249114,+1-8565249116,Not captured,Not captured,smq1952@yahoo.com,Not captured,802048335,,Not captured,Not captured,Not captured,Not captured,Not captured,Not captured,
Not captured,Not captured,06/04/2020,10/14/2020,Not captured,Not captured,863949,020,00072,ARS-02-0055937,Beacon America,Not captured,Not captured,Not captured,Passport(531287300),,,Mayor,Mark James,,07/31/1989,male,Not captured,Not captured,Not captured,Not captured,Not captured,Not captured,Not captured,Not captured,Not captured,Not captured,Not captured,Not captured,Not captured,Lauren Young,,Not captured,Not captured,Not captured,Not captured,Flat 8 Taplow House,,Rainham,England,RM13 9FY,+61-0480163829,,Not captured,Not captured,markjmayor@gmail.com,Not captured,802048331,,Not captured,Not captured,Not captured,Not captured,Not captured,Not captured,
Not captured,Not captured,06/03/2020,06/07/2020,Not captured,Not captured,863949,020,00072,ARS-02-0055934,Beacon America,Not captured,Not captured,Not captured,Passport(E87964710),,,Yang,Jiatong,,11/20/1995,male,Not captured,Not captured,Not captured,Not captured,Not captured,Not captured,Not captured,Not captured,Not captured,Not captured,Not captured,Not captured,Not captured,Xinwen Yang,,Not captured,Not captured,Not captured,Not captured,No.38 Shuige Rd Jiangning District,,Nanjing,Jiangsu,210000,+1-6467055519,,Not captured,Not captured,jy2918@columbia.edu,Not captured,802048324,,Not captured,Not captured,Not captured,Not captured,Not captured,Not captured,
Not captured,Not captured,06/05/2020,07/31/2020,Not captured,Not captured,863949,020,00072,ARS-02-0055931,Beacon America,Not captured,Not captured,Not captured,Passport(EG2148431),,,Zuo,Qiu,,11/06/1971,female,Not captured,Not captured,Not captured,Not captured,Not captured,Not captured,Not captured,Not captured,Not captured,Not captured,Not captured,Not captured,Not captured,Zilun Zhang,,Not captured,Not captured,Not captured,Not captured,G1-1-2204 Shuianxingcheng,,Wuhan,Hubei,430000,+1-8186515685,,Not captured,Not captured,robbenzhang30@gmail.com,Not captured,802048316,,Not captured,Not captured,Not captured,Not captured,Not captured,Not captured,
Not captured,Not captured,06/04/2020,07/11/2020,Not captured,Not captured,863949,020,00072,ARS-02-0055930,Beacon America,Not captured,Not captured,Not captured,,,,Kambalapally,Samyukta Rani,,08/26/1963,female,Not captured,Not captured,Not captured,Not captured,Not captured,Not captured,Not captured,Not captured,Not captured,Not captured,Not captured,Not captured,Not captured,Prashanth Kambalapally,Spouse,Not captured,Not captured,Not captured,Not captured,H. No. 130 North Rd. No. 4 Madhavanagar,,Hyderabad,TS,500079,+1-8155080844,+1-5103098464,Not captured,Not captured,prashanth4sf@gmail.com,Not captured,802048315,,Not captured,Not captured,Not captured,Not captured,Not captured,Not captured,
Not captured,Not captured,06/04/2020,07/11/2020,Not captured,Not captured,863949,020,00072,ARS-02-0055929,Beacon America,Not captured,Not captured,Not captured,Passport(S1967579),,,Kambalapally,Hanumantha Reddy,,08/10/1955,male,Not captured,Not captured,Not captured,Not captured,Not captured,Not captured,Not captured,Not captured,Not captured,Not captured,Not captured,Not captured,Not captured,Prashanth Kambalapally,,Not captured,Not captured,Not captured,Not captured,H. No. 130 North Rd. No. 4 Madhavanagar,,Hyderabad,TS,500079,+1-8155080844,+1-5103098464,Not captured,Not captured,prashanth4sf@gmail.com,Not captured,802048314,,Not captured,Not captured,Not captured,Not captured,Not captured,Not captured,
Not captured,Not captured,06/02/2020,08/31/2020,Not captured,Not captured,863949,020,00072,ARS-02-0055928,Beacon America,Not captured,Not captured,Not captured,Passport(EF0911847),,,Li,Wenyue,,05/09/1996,female,Not captured,Not captured,Not captured,Not captured,Not captured,Not captured,Not captured,Not captured,Not captured,Not captured,Not captured,Not captured,Not captured,Xiaochen Zou,,Not captured,Not captured,Not captured,Not captured,Kashahuayuan Fucheng zone,,Mianyang,Sichuan,621000,+1-9096145873,+1-9093446180,Not captured,Not captured,etenal@outlook.com,Not captured,802048313,,Not captured,Not captured,Not captured,Not captured,Not captured,Not captured,
Not captured,Not captured,06/03/2020,06/26/2020,Not captured,Not captured,863949,020,00072,ARS-01-0055927,Beacon International,Not captured,Not captured,Not captured,Passport(533721652),,,Ghahramani,Adam,A,04/30/1983,male,Not captured,Not captured,Not captured,Not captured,Not captured,Not captured,Not captured,Not captured,Not captured,Not captured,Not captured,Not captured,Not captured,Lili Ghahramani,Mother,Not captured,Not captured,Not captured,Not captured,400 E 71st Street APT 14S,,New York,New York,10021,14134272456,,Not captured,Not captured,adamgha@gmail.com,Not captured,802048312,,Not captured,Not captured,Not captured,Not captured,Not captured,Not captured,
Not captured,Not captured,06/06/2020,06/04/2021,Not captured,Not captured,863949,020,00072,ARS-03-0055923,Essential America,Not captured,Not captured,Not captured,Passport(EC1138209),,,Lin,Baijun,,08/15/2003,female,Not captured,Not captured,Not captured,Not captured,Not captured,Not captured,Not captured,Not captured,Not captured,Not captured,Not captured,Not captured,Not captured,,,Not captured,Not captured,Not captured,Not captured,108 Austree Dr,,Columbia,South Carolina,29229,8034044015,,Not captured,Not captured,xbhuang4@gmail.com,Not captured,802048308,,Not captured,Not captured,Not captured,Not captured,Not captured,Not captured,
Not captured,Not captured,06/02/2020,07/08/2020,Not captured,Not captured,863949,020,00072,ARS-02-0055925,Beacon America,Not captured,Not captured,Not captured,,,,Samsonowitz,Maureen,,08/16/1955,female,Not captured,Not captured,Not captured,Not captured,Not captured,Not captured,Not captured,Not captured,Not captured,Not captured,Not captured,Not captured,Not captured,,,Not captured,Not captured,Not captured,Not captured,5 Shtruk,,Jerusalem,,9729824,,,Not captured,Not captured,hhstudio@netvision.net.il,Not captured,802048310,,Not captured,Not captured,Not captured,Not captured,Not captured,Not captured,
Not captured,Not captured,06/01/2020,07/10/2020,Not captured,Not captured,863949,020,00072,ARS-01-0055917,Beacon International,Not captured,Not captured,Not captured,,,,HNIN,HAY MAR,,12/08/1995,female,Not captured,Not captured,Not captured,Not captured,Not captured,Not captured,Not captured,Not captured,Not captured,Not captured,Not captured,Not captured,Not captured,MYAT SOE THET,Spouse,Not captured,Not captured,Not captured,Not captured,No.305 82nd Street,,Mandalay,Mandalay,909090,+1-9785255352,,Not captured,Not captured,nyisoethet@stenterprisellc.com,Not captured,802048302,,Not captured,Not captured,Not captured,Not captured,Not captured,Not captured,
Not captured,Not captured,06/01/2020,07/10/2020,Not captured,Not captured,863949,020,00072,ARS-01-0055916,Beacon International,Not captured,Not captured,Not captured,Passport(MC697409),,,THET,NYI SOE,,12/31/1993,male,Not captured,Not captured,Not captured,Not captured,Not captured,Not captured,Not captured,Not captured,Not captured,Not captured,Not captured,Not captured,Not captured,MYAT SOE THET,,Not captured,Not captured,Not captured,Not captured,No.305 82nd Street,,Mandalay,Mandalay,909090,+1-9785255352,,Not captured,Not captured,nyisoethet@stenterprisellc.com,Not captured,802048301,,Not captured,Not captured,Not captured,Not captured,Not captured,Not captured,
Not captured,Not captured,06/01/2020,07/10/2020,Not captured,Not captured,863949,020,00072,ARS-01-0055915,Beacon International,Not captured,Not captured,Not captured,,,,TIN,MAY THET,,05/05/1963,female,Not captured,Not captured,Not captured,Not captured,Not captured,Not captured,Not captured,Not captured,Not captured,Not captured,Not captured,Not captured,Not captured,NYI SOE THET,Spouse,Not captured,Not captured,Not captured,Not captured,No.305 82nd Street Between (28x29) Streets,,Mandalay,Mandalay,0909090,+1-9785255352,,Not captured,Not captured,nyisoethet@gmail.com,Not captured,802048300,,Not captured,Not captured,Not captured,Not captured,Not captured,Not captured,
Not captured,Not captured,06/01/2020,07/10/2020,Not captured,Not captured,863949,020,00072,ARS-01-0055914,Beacon International,Not captured,Not captured,Not captured,Passport(MD994042),,,THEIN,SOE,,02/19/1957,male,Not captured,Not captured,Not captured,Not captured,Not captured,Not captured,Not captured,Not captured,Not captured,Not captured,Not captured,Not captured,Not captured,NYI SOE THET,,Not captured,Not captured,Not captured,Not captured,No.305 82nd Street Between (28x29) Streets,,Mandalay,Mandalay,0909090,+1-9785255352,,Not captured,Not captured,nyisoethet@gmail.com,Not captured,802048299,,Not captured,Not captured,Not captured,Not captured,Not captured,Not captured,