EE Transaction Type,Dependent Transaction Type,Effective Date,EE Signature,EE Signature Date,Control,Suffix,Account,Plan Number,Plan Name,Claim Office,Network ID Number,Customer Code,EE SSN,Dependent SSN,Dependent Relationship,Last Name,First Name,Middle Initial,DOB,Gender,Ethnicity,PCP/PCD,PCP/PCD Current Patient,Provider Cap Office Number,COB,Dep Student Indicator,Dep OOA Indicator,EE Prior Coverage Indicator,EE Late Entrant,EE Language Indicator,Hire Date,Earnings,Earnings Frequency,Beneficiary (Last Name First Name MI),Beneficiary Relationship,Continuation of Coverage Expiration Date,Continuation of Coverage Event Date,Continuation of Coverage Length of Coverage,Work Location Zip Code,Street Address Line 1,Street Address Line 2,City,State,Zip Code,Home Phone Number,Work Phone Number,Accept Code,Evidence Code,EE Email Address,Communication Disability Code,EE Alternate ID,Dep Alternate ID,Old Control,Old Suffix,Old Account,New Control,New Suffix,New Account,
Not captured,Not captured,05/31/2020,Not captured,Not captured,863949,020,00072,ARS-02-0055896,Beacon America,Not captured,Not captured,Not captured,,,,Vereshchagina,Nataliia,,04/26/1952,female,Not captured,Not captured,Not captured,Not captured,Not captured,Not captured,Not captured,Not captured,Not captured,Not captured,Not captured,Not captured,Not captured,Galina Vereschagina,Spouse,Not captured,Not captured,Not captured,Not captured,Kustanayskaya 7 Apt 61,,Kiev,Kiev Oblast,03118,+1-3195414104,,Not captured,Not captured,galinav@asu.edu,Not captured,802048249,,Not captured,Not captured,Not captured,Not captured,Not captured,Not captured,
Not captured,Not captured,05/31/2020,Not captured,Not captured,863949,020,00072,ARS-02-0055895,Beacon America,Not captured,Not captured,Not captured,Passport(FX108280),,,Raspopov,Viktor,,01/17/1952,male,Not captured,Not captured,Not captured,Not captured,Not captured,Not captured,Not captured,Not captured,Not captured,Not captured,Not captured,Not captured,Not captured,Galina Vereschagina,,Not captured,Not captured,Not captured,Not captured,Kustanayskaya 7 Apt 61,,Kiev,Kiev Oblast,03118,+1-3195414104,,Not captured,Not captured,galinav@asu.edu,Not captured,802048248,,Not captured,Not captured,Not captured,Not captured,Not captured,Not captured,
Not captured,Not captured,05/30/2020,Not captured,Not captured,863949,020,00072,OVI-28-0055893,OverseasCare Visitors Insurance Plan,Not captured,Not captured,Not captured,Passport(M5151812),,,DESHINENI,SANDHYA RANI,,12/03/1968,male,Not captured,Not captured,Not captured,Not captured,Not captured,Not captured,Not captured,Not captured,Not captured,Not captured,Not captured,Not captured,Not captured,,,Not captured,Not captured,Not captured,Not captured,2200 Golden shoreshoe cir,,MORRISVILLE,North Carolina,27560,8459016597,,Not captured,Not captured,sreedharrao225@gmail.com,Not captured,802048246,,Not captured,Not captured,Not captured,Not captured,Not captured,Not captured,
Not captured,Not captured,05/29/2020,Not captured,Not captured,863949,020,00072,ARS-02-0055889,Beacon America,Not captured,Not captured,Not captured,Passport(529131430),,,DAWSON,BRONTE LAURA,,05/07/1994,female,Not captured,Not captured,Not captured,Not captured,Not captured,Not captured,Not captured,Not captured,Not captured,Not captured,Not captured,Not captured,Not captured,ELIZABETH CRISSY,,Not captured,Not captured,Not captured,Not captured,136 EARLS ROAD,,NUNEATON,England,CV115HP,+44-7572494131,,Not captured,Not captured,bronteldawson@gmail.com,Not captured,802048242,,Not captured,Not captured,Not captured,Not captured,Not captured,Not captured,
Not captured,Not captured,05/29/2020,Not captured,Not captured,863949,020,00072,ARS-01-0055888,Beacon International,Not captured,Not captured,Not captured,,,,Coleman,Duncan,,10/20/1997,male,Not captured,Not captured,Not captured,Not captured,Not captured,Not captured,Not captured,Not captured,Not captured,Not captured,Not captured,Not captured,Not captured,,,Not captured,Not captured,Not captured,Not captured,701 Peale road,,Wimberley,Texas,78676,,,Not captured,Not captured,duki1215@gmail.com,Not captured,802048241,,Not captured,Not captured,Not captured,Not captured,Not captured,Not captured,
Not captured,Not captured,05/29/2020,Not captured,Not captured,863949,020,00072,ARS-01-0055887,Beacon International,Not captured,Not captured,Not captured,,,,Bae,Jin Woo,,04/13/1999,male,Not captured,Not captured,Not captured,Not captured,Not captured,Not captured,Not captured,Not captured,Not captured,Not captured,Not captured,Not captured,Not captured,,,Not captured,Not captured,Not captured,Not captured,8840 Costa Verde Blvd.,,San Diego,California,92122,,,Not captured,Not captured,b2stdv@gmail.com,Not captured,802048240,,Not captured,Not captured,Not captured,Not captured,Not captured,Not captured,
Not captured,Not captured,05/28/2020,Not captured,Not captured,863949,020,00072,ARS-02-0055886,Beacon America,Not captured,Not captured,Not captured,,,,Flores,luz Abigail,,11/11/2011,female,Not captured,Not captured,Not captured,Not captured,Not captured,Not captured,Not captured,Not captured,Not captured,Not captured,Not captured,Not captured,Not captured,victor Flores mora,Dependent,Not captured,Not captured,Not captured,Not captured,coronado la coralia,,san jose,san jose,11862,+1-3213102165,,Not captured,Not captured,vaf77@hotmail.com,Not captured,802048239,,Not captured,Not captured,Not captured,Not captured,Not captured,Not captured,
Not captured,Not captured,05/28/2020,Not captured,Not captured,863949,020,00072,ARS-02-0055885,Beacon America,Not captured,Not captured,Not captured,,,,flores,vivian naomi,,04/09/2010,female,Not captured,Not captured,Not captured,Not captured,Not captured,Not captured,Not captured,Not captured,Not captured,Not captured,Not captured,Not captured,Not captured,victor Flores mora,Dependent,Not captured,Not captured,Not captured,Not captured,coronado la coralia,,san jose,san jose,11862,+1-3213102165,,Not captured,Not captured,vaf77@hotmail.com,Not captured,802048238,,Not captured,Not captured,Not captured,Not captured,Not captured,Not captured,
Not captured,Not captured,05/28/2020,Not captured,Not captured,863949,020,00072,ARS-02-0055884,Beacon America,Not captured,Not captured,Not captured,,,,Pereira,erika tatiana,,07/11/1989,female,Not captured,Not captured,Not captured,Not captured,Not captured,Not captured,Not captured,Not captured,Not captured,Not captured,Not captured,Not captured,Not captured,victor Flores mora,Spouse,Not captured,Not captured,Not captured,Not captured,coronado la coralia,,san jose,san jose,11862,+1-3213102165,,Not captured,Not captured,vaf77@hotmail.com,Not captured,802048237,,Not captured,Not captured,Not captured,Not captured,Not captured,Not captured,
Not captured,Not captured,05/28/2020,Not captured,Not captured,863949,020,00072,ARS-02-0055883,Beacon America,Not captured,Not captured,Not captured,Passport(112550982),,,Flores,victor,,10/12/1985,male,Not captured,Not captured,Not captured,Not captured,Not captured,Not captured,Not captured,Not captured,Not captured,Not captured,Not captured,Not captured,Not captured,victor Flores mora,,Not captured,Not captured,Not captured,Not captured,coronado la coralia,,san jose,san jose,11862,+1-3213102165,,Not captured,Not captured,vaf77@hotmail.com,Not captured,802048236,,Not captured,Not captured,Not captured,Not captured,Not captured,Not captured,
Not captured,Not captured,05/27/2020,Not captured,Not captured,863949,020,00072,ARS-02-0055880,Beacon America,Not captured,Not captured,Not captured,Passport(S2944691),,,kathirvel,visalakshi,,07/10/1963,female,Not captured,Not captured,Not captured,Not captured,Not captured,Not captured,Not captured,Not captured,Not captured,Not captured,Not captured,Not captured,Not captured,karthik kathirvel,,Not captured,Not captured,Not captured,Not captured,2c 6th west street kutty naicker layout,,coimbatore,TN,641015,+1-650680176,,Not captured,Not captured,kaykay72@gmail.com,Not captured,802048228,,Not captured,Not captured,Not captured,Not captured,Not captured,Not captured,
Not captured,Not captured,05/27/2020,Not captured,Not captured,863949,020,00072,ARS-03-0055866,Essential America,Not captured,Not captured,Not captured,Passport(L8738046),,,Nagarappu,Stephen,Rao,11/08/1987,male,Not captured,Not captured,Not captured,Not captured,Not captured,Not captured,Not captured,Not captured,Not captured,Not captured,Not captured,Not captured,Not captured,,,Not captured,Not captured,Not captured,Not captured,Krupa Nilaya 4th Cross,,Tumkur,Karnataka,572102,6789107026,,Not captured,Not captured,raostephen.sp@gmail.com,Not captured,802048190,,Not captured,Not captured,Not captured,Not captured,Not captured,Not captured,
Not captured,Not captured,05/27/2020,Not captured,Not captured,863949,020,00072,ARS-02-0055874,Beacon America,Not captured,Not captured,Not captured,Passport(A23408552),,,Refaat,Salsal Mohamed,,12/17/1954,female,Not captured,Not captured,Not captured,Not captured,Not captured,Not captured,Not captured,Not captured,Not captured,Not captured,Not captured,Not captured,Not captured,Hesham Darwish,,Not captured,Not captured,Not captured,Not captured,19 mohamed ghoneim helal,,Cairo,Cairo,11241,+1-9094859525,,Not captured,Not captured,hesham.darwish8@gmail.com,Not captured,802048221,,Not captured,Not captured,Not captured,Not captured,Not captured,Not captured,
Not captured,Not captured,05/27/2020,Not captured,Not captured,863949,020,00072,ARS-02-0055873,Beacon America,Not captured,Not captured,Not captured,,,,Pandey,Uma,,08/02/1962,female,Not captured,Not captured,Not captured,Not captured,Not captured,Not captured,Not captured,Not captured,Not captured,Not captured,Not captured,Not captured,Not captured,Sonali Pandey,Spouse,Not captured,Not captured,Not captured,Not captured,D19 Green Garden Estate,,Gwalior,MP,474002,+1-3343298042,,Not captured,Not captured,pandeyuma36@gmail.com,Not captured,802048220,,Not captured,Not captured,Not captured,Not captured,Not captured,Not captured,
Not captured,Not captured,05/27/2020,Not captured,Not captured,863949,020,00072,ARS-02-0055872,Beacon America,Not captured,Not captured,Not captured,Passport(T5821838),,,Pandey,Ashok Kumar,,11/14/1953,male,Not captured,Not captured,Not captured,Not captured,Not captured,Not captured,Not captured,Not captured,Not captured,Not captured,Not captured,Not captured,Not captured,Sonali Pandey,,Not captured,Not captured,Not captured,Not captured,D19 Green Garden Estate,,Gwalior,MP,474002,+1-3343298042,,Not captured,Not captured,pandeyuma36@gmail.com,Not captured,802048219,,Not captured,Not captured,Not captured,Not captured,Not captured,Not captured,
Not captured,Not captured,05/26/2020,Not captured,Not captured,863949,020,00072,ARS-02-0055867,Beacon America,Not captured,Not captured,Not captured,Passport(FU754274),,,Konar,Iryna,,09/23/2002,female,Not captured,Not captured,Not captured,Not captured,Not captured,Not captured,Not captured,Not captured,Not captured,Not captured,Not captured,Not captured,Not captured,Ambassadors of Fathers House Ministry,,Not captured,Not captured,Not captured,Not captured,118 Tsentralna Str.,,Kyivs'ka,oblast,08141,+1-3527451892,+1-3527451894,Not captured,Not captured,kristi@kojministries.org,Not captured,802048191,,Not captured,Not captured,Not captured,Not captured,Not captured,Not captured,
Not captured,Not captured,05/25/2020,Not captured,Not captured,863949,020,00072,ARS-02-0055864,Beacon America,Not captured,Not captured,Not captured,Passport(P6525571),,,Madurai Swaminathan,Saradha,,07/21/1968,female,Not captured,Not captured,Not captured,Not captured,Not captured,Not captured,Not captured,Not captured,Not captured,Not captured,Not captured,Not captured,Not captured,Sivapriya Suresh Pandian,,Not captured,Not captured,Not captured,Not captured,27 A VOC street,,Madurai,TN,625016,+1-2018842756,+1-8583719604,Not captured,Not captured,priyanit@yahoo.com,Not captured,802048186,,Not captured,Not captured,Not captured,Not captured,Not captured,Not captured,
Not captured,Not captured,05/25/2020,Not captured,Not captured,863949,020,00072,ARS-02-0055862,Beacon America,Not captured,Not captured,Not captured,Passport(m12408754),,,Park,Seohyun,,05/25/1990,female,Not captured,Not captured,Not captured,Not captured,Not captured,Not captured,Not captured,Not captured,Not captured,Not captured,Not captured,Not captured,Not captured,Kevin,Spouse,Not captured,Not captured,Not captured,Not captured,1114 NE 147th St,,Shoreline,,98155,4255050820,,Not captured,Not captured,minimel0525@gmail.com,Not captured,802048181,,Not captured,Not captured,Not captured,Not captured,Not captured,Not captured,
Not captured,Not captured,05/25/2020,Not captured,Not captured,863949,020,00072,ARS-02-0055861,Beacon America,Not captured,Not captured,Not captured,Passport(K3060391),,,Anandarathinam,Sureshpandian,,06/05/1963,male,Not captured,Not captured,Not captured,Not captured,Not captured,Not captured,Not captured,Not captured,Not captured,Not captured,Not captured,Not captured,Not captured,Sivapriya Suresh Pandian,,Not captured,Not captured,Not captured,Not captured,27 A VOC Street,,Madurai,TN,625016,+1-2018842756,+1-8583719604,Not captured,Not captured,priyanit@yahoo.com,Not captured,802048180,,Not captured,Not captured,Not captured,Not captured,Not captured,Not captured,
Not captured,Not captured,05/26/2020,Not captured,Not captured,863949,020,00072,ARS-02-0055860,Beacon America,Not captured,Not captured,Not captured,Passport(EB9251645),,,Yi,Yusheng,,11/21/1966,female,Not captured,Not captured,Not captured,Not captured,Not captured,Not captured,Not captured,Not captured,Not captured,Not captured,Not captured,Not captured,Not captured,Yilin Liu,,Not captured,Not captured,Not captured,Not captured,101 Building 18 Shenghuayuan Yuquan Rd.,,Baoji,Shaanxi,721006,+1-4803477084,+1-4803750108,Not captured,Not captured,leo_610@yahoo.com,Not captured,802048179,,Not captured,Not captured,Not captured,Not captured,Not captured,Not captured,
Not captured,Not captured,05/25/2020,Not captured,Not captured,863949,020,00072,ARS-02-0055859,Beacon America,Not captured,Not captured,Not captured,,,,Barry,Mark,,12/05/2006,male,Not captured,Not captured,Not captured,Not captured,Not captured,Not captured,Not captured,Not captured,Not captured,Not captured,Not captured,Not captured,Not captured,Brandon Rampersad,Dependent,Not captured,Not captured,Not captured,Not captured,2564,,Parsait Harmonie,Westbank Dmerara,0,+1-9292936750,,Not captured,Not captured,natasha.baksh03@icloud.com,Not captured,802048178,,Not captured,Not captured,Not captured,Not captured,Not captured,Not captured,
Not captured,Not captured,05/25/2020,Not captured,Not captured,863949,020,00072,ARS-02-0055858,Beacon America,Not captured,Not captured,Not captured,Passport(R0757722),,,Baksh,Natasha,,12/03/1988,female,Not captured,Not captured,Not captured,Not captured,Not captured,Not captured,Not captured,Not captured,Not captured,Not captured,Not captured,Not captured,Not captured,Brandon Rampersad,,Not captured,Not captured,Not captured,Not captured,2564,,Parsait Harmonie,Westbank Dmerara,0,+1-9292936750,,Not captured,Not captured,natasha.baksh03@icloud.com,Not captured,802048177,,Not captured,Not captured,Not captured,Not captured,Not captured,Not captured,
Not captured,Not captured,05/30/2020,Not captured,Not captured,863949,020,00072,ARS-01-0055856,Beacon International,Not captured,Not captured,Not captured,Passport(505540307),,,Plotnikova,Alexandra,,12/13/1994,female,Not captured,Not captured,Not captured,Not captured,Not captured,Not captured,Not captured,Not captured,Not captured,Not captured,Not captured,Not captured,Not captured,William Smith,,Not captured,Not captured,Not captured,Not captured,35 Seacoast Terrace,,New York,NY,11235,+1-3474581348,,Not captured,Not captured,aplotnikovap@gmail.com,Not captured,802048175,,Not captured,Not captured,Not captured,Not captured,Not captured,Not captured,
Not captured,Not captured,05/29/2020,Not captured,Not captured,863949,020,00072,ARS-01-0055854,Beacon International,Not captured,Not captured,Not captured,,,,Santos,Luciana,G,10/19/1969,female,Not captured,Not captured,Not captured,Not captured,Not captured,Not captured,Not captured,Not captured,Not captured,Not captured,Not captured,Not captured,Not captured,,,Not captured,Not captured,Not captured,Not captured,rua senador euzebio 14/702,,rio de janeiro,,22250-080,,,Not captured,Not captured,lugs06@yahoo.com.br,Not captured,802048173,,Not captured,Not captured,Not captured,Not captured,Not captured,Not captured,
Not captured,Not captured,05/25/2020,Not captured,Not captured,863949,020,00072,ARS-02-0055853,Beacon America,Not captured,Not captured,Not captured,Passport(PB1418015),,,Weng,Weiwen,,04/13/1993,male,Not captured,Not captured,Not captured,Not captured,Not captured,Not captured,Not captured,Not captured,Not captured,Not captured,Not captured,Not captured,Not captured,Katie E Kramer,Spouse,Not captured,Not captured,Not captured,Not captured,2211 W Germann Road,,Chandler,Arizona,85286,9282875427,,Not captured,Not captured,weiwenweng93@gmail.com,Not captured,802048172,,Not captured,Not captured,Not captured,Not captured,Not captured,Not captured,
Not captured,Not captured,05/24/2020,Not captured,Not captured,863949,020,00072,ARS-02-0055851,Beacon America,Not captured,Not captured,Not captured,Passport(K8299812),,,Jayaraman,Santha,,12/02/1960,female,Not captured,Not captured,Not captured,Not captured,Not captured,Not captured,Not captured,Not captured,Not captured,Not captured,Not captured,Not captured,Not captured,Magesh Jayaraman,,Not captured,Not captured,Not captured,Not captured,16 Chithirai Veethi s.m. Nagar post,,Chennai,Texas,600062,+1-2144752925,,Not captured,Not captured,sankara.l@gmail.com,Not captured,802048170,,Not captured,Not captured,Not captured,Not captured,Not captured,Not captured,
Not captured,Not captured,05/23/2020,Not captured,Not captured,863949,020,00072,ARS-02-0055849,Beacon America,Not captured,Not captured,Not captured,Passport(T4583240),,,Ramaswamy,Geethamoni,,10/09/1962,female,Not captured,Not captured,Not captured,Not captured,Not captured,Not captured,Not captured,Not captured,Not captured,Not captured,Not captured,Not captured,Not captured,Saipriya Ramaswamy,,Not captured,Not captured,Not captured,Not captured,32 Ganesh Nagar 3rd Street,,Coimbatore,TN,641029,+1-6263904588,+1-6263904588,Not captured,Not captured,sai_ramu@ymail.com,Not captured,802048168,,Not captured,Not captured,Not captured,Not captured,Not captured,Not captured,
Not captured,Not captured,05/26/2020,Not captured,Not captured,863949,020,00072,ARS-01-0055848,Beacon International,Not captured,Not captured,Not captured,,,,Cliff-Burns,David,,03/30/1989,male,Not captured,Not captured,Not captured,Not captured,Not captured,Not captured,Not captured,Not captured,Not captured,Not captured,Not captured,Not captured,Not captured,,,Not captured,Not captured,Not captured,Not captured,550 West 54th Street,,New York,New York,10019,,,Not captured,Not captured,dclift@gmail.com,Not captured,802048167,,Not captured,Not captured,Not captured,Not captured,Not captured,Not captured,
Not captured,Not captured,05/26/2020,Not captured,Not captured,863949,020,00072,ARS-01-0055847,Beacon International,Not captured,Not captured,Not captured,,,,Clift-Burns,Beatrice,,02/05/2016,female,Not captured,Not captured,Not captured,Not captured,Not captured,Not captured,Not captured,Not captured,Not captured,Not captured,Not captured,Not captured,Not captured,,,Not captured,Not captured,Not captured,Not captured,550 West 54th Street,,New York,New York,10019,,,Not captured,Not captured,charlotteburns@gmail.com,Not captured,802048166,,Not captured,Not captured,Not captured,Not captured,Not captured,Not captured,
Not captured,Not captured,05/26/2020,Not captured,Not captured,863949,020,00072,ARS-01-0055846,Beacon International,Not captured,Not captured,Not captured,,,,Burns,Charlotte,,03/27/1981,female,Not captured,Not captured,Not captured,Not captured,Not captured,Not captured,Not captured,Not captured,Not captured,Not captured,Not captured,Not captured,Not captured,,,Not captured,Not captured,Not captured,Not captured,550 West 54th Street,,New York,New York,10019,,,Not captured,Not captured,charlotteburns@gmail.com,Not captured,802048165,,Not captured,Not captured,Not captured,Not captured,Not captured,Not captured,
Not captured,Not captured,05/23/2020,Not captured,Not captured,863949,020,00072,ARS-01-0055845,Beacon International,Not captured,Not captured,Not captured,,,,Koscica,Tomislav,,06/09/1957,male,Not captured,Not captured,Not captured,Not captured,Not captured,Not captured,Not captured,Not captured,Not captured,Not captured,Not captured,Not captured,Not captured,,,Not captured,Not captured,Not captured,Not captured,199 08 32ave apt 2f,,Flushing,New York,11358,,,Not captured,Not captured,antekoscica@gmail.com,Not captured,802048164,,Not captured,Not captured,Not captured,Not captured,Not captured,Not captured,
Not captured,Not captured,05/25/2020,Not captured,Not captured,863949,020,00072,ARS-01-0055844,Beacon International,Not captured,Not captured,Not captured,Passport(AD934556),,,STOWELL,TIMOTHY ANGUS,,11/15/1954,male,Not captured,Not captured,Not captured,Not captured,Not captured,Not captured,Not captured,Not captured,Not captured,Not captured,Not captured,Not captured,Not captured,HARALD FANZLER,,Not captured,Not captured,Not captured,Not captured,2530 GREENVALLEY ROAD,,LOS ANGELES,CA,90046,+1-3236565648,+1-3233015304,Not captured,Not captured,stowell@humnet.ucla.edu,Not captured,802048163,,Not captured,Not captured,Not captured,Not captured,Not captured,Not captured,
Not captured,Not captured,05/23/2020,Not captured,Not captured,863949,020,00072,OVI-42-0055842,Overseas Visitors Insurance Plan B,Not captured,Not captured,Not captured,,,,Sunkesula,Syamala,Prasad,01/10/1949,female,Not captured,Not captured,Not captured,Not captured,Not captured,Not captured,Not captured,Not captured,Not captured,Not captured,Not captured,Not captured,Not captured,Pawan Sunkesula,Son,Not captured,Not captured,Not captured,Not captured,180 Brook Hill Lane,,Vernon Hills,Illinois,60061,224-275-5215,,Not captured,Not captured,pawan.sunkesula@gmail.com,Not captured,802048161,,Not captured,Not captured,Not captured,Not captured,Not captured,Not captured,
Not captured,Not captured,05/27/2020,Not captured,Not captured,863949,020,00072,ARS-02-0055841,Beacon America,Not captured,Not captured,Not captured,,,,TARANTINO,SILVANA,,10/12/1960,female,Not captured,Not captured,Not captured,Not captured,Not captured,Not captured,Not captured,Not captured,Not captured,Not captured,Not captured,Not captured,Not captured,sherry cok,sibling,Not captured,Not captured,Not captured,Not captured,2351 WOODFIELD RD,,OAKVILLE,Ontario,L6H6Y6,9052572177,,Not captured,Not captured,zsimo@cogeco.ca,Not captured,802048160,,Not captured,Not captured,Not captured,Not captured,Not captured,Not captured,
Not captured,Not captured,05/27/2020,Not captured,Not captured,863949,020,00072,ARS-02-0055840,Beacon America,Not captured,Not captured,Not captured,Passport(NA),,,SIMO,ZOLTAN,,09/22/1961,male,Not captured,Not captured,Not captured,Not captured,Not captured,Not captured,Not captured,Not captured,Not captured,Not captured,Not captured,Not captured,Not captured,sherry cok,sibling,Not captured,Not captured,Not captured,Not captured,2351 WOODFIELD RD,,OAKVILLE,Ontario,L6H6Y6,9052572177,,Not captured,Not captured,zsimo@cogeco.ca,Not captured,802048159,,Not captured,Not captured,Not captured,Not captured,Not captured,Not captured,