EE Transaction Type,Dependent Transaction Type,Effective Date,EE Signature,EE Signature Date,Control,Suffix,Account,Plan Number,Plan Name,Claim Office,Network ID Number,Customer Code,EE SSN,Dependent SSN,Dependent Relationship,Last Name,First Name,Middle Initial,DOB,Gender,Ethnicity,PCP/PCD,PCP/PCD Current Patient,Provider Cap Office Number,COB,Dep Student Indicator,Dep OOA Indicator,EE Prior Coverage Indicator,EE Late Entrant,EE Language Indicator,Hire Date,Earnings,Earnings Frequency,Beneficiary (Last Name First Name MI),Beneficiary Relationship,Continuation of Coverage Expiration Date,Continuation of Coverage Event Date,Continuation of Coverage Length of Coverage,Work Location Zip Code,Street Address Line 1,Street Address Line 2,City,State,Zip Code,Home Phone Number,Work Phone Number,Accept Code,Evidence Code,EE Email Address,Communication Disability Code,EE Alternate ID,Dep Alternate ID,Old Control,Old Suffix,Old Account,New Control,New Suffix,New Account,
Not captured,Not captured,05/23/2020,Not captured,Not captured,863949,020,00072,ARS-02-0055849,Beacon America,Not captured,Not captured,Not captured,Passport(T4583240),,,Ramaswamy,Geethamoni,,10/09/1962,female,Not captured,Not captured,Not captured,Not captured,Not captured,Not captured,Not captured,Not captured,Not captured,Not captured,Not captured,Not captured,Not captured,Saipriya Ramaswamy,,Not captured,Not captured,Not captured,Not captured,32 Ganesh Nagar 3rd Street,,Coimbatore,TN,641029,+1-6263904588,+1-6263904588,Not captured,Not captured,sai_ramu@ymail.com,Not captured,802048168,,Not captured,Not captured,Not captured,Not captured,Not captured,Not captured,
Not captured,Not captured,05/23/2020,Not captured,Not captured,863949,020,00072,ARS-01-0055845,Beacon International,Not captured,Not captured,Not captured,,,,Koscica,Tomislav,,06/09/1957,male,Not captured,Not captured,Not captured,Not captured,Not captured,Not captured,Not captured,Not captured,Not captured,Not captured,Not captured,Not captured,Not captured,,,Not captured,Not captured,Not captured,Not captured,199 08 32ave apt 2f,,Flushing,New York,11358,,,Not captured,Not captured,antekoscica@gmail.com,Not captured,802048164,,Not captured,Not captured,Not captured,Not captured,Not captured,Not captured,
Not captured,Not captured,05/23/2020,Not captured,Not captured,863949,020,00072,OVI-42-0055842,Overseas Visitors Insurance Plan B,Not captured,Not captured,Not captured,,,,Sunkesula,Syamala,Prasad,01/10/1949,female,Not captured,Not captured,Not captured,Not captured,Not captured,Not captured,Not captured,Not captured,Not captured,Not captured,Not captured,Not captured,Not captured,Pawan Sunkesula,Son,Not captured,Not captured,Not captured,Not captured,180 Brook Hill Lane,,Vernon Hills,Illinois,60061,224-275-5215,,Not captured,Not captured,pawan.sunkesula@gmail.com,Not captured,802048161,,Not captured,Not captured,Not captured,Not captured,Not captured,Not captured,
Not captured,Not captured,05/23/2020,Not captured,Not captured,863949,020,00072,ARS-02-0055838,Beacon America,Not captured,Not captured,Not captured,Passport(Z4996494),,,Mantha,SriKrishnaSarma,,06/21/1961,male,Not captured,Not captured,Not captured,Not captured,Not captured,Not captured,Not captured,Not captured,Not captured,Not captured,Not captured,Not captured,Not captured,Satyadevi Mantha,,Not captured,Not captured,Not captured,Not captured,Villa 10 Al Talay street,,Dubai,UAE,52288,+971-504594490,,Not captured,Not captured,msk_sarma@yahoo.com,Not captured,802048157,,Not captured,Not captured,Not captured,Not captured,Not captured,Not captured,
Not captured,Not captured,05/23/2020,Not captured,Not captured,863949,020,00072,ARS-02-0055837,Beacon America,Not captured,Not captured,Not captured,Passport(Z3066245),,,Mantha,Satyadevi,,08/29/1967,female,Not captured,Not captured,Not captured,Not captured,Not captured,Not captured,Not captured,Not captured,Not captured,Not captured,Not captured,Not captured,Not captured,SriKrishnaSarmaMantha,,Not captured,Not captured,Not captured,Not captured,Villa 10 Al Talay street,,Dubai,UAE,52288,+971-504594490,,Not captured,Not captured,msk_sarma@yahoo.com,Not captured,802048156,,Not captured,Not captured,Not captured,Not captured,Not captured,Not captured,
Not captured,Not captured,05/22/2020,Not captured,Not captured,863949,020,00072,ARS-01-0055836,Beacon International,Not captured,Not captured,Not captured,Passport(481107424),,,Rayle,Victoria,,06/23/1989,female,Not captured,Not captured,Not captured,Not captured,Not captured,Not captured,Not captured,Not captured,Not captured,Not captured,Not captured,Not captured,Not captured,Sharon Rayle,Mother,Not captured,Not captured,Not captured,Not captured,9335 Altwood Dr.,,Affton,Missouri,63123,50941015003,5743987724,Not captured,Not captured,tori.rayle@gmail.com,Not captured,802048155,,Not captured,Not captured,Not captured,Not captured,Not captured,Not captured,
Not captured,Not captured,05/21/2020,Not captured,Not captured,863949,020,00072,ARS-03-0055745,Essential America,Not captured,Not captured,Not captured,Passport(00000000000),,,Herbert,Zamirah,Serenity,04/17/2020,female,Not captured,Not captured,Not captured,Not captured,Not captured,Not captured,Not captured,Not captured,Not captured,Not captured,Not captured,Not captured,Not captured,,,Not captured,Not captured,Not captured,Not captured,PO Box 1425,,Half Moon,Frigate Bay,00000,9542517025,,Not captured,Not captured,rherbertthompson@gmail.com,Not captured,802048042,,Not captured,Not captured,Not captured,Not captured,Not captured,Not captured,
Not captured,Not captured,05/22/2020,Not captured,Not captured,863949,020,00072,ARS-02-0055835,Beacon America,Not captured,Not captured,Not captured,Passport(M7903271),,,Singh,Narinder,,06/10/1979,male,Not captured,Not captured,Not captured,Not captured,Not captured,Not captured,Not captured,Not captured,Not captured,Not captured,Not captured,Not captured,Not captured,Rekha Devi,,Not captured,Not captured,Not captured,Not captured,Village Bibipur,,Kurukshetra,HR,136135,+1-5188881744,,Not captured,Not captured,romey8@gmail.com,Not captured,802048153,,Not captured,Not captured,Not captured,Not captured,Not captured,Not captured,
Not captured,Not captured,05/23/2020,Not captured,Not captured,863949,020,00072,ARS-02-0055833,Beacon America,Not captured,Not captured,Not captured,Passport(24511936),,,Grusauskas,Martynas,,06/28/1991,male,Not captured,Not captured,Not captured,Not captured,Not captured,Not captured,Not captured,Not captured,Not captured,Not captured,Not captured,Not captured,Not captured,Daina Grusauskiene,,Not captured,Not captured,Not captured,Not captured,Pramones pr. 75-51,,Kaunas,Kaunas,50390,+1-63024787,,Not captured,Not captured,martynasgrusauskas@gmail.com,Not captured,802048151,,Not captured,Not captured,Not captured,Not captured,Not captured,Not captured,
Not captured,Not captured,05/20/2020,Not captured,Not captured,863949,020,00072,ARS-02-0055831,Beacon America,Not captured,Not captured,Not captured,Passport(AR178733),,,CELY ARANGUREN,JESSICA MARIA,,09/30/1992,female,Not captured,Not captured,Not captured,Not captured,Not captured,Not captured,Not captured,Not captured,Not captured,Not captured,Not captured,Not captured,Not captured,AMALIA ARANGUREN,,Not captured,Not captured,Not captured,Not captured,CARRERA 13 # 146 - 26,,BOGOTA,BOG,110111,+1-6104847370,,Not captured,Not captured,jessicabog20@gmail.com,Not captured,802048148,,Not captured,Not captured,Not captured,Not captured,Not captured,Not captured,
Not captured,Not captured,05/19/2020,Not captured,Not captured,863949,020,00072,ARS-03-0055820,Essential America,Not captured,Not captured,Not captured,SSN(945-96-8971),,,Yu,Yaling,,11/29/1987,female,Not captured,Not captured,Not captured,Not captured,Not captured,Not captured,Not captured,Not captured,Not captured,Not captured,Not captured,Not captured,Not captured,,,Not captured,Not captured,Not captured,Not captured,905 E Meadowlark St,,Springfield,Missouri,65810,4178395262,,Not captured,Not captured,templeesq@sbcglobal.net,Not captured,802048133,,Not captured,Not captured,Not captured,Not captured,Not captured,Not captured,
Not captured,Not captured,05/19/2020,Not captured,Not captured,863949,020,00072,ARS-03-0055820,Essential America,Not captured,Not captured,Not captured,,Passport(Pending),Dependant,Temple,Isaac,Owen,02/13/2020,male,Not captured,Not captured,Not captured,Not captured,Not captured,Not captured,Not captured,Not captured,Not captured,Not captured,Not captured,Not captured,Not captured,,,Not captured,Not captured,Not captured,Not captured,905 E Meadowlark St,,Springfield,Missouri,65810,4178395262,,Not captured,Not captured,templeesq@sbcglobal.net,Not captured,,802048134,Not captured,Not captured,Not captured,Not captured,Not captured,Not captured,
Not captured,Not captured,05/20/2020,Not captured,Not captured,863949,020,00072,ARS-02-0055828,Beacon America,Not captured,Not captured,Not captured,Passport(33968134),,,Raviv,Maayan,,07/30/1990,female,Not captured,Not captured,Not captured,Not captured,Not captured,Not captured,Not captured,Not captured,Not captured,Not captured,Not captured,Not captured,Not captured,Miriam Raviv,,Not captured,Not captured,Not captured,Not captured,Professor Efrayim Katzir #21,,Rehovot,Central Isreal,7637723,+1-6466197574,,Not captured,Not captured,maayan3007@gmail.com,Not captured,802048144,,Not captured,Not captured,Not captured,Not captured,Not captured,Not captured,
Not captured,Not captured,05/19/2020,Not captured,Not captured,863949,020,00072,ARS-02-0055826,Beacon America,Not captured,Not captured,Not captured,,,,JOSHI,rama,,06/01/1943,female,Not captured,Not captured,Not captured,Not captured,Not captured,Not captured,Not captured,Not captured,Not captured,Not captured,Not captured,Not captured,Not captured,ASHISH JOSHI,SON,Not captured,Not captured,Not captured,Not captured,33 lavender dr,,edison,New Jersey,08820,4435706018,,Not captured,Not captured,ASHISH1875@GMAIL.COM,Not captured,802048142,,Not captured,Not captured,Not captured,Not captured,Not captured,Not captured,
Not captured,Not captured,05/18/2020,Not captured,Not captured,863949,020,00072,ARS-02-0055824,Beacon America,Not captured,Not captured,Not captured,Passport(T473397),,,Vora,Darshini,,08/17/1992,female,Not captured,Not captured,Not captured,Not captured,Not captured,Not captured,Not captured,Not captured,Not captured,Not captured,Not captured,Not captured,Not captured,Neha Vora,,Not captured,Not captured,Not captured,Not captured,505/ Building no 3 Raheja Classique,,Mumbai,MH,400053,+1-6099680624,,Not captured,Not captured,voradarshini17@gmail.com,Not captured,802048138,,Not captured,Not captured,Not captured,Not captured,Not captured,Not captured,
Not captured,Not captured,05/18/2020,Not captured,Not captured,863949,020,00072,ARS-36-0055822,Beacon Student Elite,Not captured,Not captured,Not captured,Passport(066392185),,,Rivero Pena,Wendy ,C,11/11/1993,female,Not captured,Not captured,Not captured,Not captured,Not captured,Not captured,Not captured,Not captured,Not captured,Not captured,Not captured,Not captured,Not captured,Wilfredo Rivero,Father,Not captured,Not captured,Not captured,Not captured,Urb. Monte Claro. Sector L Casa L-14.,,Maracaibo,Zulia,4005,4065805439,,Not captured,Not captured,wcrivero@ncsu.edu,Not captured,802048136,,Not captured,Not captured,Not captured,Not captured,Not captured,Not captured,
Not captured,Not captured,05/18/2020,Not captured,Not captured,863949,020,00072,ARS-02-0055819,Beacon America,Not captured,Not captured,Not captured,Passport(EJ0363260),,,Zhang,Ling,,12/24/1964,female,Not captured,Not captured,Not captured,Not captured,Not captured,Not captured,Not captured,Not captured,Not captured,Not captured,Not captured,Not captured,Not captured,Da Shen,,Not captured,Not captured,Not captured,Not captured,Xishidajie Gedoaoguli,,Tianjin,Tianjin,300102,+1-2056573243,,Not captured,Not captured,ds4905@nyu.edu,Not captured,802048132,,Not captured,Not captured,Not captured,Not captured,Not captured,Not captured,
Not captured,Not captured,05/18/2020,Not captured,Not captured,863949,020,00072,OVI-42-0055818,Overseas Visitors Insurance Plan B,Not captured,Not captured,Not captured,Passport(L8438084),,,SHAH,MADHURI,H,03/02/1954,female,Not captured,Not captured,Not captured,Not captured,Not captured,Not captured,Not captured,Not captured,Not captured,Not captured,Not captured,Not captured,Not captured,Kalpesh Harendra Shah,Son,Not captured,Not captured,Not captured,Not captured,8537 Sandpiper Ridge Ave,,Tampa,Florida,33647,+1-813-943-1007,,Not captured,Not captured,kalpeshmail@gmail.com,Not captured,802048131,,Not captured,Not captured,Not captured,Not captured,Not captured,Not captured,
Not captured,Not captured,05/18/2020,Not captured,Not captured,863949,020,00072,OVI-42-0055817,Overseas Visitors Insurance Plan B,Not captured,Not captured,Not captured,Passport(L9723625),,,SHAH,HARENDRA,B,03/10/1949,male,Not captured,Not captured,Not captured,Not captured,Not captured,Not captured,Not captured,Not captured,Not captured,Not captured,Not captured,Not captured,Not captured,Kalpesh Harendra Shah,Son,Not captured,Not captured,Not captured,Not captured,8537 Sandpiper Ridge Ave,,Tampa,Florida,33647,+1-813-943-1007,,Not captured,Not captured,kalpeshmail@gmail.com,Not captured,802048130,,Not captured,Not captured,Not captured,Not captured,Not captured,Not captured,
Not captured,Not captured,05/18/2020,Not captured,Not captured,863949,020,00072,ARS-02-0055816,Beacon America,Not captured,Not captured,Not captured,Passport(R9126765),,,Ramasamy,Pasupathy,,08/11/1964,male,Not captured,Not captured,Not captured,Not captured,Not captured,Not captured,Not captured,Not captured,Not captured,Not captured,Not captured,Not captured,Not captured,Tryphena Pasupathy,,Not captured,Not captured,Not captured,Not captured,AP 529 4th Street I - Block,,Chennai,TN,600040,+91-9444359185,,Not captured,Not captured,vikashraja2006@yahoo.com,Not captured,802048129,,Not captured,Not captured,Not captured,Not captured,Not captured,Not captured,
Not captured,Not captured,05/17/2020,Not captured,Not captured,863949,020,00072,ARS-02-0055813,Beacon America,Not captured,Not captured,Not captured,Passport(C2910974),,,Hoang,Trang Thu,,06/11/1984,female,Not captured,Not captured,Not captured,Not captured,Not captured,Not captured,Not captured,Not captured,Not captured,Not captured,Not captured,Not captured,Not captured,Dennis Francis Smith,,Not captured,Not captured,Not captured,Not captured,Apt 205 Block D15 Dang Xa Commune Gia Lam district,,Ha Noi,Hanoi,100000,+1-8455580372,+84-936180225,Not captured,Not captured,hoangtrangwiha@gmail.com,Not captured,802048126,,Not captured,Not captured,Not captured,Not captured,Not captured,Not captured,
Not captured,Not captured,05/16/2020,Not captured,Not captured,863949,020,00072,ARS-02-0055811,Beacon America,Not captured,Not captured,Not captured,Passport(T3991840),,,Hangekar,Tanwi Rohan,,12/31/1989,female,Not captured,Not captured,Not captured,Not captured,Not captured,Not captured,Not captured,Not captured,Not captured,Not captured,Not captured,Not captured,Not captured,Rohan C Hangekar,,Not captured,Not captured,Not captured,Not captured,457 Plains Road East,,Burlington,ON,L7T0B8,+1-9192748560,+1-4166174094,Not captured,Not captured,tanwikulkarni@gmail.com,Not captured,802048124,,Not captured,Not captured,Not captured,Not captured,Not captured,Not captured,
Not captured,Not captured,05/15/2020,Not captured,Not captured,863949,020,00072,ARS-02-0055810,Beacon America,Not captured,Not captured,Not captured,Passport(AC3483816),,,Shakieva,Darazhan,,05/14/1958,female,Not captured,Not captured,Not captured,Not captured,Not captured,Not captured,Not captured,Not captured,Not captured,Not captured,Not captured,Not captured,Not captured,Nursultan Uzakbaev,,Not captured,Not captured,Not captured,Not captured,72 Kurulush st,,Bishkek,N/A,720015,+1-5104231739,,Not captured,Not captured,uzakbaev@gmail.com,Not captured,802048123,,Not captured,Not captured,Not captured,Not captured,Not captured,Not captured,
Not captured,Not captured,05/15/2020,Not captured,Not captured,863949,020,00072,OVI-42-0055809,Overseas Visitors Insurance Plan B,Not captured,Not captured,Not captured,Passport(J4978472),,,Hemdev,Nirmala,,02/26/1954,female,Not captured,Not captured,Not captured,Not captured,Not captured,Not captured,Not captured,Not captured,Not captured,Not captured,Not captured,Not captured,Not captured,Shweta Hemdev,Child,Not captured,Not captured,Not captured,Not captured,Shweta Hemdev,,Sunnyvale,California,94086,5106765037,,Not captured,Not captured,piks1987@gmail.com,Not captured,802048122,,Not captured,Not captured,Not captured,Not captured,Not captured,Not captured,
Not captured,Not captured,05/15/2020,Not captured,Not captured,863949,020,00072,ARS-03-0055796,Essential International,Not captured,Not captured,Not captured,Passport(NA),,,MEINHARDT,RAYMOND,,03/12/1965,male,Not captured,Not captured,Not captured,Not captured,Not captured,Not captured,Not captured,Not captured,Not captured,Not captured,Not captured,Not captured,Not captured,,,Not captured,Not captured,Not captured,Not captured,8424 ENGLAND ST,,OVERLAND PARK,Kansas,66214,8169824822,,Not captured,Not captured,smeinhardt@live.com,Not captured,802048105,,Not captured,Not captured,Not captured,Not captured,Not captured,Not captured,
Not captured,Not captured,05/15/2020,Not captured,Not captured,863949,020,00072,ARS-03-0055796,Essential International,Not captured,Not captured,Not captured,,Passport(NA),Dependant,MEINHARDT,MACIE,,11/30/2001,female,Not captured,Not captured,Not captured,Not captured,Not captured,Not captured,Not captured,Not captured,Not captured,Not captured,Not captured,Not captured,Not captured,,,Not captured,Not captured,Not captured,Not captured,8424 ENGLAND ST,,OVERLAND PARK,Kansas,66214,8169824822,,Not captured,Not captured,smeinhardt@live.com,Not captured,,802048106,Not captured,Not captured,Not captured,Not captured,Not captured,Not captured,
Not captured,Not captured,05/15/2020,Not captured,Not captured,863949,020,00072,ARS-02-0055807,Beacon America,Not captured,Not captured,Not captured,,,,Sun,Guojing,,04/24/1951,female,Not captured,Not captured,Not captured,Not captured,Not captured,Not captured,Not captured,Not captured,Not captured,Not captured,Not captured,Not captured,Not captured,Tianyu Yang,Daughter in law,Not captured,Not captured,Not captured,Not captured,229 Shelley Ave,,Campbell,California,95008,4136588724,,Not captured,Not captured,tyang.yty@gmail.com,Not captured,802048120,,Not captured,Not captured,Not captured,Not captured,Not captured,Not captured,
Not captured,Not captured,05/15/2020,Not captured,Not captured,863949,020,00072,ARS-02-0055806,Beacon America,Not captured,Not captured,Not captured,,,,Yin,Ke,,02/01/1952,male,Not captured,Not captured,Not captured,Not captured,Not captured,Not captured,Not captured,Not captured,Not captured,Not captured,Not captured,Not captured,Not captured,Tianyu Yang,Daughter in law,Not captured,Not captured,Not captured,Not captured,229 Shelley Ave,,Campbell,California,95008,4136588724,,Not captured,Not captured,tyang.yty@gmail.com,Not captured,802048119,,Not captured,Not captured,Not captured,Not captured,Not captured,Not captured,
Not captured,Not captured,05/15/2020,Not captured,Not captured,863949,020,00072,ARS-02-0055805,Beacon America,Not captured,Not captured,Not captured,,,,WU WU,HAO JUN,,02/04/2011,male,Not captured,Not captured,Not captured,Not captured,Not captured,Not captured,Not captured,Not captured,Not captured,Not captured,Not captured,Not captured,Not captured,Kuang lianying,Dependent,Not captured,Not captured,Not captured,Not captured,Caicara del orinoco borivar Venezuela,,Caicara,Borivar,5007,+1-6465329437,+1-6465770946,Not captured,Not captured,jiaqiwu123@outlook.com,Not captured,802048118,,Not captured,Not captured,Not captured,Not captured,Not captured,Not captured,
Not captured,Not captured,05/15/2020,Not captured,Not captured,863949,020,00072,ARS-02-0055804,Beacon America,Not captured,Not captured,Not captured,,,,WU WU,JIA QI,,05/23/2013,female,Not captured,Not captured,Not captured,Not captured,Not captured,Not captured,Not captured,Not captured,Not captured,Not captured,Not captured,Not captured,Not captured,Kuang lianying,Dependent,Not captured,Not captured,Not captured,Not captured,Caicara del orinoco borivar Venezuela,,Caicara,Borivar,5007,+1-6465329437,+1-6465770946,Not captured,Not captured,jiaqiwu123@outlook.com,Not captured,802048117,,Not captured,Not captured,Not captured,Not captured,Not captured,Not captured,
Not captured,Not captured,05/15/2020,Not captured,Not captured,863949,020,00072,ARS-02-0055803,Beacon America,Not captured,Not captured,Not captured,Passport(G52543322),,,Wu,Xiaomin,,02/14/1988,female,Not captured,Not captured,Not captured,Not captured,Not captured,Not captured,Not captured,Not captured,Not captured,Not captured,Not captured,Not captured,Not captured,Kuang lianying,,Not captured,Not captured,Not captured,Not captured,Caicara del orinoco borivar Venezuela,,Caicara,Borivar,5007,+1-6465329437,+1-6465770946,Not captured,Not captured,jiaqiwu123@outlook.com,Not captured,802048116,,Not captured,Not captured,Not captured,Not captured,Not captured,Not captured,
Not captured,Not captured,05/18/2020,Not captured,Not captured,863949,020,00072,ARS-02-0055802,Beacon America,Not captured,Not captured,Not captured,,,,Grussgut,Emanuel,,09/16/1999,male,Not captured,Not captured,Not captured,Not captured,Not captured,Not captured,Not captured,Not captured,Not captured,Not captured,Not captured,Not captured,Not captured,Mrs. Grussgut,Mother,Not captured,Not captured,Not captured,Not captured,1868-53,,brooklyn,new york,11204,9178536501,,Not captured,Not captured,malkafurst@optonline.net,Not captured,802048115,,Not captured,Not captured,Not captured,Not captured,Not captured,Not captured,
Not captured,Not captured,05/14/2020,Not captured,Not captured,863949,020,00072,ARS-01-0055801,Beacon International,Not captured,Not captured,Not captured,Passport(533721652),,,Ghahramani,Adam,,04/30/1983,male,Not captured,Not captured,Not captured,Not captured,Not captured,Not captured,Not captured,Not captured,Not captured,Not captured,Not captured,Not captured,Not captured,Saeed Ghahramani,Father,Not captured,Not captured,Not captured,Not captured,400 E 71st Street APT 14S,,New York,New York,10021,14134272456,,Not captured,Not captured,adamgha@gmial.com,Not captured,802048114,,Not captured,Not captured,Not captured,Not captured,Not captured,Not captured,
Not captured,Not captured,05/15/2020,Not captured,Not captured,863949,020,00072,ARS-01-0055798,Beacon International,Not captured,Not captured,Not captured,Passport(CF0YT4278),,,Leitner,Sarah,,02/14/1996,female,Not captured,Not captured,Not captured,Not captured,Not captured,Not captured,Not captured,Not captured,Not captured,Not captured,Not captured,Not captured,Not captured,Birgit Leitner,,Not captured,Not captured,Not captured,Not captured,Schumannweg 2,,Rosenheim,Bavaria,83024,+971-505405997,,Not captured,Not captured,lei_sarah@yahoo.de,Not captured,802048109,,Not captured,Not captured,Not captured,Not captured,Not captured,Not captured,
Not captured,Not captured,05/13/2020,Not captured,Not captured,863949,020,00072,ARS-01-0055794,Beacon International,Not captured,Not captured,Not captured,,,,Shin,Erin,J,01/01/2000,female,Not captured,Not captured,Not captured,Not captured,Not captured,Not captured,Not captured,Not captured,Not captured,Not captured,Not captured,Not captured,Not captured,,,Not captured,Not captured,Not captured,Not captured,18991 E Pinewood DR,,Aurora,Colorado,80016,,,Not captured,Not captured,wowshin@hotmail.com,Not captured,802048100,,Not captured,Not captured,Not captured,Not captured,Not captured,Not captured,